You are viewing a plain text version of this content. The canonical link for it is here.
Posted to dev@pdfbox.apache.org by Apache Jenkins Server <je...@builds.apache.org> on 2026/04/16 16:26:35 UTC
Build failed in Jenkins: PDFBox » PDFBox JBig2 ImageIO Plugin » PDFBox JBIG2 ImageIO plugin #100
See <https://ci-builds.apache.org/job/PDFBox/job/PDFBox%20JBig2%20ImageIO%20Plugin/org.apache.pdfbox$jbig2-imageio/100/display/redirect?page=changes>
Changes:
[Maruan Sahyoun] PDFBOX-6155: fix AT override check; enable failing test file
------------------------------------------
[...truncated 2.77 KiB...]
[INFO]
[INFO] --- resources:3.4.0:testResources (default-testResources) @ jbig2-imageio ---
[INFO] Copying 20 resources from src/test/resources to target/test-classes
[INFO] Copying 3 resources from target/maven-shared-archive-resources to target/test-classes
[INFO]
[INFO] --- compiler:3.14.1:testCompile (default-testCompile) @ jbig2-imageio ---
[WARNING] Parameter 'optimize' (user property 'maven.compiler.optimize') is deprecated: This property is a no-op in javac.
[INFO] Recompiling the module because of changed dependency.
[INFO] Compiling 27 source files with javac [release 8] to target/test-classes
[INFO] <https://ci-builds.apache.org/job/PDFBox/job/PDFBox%20JBig2%20ImageIO%20Plugin/org.apache.pdfbox$jbig2-imageio/ws/src/test/java/org/apache/pdfbox/jbig2/ChecksumTest.java>: Some input files use or override a deprecated API.
[INFO] <https://ci-builds.apache.org/job/PDFBox/job/PDFBox%20JBig2%20ImageIO%20Plugin/org.apache.pdfbox$jbig2-imageio/ws/src/test/java/org/apache/pdfbox/jbig2/ChecksumTest.java>: Recompile with -Xlint:deprecation for details.
[INFO]
[INFO] --- surefire:3.5.4:test (default-test) @ jbig2-imageio ---
[INFO] Using auto detected provider org.apache.maven.surefire.junit4.JUnit4Provider
[INFO]
[INFO] -------------------------------------------------------
[INFO] T E S T S
[INFO] -------------------------------------------------------
[INFO] Running org.apache.pdfbox.jbig2.BitmapTest
[INFO] Tests run: 8, Failures: 0, Errors: 0, Skipped: 0, Time elapsed: 0.066 s -- in org.apache.pdfbox.jbig2.BitmapTest
[INFO] Running org.apache.pdfbox.jbig2.ChecksumTest
[INFO] Tests run: 44, Failures: 0, Errors: 0, Skipped: 0, Time elapsed: 4.404 s -- in org.apache.pdfbox.jbig2.ChecksumTest
[INFO] Running org.apache.pdfbox.jbig2.util.CacheFactoryTest
[INFO] Tests run: 1, Failures: 0, Errors: 0, Skipped: 0, Time elapsed: 0.001 s -- in org.apache.pdfbox.jbig2.util.CacheFactoryTest
[INFO] Running org.apache.pdfbox.jbig2.util.cache.SoftReferenceCacheTest
[INFO] Tests run: 2, Failures: 0, Errors: 0, Skipped: 0, Time elapsed: 11.38 s -- in org.apache.pdfbox.jbig2.util.cache.SoftReferenceCacheTest
[INFO] Running org.apache.pdfbox.jbig2.util.ServiceLookupTest
[INFO] Tests run: 3, Failures: 0, Errors: 0, Skipped: 0, Time elapsed: 0.002 s -- in org.apache.pdfbox.jbig2.util.ServiceLookupTest
[INFO] Running org.apache.pdfbox.jbig2.SerenityTests
[INFO] Tests run: 1, Failures: 0, Errors: 0, Skipped: 0, Time elapsed: 0.549 s -- in org.apache.pdfbox.jbig2.SerenityTests
[INFO] Running org.apache.pdfbox.jbig2.GithubIssuesTest
[INFO] Tests run: 1, Failures: 0, Errors: 0, Skipped: 0, Time elapsed: 0.015 s -- in org.apache.pdfbox.jbig2.GithubIssuesTest
[INFO] Running org.apache.pdfbox.jbig2.JBIG2PageTest
[WARNING] Tests run: 3, Failures: 0, Errors: 0, Skipped: 3, Time elapsed: 0.001 s -- in org.apache.pdfbox.jbig2.JBIG2PageTest
[INFO] Running org.apache.pdfbox.jbig2.image.BitmapsBlitTest
[INFO] Tests run: 2, Failures: 0, Errors: 0, Skipped: 0, Time elapsed: 0.159 s -- in org.apache.pdfbox.jbig2.image.BitmapsBlitTest
[INFO] Running org.apache.pdfbox.jbig2.image.BitmapsChecksumTest
[INFO] Tests run: 11, Failures: 0, Errors: 0, Skipped: 0, Time elapsed: 1.488 s -- in org.apache.pdfbox.jbig2.image.BitmapsChecksumTest
[INFO] Running org.apache.pdfbox.jbig2.image.BitmapsByteCombinationTest
[INFO] Tests run: 5, Failures: 0, Errors: 0, Skipped: 0, Time elapsed: 0.001 s -- in org.apache.pdfbox.jbig2.image.BitmapsByteCombinationTest
[INFO] Running org.apache.pdfbox.jbig2.decoder.arithmetic.ArithmeticIntegerDecoderTest
[INFO] Tests run: 1, Failures: 0, Errors: 0, Skipped: 0, Time elapsed: 0.001 s -- in org.apache.pdfbox.jbig2.decoder.arithmetic.ArithmeticIntegerDecoderTest
[INFO] Running org.apache.pdfbox.jbig2.decoder.arithmetic.ArithmeticDecoderTest
[INFO] Tests run: 2, Failures: 0, Errors: 0, Skipped: 0, Time elapsed: 0.001 s -- in org.apache.pdfbox.jbig2.decoder.arithmetic.ArithmeticDecoderTest
[INFO] Running org.apache.pdfbox.jbig2.decoder.mmr.MMRDecompressorTest
[INFO] Tests run: 1, Failures: 0, Errors: 0, Skipped: 0, Time elapsed: 0.001 s -- in org.apache.pdfbox.jbig2.decoder.mmr.MMRDecompressorTest
[INFO] Running org.apache.pdfbox.jbig2.JBIG2ImageReaderTest
[INFO] Tests run: 7, Failures: 0, Errors: 0, Skipped: 0, Time elapsed: 0.329 s -- in org.apache.pdfbox.jbig2.JBIG2ImageReaderTest
[INFO] Running org.apache.pdfbox.jbig2.segments.PatternDictionaryTest
[WARNING] Tests run: 3, Failures: 0, Errors: 0, Skipped: 2, Time elapsed: 0.001 s -- in org.apache.pdfbox.jbig2.segments.PatternDictionaryTest
[INFO] Running org.apache.pdfbox.jbig2.segments.RegionSegmentInformationTest
[INFO] Tests run: 1, Failures: 0, Errors: 0, Skipped: 0, Time elapsed: 0 s -- in org.apache.pdfbox.jbig2.segments.RegionSegmentInformationTest
[INFO] Running org.apache.pdfbox.jbig2.segments.PageInformationTest
[WARNING] Tests run: 3, Failures: 0, Errors: 0, Skipped: 2, Time elapsed: 0 s -- in org.apache.pdfbox.jbig2.segments.PageInformationTest
[INFO] Running org.apache.pdfbox.jbig2.segments.GenericRegionTest
[WARNING] Tests run: 4, Failures: 0, Errors: 0, Skipped: 3, Time elapsed: 0.001 s -- in org.apache.pdfbox.jbig2.segments.GenericRegionTest
[INFO] Running org.apache.pdfbox.jbig2.segments.HalftoneRegionTest
[INFO] Tests run: 1, Failures: 0, Errors: 0, Skipped: 0, Time elapsed: 0.001 s -- in org.apache.pdfbox.jbig2.segments.HalftoneRegionTest
[INFO] Running org.apache.pdfbox.jbig2.segments.TextRegionTest
[WARNING] Tests run: 1, Failures: 0, Errors: 0, Skipped: 1, Time elapsed: 0 s -- in org.apache.pdfbox.jbig2.segments.TextRegionTest
[INFO]
[INFO] Results:
[INFO]
[WARNING] Tests run: 105, Failures: 0, Errors: 0, Skipped: 11
[INFO]
[JENKINS] Recording test results
[INFO]
[INFO] --- jar:3.5.0:jar (default-jar) @ jbig2-imageio ---
[INFO] Building jar: <https://ci-builds.apache.org/job/PDFBox/job/PDFBox%20JBig2%20ImageIO%20Plugin/org.apache.pdfbox$jbig2-imageio/ws/target/jbig2-imageio-3.0.5-SNAPSHOT.jar>
[INFO]
[INFO] >>> source:3.4.0:jar (attach-sources) > generate-sources @ jbig2-imageio >>>
[INFO]
[INFO] --- enforcer:3.6.2:enforce (enforce-maven-version) @ jbig2-imageio ---
[INFO]
[INFO] --- enforcer:3.6.2:enforce (enforce-java-version) @ jbig2-imageio ---
[INFO]
[INFO] --- enforcer:3.6.2:enforce (default) @ jbig2-imageio ---
[WARNING] Failed to getClass for org.apache.maven.plugins.source.SourceJarMojo
[INFO]
[INFO] <<< source:3.4.0:jar (attach-sources) < generate-sources @ jbig2-imageio <<<
[INFO]
[INFO]
[INFO] --- source:3.4.0:jar (attach-sources) @ jbig2-imageio ---
[INFO] Skipping source per configuration.
[INFO]
[INFO] --- assembly:2.6:single (default) @ jbig2-imageio ---
[INFO] Reading assembly descriptor: assembly.xml
[INFO] Building zip: <https://ci-builds.apache.org/job/PDFBox/job/PDFBox%20JBig2%20ImageIO%20Plugin/org.apache.pdfbox$jbig2-imageio/ws/target/jbig2-imageio-3.0.5-SNAPSHOT-src.zip>
[INFO]
[INFO] --- apache-rat:0.17:check (default) @ jbig2-imageio ---
[WARNING] Parameter 'excludes' is deprecated: Deprecated for removal since 0.17: Use <inputExclude> instead.
[WARNING] Basedir is : <https://ci-builds.apache.org/job/PDFBox/job/PDFBox%20JBig2%20ImageIO%20Plugin/org.apache.pdfbox$jbig2-imageio/ws/>
[WARNING] Use of deprecated option 'exclude'. Deprecated for removal since 0.17: Use <inputExclude> instead.
[INFO] Excluding patterns: src/test/resources/images/*, nbactions.xml, nb-configuration.xml, src/test/resources/images/arith/*, src/test/resources/org/apache/pdfbox/jbig2/github/*
[INFO] Excluding MAVEN collection.
[INFO] Excluding ECLIPSE collection.
[INFO] Excluding IDEA collection.
[INFO] Processing exclude file from STANDARD_SCMS.
[INFO] Excluding STANDARD_SCMS collection.
[INFO] Excluding MISC collection.
[INFO] Excluding HIDDEN_DIR collection.
[INFO] RAT summary:
[INFO] Approved: 95
[INFO] Archives: 0
[INFO] Binaries: 0
[INFO] Document types: 3
[INFO] Ignored: 21
[INFO] License categories: 1
[INFO] License names: 1
[INFO] Notices: 4
[INFO] Standards: 95
[INFO] Unapproved: 0
[INFO] Unknown: 0
[INFO]
[INFO] --- dependency-check:12.2.0:check (default) @ jbig2-imageio ---
[INFO] Checking for updates
[WARNING] An NVD API Key was not provided - it is highly recommended to use an NVD API key as the update can take a VERY long time without an API Key
[INFO] NVD API has 52,059 records in this update
[INFO] Downloaded 10,000/52,060 (19%)
[WARNING] Retrying request /rest/json/cves/2.0?lastModStartDate=2026-04-09T17%3A49%3A05Z&lastModEndDate=2026-08-07T17%3A49%3A05Z&resultsPerPage=2000&startIndex=14000 : 2nd time
[INFO] Downloaded 20,000/52,063 (38%)
[INFO] Downloaded 30,000/52,115 (58%)
[WARNING] NVD API request failures are occurring; retrying request for the 15th time
[WARNING] NVD API request failures are occurring; retrying request for the 16th time
[WARNING] NVD API request failures are occurring; retrying request for the 17th time
[WARNING] NVD API request failures are occurring; retrying request for the 18th time
[WARNING] NVD API request failures are occurring; retrying request for the 19th time
[WARNING] NVD API request failures are occurring; retrying request for the 20th time
[WARNING] NVD API request failures are occurring; retrying request for the 21st time
[WARNING] NVD API request failures are occurring; retrying request for the 22nd time
[WARNING] NVD API request failures are occurring; retrying request for the 23rd time
[WARNING] NVD API request failures are occurring; retrying request for the 24th time
[WARNING] NVD API request failures are occurring; retrying request for the 25th time
[WARNING] NVD API request failures are occurring; retrying request for the 26th time
[WARNING] NVD API request failures are occurring; retrying request for the 27th time
[WARNING] NVD API request failures are occurring; retrying request for the 28th time
[WARNING] NVD API request failures are occurring; retrying request for the 29th time
[WARNING] NVD API request failures are occurring; retrying request for the 30th time
[WARNING] NVD API request failures are occurring; retrying request for the 31st time
[WARNING] NVD API request failures are occurring; retrying request for the 15th time
[WARNING] NVD API request failures are occurring; retrying request for the 16th time
[WARNING] NVD API request failures are occurring; retrying request for the 17th time
[WARNING] NVD API request failures are occurring; retrying request for the 18th time
[WARNING] NVD API request failures are occurring; retrying request for the 19th time
[WARNING] NVD API request failures are occurring; retrying request for the 20th time
[WARNING] NVD API request failures are occurring; retrying request for the 21st time
[WARNING] NVD API request failures are occurring; retrying request for the 22nd time
[WARNING] NVD API request failures are occurring; retrying request for the 23rd time
[ERROR] Error updating the NVD Data
org.owasp.dependencycheck.data.update.exception.UpdateException: Error updating the NVD Data
at org.owasp.dependencycheck.data.update.NvdApiDataSource.processApi (NvdApiDataSource.java:387)
at org.owasp.dependencycheck.data.update.NvdApiDataSource.update (NvdApiDataSource.java:128)
at org.owasp.dependencycheck.Engine.doUpdates (Engine.java:902)
at org.owasp.dependencycheck.Engine.initializeAndUpdateDatabase (Engine.java:707)
at org.owasp.dependencycheck.Engine.analyzeDependencies (Engine.java:634)
at org.owasp.dependencycheck.maven.BaseDependencyCheckMojo.runCheck (BaseDependencyCheckMojo.java:2069)
at org.owasp.dependencycheck.maven.BaseDependencyCheckMojo.execute (BaseDependencyCheckMojo.java:1267)
at org.apache.maven.plugin.DefaultBuildPluginManager.executeMojo (DefaultBuildPluginManager.java:126)
at org.apache.maven.lifecycle.internal.MojoExecutor.doExecute2 (MojoExecutor.java:328)
at org.apache.maven.lifecycle.internal.MojoExecutor.doExecute (MojoExecutor.java:316)
at org.apache.maven.lifecycle.internal.MojoExecutor.execute (MojoExecutor.java:212)
at org.apache.maven.lifecycle.internal.MojoExecutor.execute (MojoExecutor.java:174)
at org.apache.maven.lifecycle.internal.MojoExecutor.access$000 (MojoExecutor.java:75)
at org.apache.maven.lifecycle.internal.MojoExecutor$1.run (MojoExecutor.java:162)
at org.apache.maven.plugin.DefaultMojosExecutionStrategy.execute (DefaultMojosExecutionStrategy.java:39)
at org.apache.maven.lifecycle.internal.MojoExecutor.execute (MojoExecutor.java:159)
at org.apache.maven.lifecycle.internal.LifecycleModuleBuilder.buildProject (LifecycleModuleBuilder.java:105)
at org.apache.maven.lifecycle.internal.LifecycleModuleBuilder.buildProject (LifecycleModuleBuilder.java:73)
at org.apache.maven.lifecycle.internal.builder.singlethreaded.SingleThreadedBuilder.build (SingleThreadedBuilder.java:53)
at org.apache.maven.lifecycle.internal.LifecycleStarter.execute (LifecycleStarter.java:118)
at org.apache.maven.DefaultMaven.doExecute (DefaultMaven.java:261)
at org.apache.maven.DefaultMaven.doExecute (DefaultMaven.java:173)
at org.apache.maven.DefaultMaven.execute (DefaultMaven.java:101)
at org.jvnet.hudson.maven3.launcher.Maven35Launcher.main (Maven35Launcher.java:138)
at jdk.internal.reflect.NativeMethodAccessorImpl.invoke0 (Native Method)
at jdk.internal.reflect.NativeMethodAccessorImpl.invoke (NativeMethodAccessorImpl.java:77)
at jdk.internal.reflect.DelegatingMethodAccessorImpl.invoke (DelegatingMethodAccessorImpl.java:43)
at java.lang.reflect.Method.invoke (Method.java:569)
at org.codehaus.plexus.classworlds.launcher.Launcher.launchEnhanced (Launcher.java:255)
at org.codehaus.plexus.classworlds.launcher.Launcher.launch (Launcher.java:201)
at jenkins.maven3.agent.Maven35Main.launch (Maven35Main.java:179)
at jdk.internal.reflect.NativeMethodAccessorImpl.invoke0 (Native Method)
at jdk.internal.reflect.NativeMethodAccessorImpl.invoke (NativeMethodAccessorImpl.java:77)
at jdk.internal.reflect.DelegatingMethodAccessorImpl.invoke (DelegatingMethodAccessorImpl.java:43)
at java.lang.reflect.Method.invoke (Method.java:569)
at hudson.maven.Maven3Builder.call (Maven3Builder.java:140)
at hudson.maven.Maven3Builder.call (Maven3Builder.java:71)
at hudson.remoting.UserRequest.perform (UserRequest.java:225)
at hudson.remoting.UserRequest.perform (UserRequest.java:50)
at hudson.remoting.Request$2.run (Request.java:391)
at hudson.remoting.InterceptingExecutorService.lambda$wrap$0 (InterceptingExecutorService.java:81)
at java.util.concurrent.FutureTask.run (FutureTask.java:264)
at java.util.concurrent.ThreadPoolExecutor.runWorker (ThreadPoolExecutor.java:1136)
at java.util.concurrent.ThreadPoolExecutor$Worker.run (ThreadPoolExecutor.java:635)
at java.lang.Thread.run (Thread.java:840)
Caused by: io.github.jeremylong.openvulnerability.client.nvd.NvdApiException: NVD Returned Status Code: 429
at io.github.jeremylong.openvulnerability.client.nvd.NvdCveClient._next (NvdCveClient.java:445)
at io.github.jeremylong.openvulnerability.client.nvd.NvdCveClient.next (NvdCveClient.java:356)
at org.owasp.dependencycheck.data.update.NvdApiDataSource.processApi (NvdApiDataSource.java:343)
at org.owasp.dependencycheck.data.update.NvdApiDataSource.update (NvdApiDataSource.java:128)
at org.owasp.dependencycheck.Engine.doUpdates (Engine.java:902)
at org.owasp.dependencycheck.Engine.initializeAndUpdateDatabase (Engine.java:707)
at org.owasp.dependencycheck.Engine.analyzeDependencies (Engine.java:634)
at org.owasp.dependencycheck.maven.BaseDependencyCheckMojo.runCheck (BaseDependencyCheckMojo.java:2069)
at org.owasp.dependencycheck.maven.BaseDependencyCheckMojo.execute (BaseDependencyCheckMojo.java:1267)
at org.apache.maven.plugin.DefaultBuildPluginManager.executeMojo (DefaultBuildPluginManager.java:126)
at org.apache.maven.lifecycle.internal.MojoExecutor.doExecute2 (MojoExecutor.java:328)
at org.apache.maven.lifecycle.internal.MojoExecutor.doExecute (MojoExecutor.java:316)
at org.apache.maven.lifecycle.internal.MojoExecutor.execute (MojoExecutor.java:212)
at org.apache.maven.lifecycle.internal.MojoExecutor.execute (MojoExecutor.java:174)
at org.apache.maven.lifecycle.internal.MojoExecutor.access$000 (MojoExecutor.java:75)
at org.apache.maven.lifecycle.internal.MojoExecutor$1.run (MojoExecutor.java:162)
at org.apache.maven.plugin.DefaultMojosExecutionStrategy.execute (DefaultMojosExecutionStrategy.java:39)
at org.apache.maven.lifecycle.internal.MojoExecutor.execute (MojoExecutor.java:159)
at org.apache.maven.lifecycle.internal.LifecycleModuleBuilder.buildProject (LifecycleModuleBuilder.java:105)
at org.apache.maven.lifecycle.internal.LifecycleModuleBuilder.buildProject (LifecycleModuleBuilder.java:73)
at org.apache.maven.lifecycle.internal.builder.singlethreaded.SingleThreadedBuilder.build (SingleThreadedBuilder.java:53)
at org.apache.maven.lifecycle.internal.LifecycleStarter.execute (LifecycleStarter.java:118)
at org.apache.maven.DefaultMaven.doExecute (DefaultMaven.java:261)
at org.apache.maven.DefaultMaven.doExecute (DefaultMaven.java:173)
at org.apache.maven.DefaultMaven.execute (DefaultMaven.java:101)
at org.jvnet.hudson.maven3.launcher.Maven35Launcher.main (Maven35Launcher.java:138)
at jdk.internal.reflect.NativeMethodAccessorImpl.invoke0 (Native Method)
at jdk.internal.reflect.NativeMethodAccessorImpl.invoke (NativeMethodAccessorImpl.java:77)
at jdk.internal.reflect.DelegatingMethodAccessorImpl.invoke (DelegatingMethodAccessorImpl.java:43)
at java.lang.reflect.Method.invoke (Method.java:569)
at org.codehaus.plexus.classworlds.launcher.Launcher.launchEnhanced (Launcher.java:255)
at org.codehaus.plexus.classworlds.launcher.Launcher.launch (Launcher.java:201)
at jenkins.maven3.agent.Maven35Main.launch (Maven35Main.java:179)
at jdk.internal.reflect.NativeMethodAccessorImpl.invoke0 (Native Method)
at jdk.internal.reflect.NativeMethodAccessorImpl.invoke (NativeMethodAccessorImpl.java:77)
at jdk.internal.reflect.DelegatingMethodAccessorImpl.invoke (DelegatingMethodAccessorImpl.java:43)
at java.lang.reflect.Method.invoke (Method.java:569)
at hudson.maven.Maven3Builder.call (Maven3Builder.java:140)
at hudson.maven.Maven3Builder.call (Maven3Builder.java:71)
at hudson.remoting.UserRequest.perform (UserRequest.java:225)
at hudson.remoting.UserRequest.perform (UserRequest.java:50)
at hudson.remoting.Request$2.run (Request.java:391)
at hudson.remoting.InterceptingExecutorService.lambda$wrap$0 (InterceptingExecutorService.java:81)
at java.util.concurrent.FutureTask.run (FutureTask.java:264)
at java.util.concurrent.ThreadPoolExecutor.runWorker (ThreadPoolExecutor.java:1136)
at java.util.concurrent.ThreadPoolExecutor$Worker.run (ThreadPoolExecutor.java:635)
at java.lang.Thread.run (Thread.java:840)
[INFO] Updating CISA Known Exploited Vulnerability list: https://www.cisa.gov/sites/default/files/feeds/known_exploited_vulnerabilities.json
[INFO] Begin database defrag
[INFO] End database defrag (8547 ms)
[WARNING] Unable to update 1 or more Cached Web DataSource, using local data instead. Results may not include recent vulnerabilities.
[ERROR] Unable to continue dependency-check analysis.
[WARNING] Attempt to (de-)serialize anonymous class org.jfrog.hudson.maven2.MavenDependenciesRecorder$1; see: https://jenkins.io/redirect/serialization-of-anonymous-classes/
---------------------------------------------------------------------
To unsubscribe, e-mail: dev-unsubscribe@pdfbox.apache.org
For additional commands, e-mail: dev-help@pdfbox.apache.org
Jenkins build is back to normal : PDFBox » PDFBox JBig2 ImageIO Plugin » PDFBox JBIG2 ImageIO plugin #101
Posted by Apache Jenkins Server <je...@builds.apache.org>.
See <https://ci-builds.apache.org/job/PDFBox/job/PDFBox%20JBig2%20ImageIO%20Plugin/org.apache.pdfbox$jbig2-imageio/101/display/redirect?page=changes>
---------------------------------------------------------------------
To unsubscribe, e-mail: dev-unsubscribe@pdfbox.apache.org
For additional commands, e-mail: dev-help@pdfbox.apache.org