You are viewing a plain text version of this content. The canonical link for it is here.
Posted to builds@beam.apache.org by Apache Jenkins Server <je...@builds.apache.org> on 2020/05/09 12:14:57 UTC
Build failed in Jenkins: beam_PostCommit_Python35_VR_Flink #2018
See <https://builds.apache.org/job/beam_PostCommit_Python35_VR_Flink/2018/display/redirect>
Changes:
------------------------------------------
[...truncated 5.08 MB...]
details = "Method not found: org.apache.beam.model.job_management.v1.ArtifactStagingService/ReverseArtifactRetrievalService"
debug_error_string = "{"created":"@1589026490.292926304","description":"Error received from peer ipv4:127.0.0.1:40667","file":"src/core/lib/surface/call.cc","file_line":1056,"grpc_message":"Method not found: org.apache.beam.model.job_management.v1.ArtifactStagingService/ReverseArtifactRetrievalService","grpc_status":12}"
>
INFO:apache_beam.runners.portability.portable_runner:Environment "LOOPBACK" has started a component necessary for the execution. Be sure to run the pipeline using
with Pipeline() as p:
p.apply(..)
This ensures that the pipeline finishes before this program exits.
INFO:apache_beam.runners.portability.portable_runner:Job state changed to STOPPED
INFO:apache_beam.runners.portability.portable_runner:Job state changed to STARTING
INFO:apache_beam.runners.portability.portable_runner:Job state changed to RUNNING
[flink-runner-job-invoker] WARN org.apache.flink.runtime.webmonitor.WebMonitorUtils - Log file environment variable 'log.file' is not set.
[flink-runner-job-invoker] WARN org.apache.flink.runtime.webmonitor.WebMonitorUtils - JobManager log files are unavailable in the web dashboard. Log file location not found in environment variable 'log.file' or configuration key 'Key: 'web.log.path' , default: null (fallback keys: [{key=jobmanager.web.log.path, isDeprecated=true}])'.
[[5]{Create, Map(<lambda at fn_runner_test.py:474>), WindowInto(WindowIntoFn), Map(<lambda at fn_runner_test.py:477>)} (1/2)] WARN org.apache.flink.metrics.MetricGroup - The operator name [5]{Create, Map(<lambda at fn_runner_test.py:474>), WindowInto(WindowIntoFn), Map(<lambda at fn_runner_test.py:477>)} exceeded the 80 characters length limit and was truncated.
[[5]{Create, Map(<lambda at fn_runner_test.py:474>), WindowInto(WindowIntoFn), Map(<lambda at fn_runner_test.py:477>)} (2/2)] WARN org.apache.flink.metrics.MetricGroup - The operator name [5]{Create, Map(<lambda at fn_runner_test.py:474>), WindowInto(WindowIntoFn), Map(<lambda at fn_runner_test.py:477>)} exceeded the 80 characters length limit and was truncated.
INFO:apache_beam.runners.worker.statecache:Creating state cache with size 0
INFO:apache_beam.runners.worker.sdk_worker:Creating insecure control channel for localhost:36311.
INFO:apache_beam.runners.worker.sdk_worker:Control channel established.
INFO:apache_beam.runners.worker.sdk_worker:Initializing SDKHarness with unbounded number of workers.
INFO:apache_beam.runners.worker.sdk_worker:Creating insecure state channel for localhost:44607.
INFO:apache_beam.runners.worker.sdk_worker:State channel established.
INFO:apache_beam.runners.worker.data_plane:Creating client data channel for
ERROR:apache_beam.runners.worker.data_plane:Failed to read inputs in the data plane.
Traceback (most recent call last):
File "<https://builds.apache.org/job/beam_PostCommit_Python35_VR_Flink/ws/src/sdks/python/apache_beam/runners/worker/data_plane.py",> line 528, in _read_inputs
for elements in elements_iterator:
File "<https://builds.apache.org/job/beam_PostCommit_Python35_VR_Flink/ws/src/build/gradleenv/2022703439/lib/python3.5/site-packages/grpc/_channel.py",> line 416, in __next__
return self._next()
File "<https://builds.apache.org/job/beam_PostCommit_Python35_VR_Flink/ws/src/build/gradleenv/2022703439/lib/python3.5/site-packages/grpc/_channel.py",> line 689, in _next
raise self
grpc._channel._MultiThreadedRendezvous: <_MultiThreadedRendezvous of RPC that terminated with:
status = StatusCode.UNAVAILABLE
details = "DNS resolution failed"
debug_error_string = "{"created":"@1589026490.696305041","description":"Failed to pick subchannel","file":"src/core/ext/filters/client_channel/client_channel.cc","file_line":3981,"referenced_errors":[{"created":"@1589026490.696301725","description":"Resolver transient failure","file":"src/core/ext/filters/client_channel/resolving_lb_policy.cc","file_line":214,"referenced_errors":[{"created":"@1589026490.696300434","description":"DNS resolution failed","file":"src/core/ext/filters/client_channel/resolver/dns/c_ares/dns_resolver_ares.cc","file_line":357,"grpc_status":14,"referenced_errors":[{"created":"@1589026490.696293908","description":"C-ares status is not ARES_SUCCESS: Misformatted domain name","file":"src/core/ext/filters/client_channel/resolver/dns/c_ares/grpc_ares_wrapper.cc","file_line":244,"referenced_errors":[{"created":"@1589026490.696276865","description":"C-ares status is not ARES_SUCCESS: Misformatted domain name","file":"src/core/ext/filters/client_channel/resolver/dns/c_ares/grpc_ares_wrapper.cc","file_line":244}]}]}]}]}"
>
INFO:apache_beam.runners.worker.data_plane:Creating client data channel for localhost:42057
Exception in thread read_grpc_client_inputs:
Traceback (most recent call last):
File "/usr/lib/python3.5/threading.py", line 914, in _bootstrap_inner
self.run()
File "/usr/lib/python3.5/threading.py", line 862, in run
self._target(*self._args, **self._kwargs)
File "<https://builds.apache.org/job/beam_PostCommit_Python35_VR_Flink/ws/src/sdks/python/apache_beam/runners/worker/data_plane.py",> line 545, in <lambda>
target=lambda: self._read_inputs(elements_iterator),
File "<https://builds.apache.org/job/beam_PostCommit_Python35_VR_Flink/ws/src/sdks/python/apache_beam/runners/worker/data_plane.py",> line 528, in _read_inputs
for elements in elements_iterator:
File "<https://builds.apache.org/job/beam_PostCommit_Python35_VR_Flink/ws/src/build/gradleenv/2022703439/lib/python3.5/site-packages/grpc/_channel.py",> line 416, in __next__
return self._next()
File "<https://builds.apache.org/job/beam_PostCommit_Python35_VR_Flink/ws/src/build/gradleenv/2022703439/lib/python3.5/site-packages/grpc/_channel.py",> line 689, in _next
raise self
grpc._channel._MultiThreadedRendezvous: <_MultiThreadedRendezvous of RPC that terminated with:
status = StatusCode.UNAVAILABLE
details = "DNS resolution failed"
debug_error_string = "{"created":"@1589026490.696305041","description":"Failed to pick subchannel","file":"src/core/ext/filters/client_channel/client_channel.cc","file_line":3981,"referenced_errors":[{"created":"@1589026490.696301725","description":"Resolver transient failure","file":"src/core/ext/filters/client_channel/resolving_lb_policy.cc","file_line":214,"referenced_errors":[{"created":"@1589026490.696300434","description":"DNS resolution failed","file":"src/core/ext/filters/client_channel/resolver/dns/c_ares/dns_resolver_ares.cc","file_line":357,"grpc_status":14,"referenced_errors":[{"created":"@1589026490.696293908","description":"C-ares status is not ARES_SUCCESS: Misformatted domain name","file":"src/core/ext/filters/client_channel/resolver/dns/c_ares/grpc_ares_wrapper.cc","file_line":244,"referenced_errors":[{"created":"@1589026490.696276865","description":"C-ares status is not ARES_SUCCESS: Misformatted domain name","file":"src/core/ext/filters/client_channel/resolver/dns/c_ares/grpc_ares_wrapper.cc","file_line":244}]}]}]}]}"
>
INFO:apache_beam.runners.worker.sdk_worker:No more requests from control plane
INFO:apache_beam.runners.worker.sdk_worker:SDK Harness waiting for in-flight requests to complete
[assert_that/Group/GroupByKey -> [3]assert_that/{Group, Unkey, Match} (1/2)] WARN org.apache.beam.sdk.fn.data.BeamFnDataGrpcMultiplexer - Hanged up for unknown endpoint.
INFO:apache_beam.runners.worker.data_plane:Closing all cached grpc data channels.
INFO:apache_beam.runners.worker.sdk_worker:Closing all cached gRPC state handlers.
INFO:apache_beam.runners.worker.sdk_worker:Done consuming work.
INFO:apache_beam.runners.portability.portable_runner:Job state changed to DONE
.INFO:apache_beam.runners.worker.worker_pool_main:Listening for workers at localhost:35381
WARNING:root:Make sure that locally built Python SDK docker image has Python 3.5 interpreter.
INFO:root:Using Python SDK docker image: apache/beam_python3.5_sdk:2.22.0.dev. If the image is not available at local, we will try to pull from hub.docker.com
ERROR:grpc._channel:Exception iterating requests!
Traceback (most recent call last):
File "<https://builds.apache.org/job/beam_PostCommit_Python35_VR_Flink/ws/src/build/gradleenv/2022703439/lib/python3.5/site-packages/grpc/_channel.py",> line 195, in consume_request_iterator
request = next(request_iterator)
File "<https://builds.apache.org/job/beam_PostCommit_Python35_VR_Flink/ws/src/sdks/python/apache_beam/runners/portability/artifact_service.py",> line 317, in __next__
raise self._queue.get()
File "<https://builds.apache.org/job/beam_PostCommit_Python35_VR_Flink/ws/src/sdks/python/apache_beam/runners/portability/portable_runner.py",> line 194, in stage
return self._stage_via_portable_service(channel, staging_session_token)
File "<https://builds.apache.org/job/beam_PostCommit_Python35_VR_Flink/ws/src/sdks/python/apache_beam/runners/portability/portable_runner.py",> line 212, in _stage_via_portable_service
staging_session_token)
File "<https://builds.apache.org/job/beam_PostCommit_Python35_VR_Flink/ws/src/sdks/python/apache_beam/runners/portability/artifact_service.py",> line 507, in offer_artifacts
for request in requests:
File "<https://builds.apache.org/job/beam_PostCommit_Python35_VR_Flink/ws/src/build/gradleenv/2022703439/lib/python3.5/site-packages/grpc/_channel.py",> line 416, in __next__
return self._next()
File "<https://builds.apache.org/job/beam_PostCommit_Python35_VR_Flink/ws/src/build/gradleenv/2022703439/lib/python3.5/site-packages/grpc/_channel.py",> line 706, in _next
raise self
grpc._channel._MultiThreadedRendezvous: <_MultiThreadedRendezvous of RPC that terminated with:
status = StatusCode.UNIMPLEMENTED
details = "Method not found: org.apache.beam.model.job_management.v1.ArtifactStagingService/ReverseArtifactRetrievalService"
debug_error_string = "{"created":"@1589026491.464684530","description":"Error received from peer ipv4:127.0.0.1:40667","file":"src/core/lib/surface/call.cc","file_line":1056,"grpc_message":"Method not found: org.apache.beam.model.job_management.v1.ArtifactStagingService/ReverseArtifactRetrievalService","grpc_status":12}"
>
INFO:apache_beam.runners.portability.portable_runner:Environment "LOOPBACK" has started a component necessary for the execution. Be sure to run the pipeline using
with Pipeline() as p:
p.apply(..)
This ensures that the pipeline finishes before this program exits.
INFO:apache_beam.runners.portability.portable_runner:Job state changed to STOPPED
INFO:apache_beam.runners.portability.portable_runner:Job state changed to STARTING
INFO:apache_beam.runners.portability.portable_runner:Job state changed to RUNNING
[flink-runner-job-invoker] WARN org.apache.flink.runtime.webmonitor.WebMonitorUtils - Log file environment variable 'log.file' is not set.
[flink-runner-job-invoker] WARN org.apache.flink.runtime.webmonitor.WebMonitorUtils - JobManager log files are unavailable in the web dashboard. Log file location not found in environment variable 'log.file' or configuration key 'Key: 'web.log.path' , default: null (fallback keys: [{key=jobmanager.web.log.path, isDeprecated=true}])'.
INFO:apache_beam.runners.worker.statecache:Creating state cache with size 0
INFO:apache_beam.runners.worker.sdk_worker:Creating insecure control channel for localhost:37511.
INFO:apache_beam.runners.worker.sdk_worker:Control channel established.
INFO:apache_beam.runners.worker.sdk_worker:Initializing SDKHarness with unbounded number of workers.
INFO:apache_beam.runners.worker.sdk_worker:Creating insecure state channel for localhost:34789.
INFO:apache_beam.runners.worker.sdk_worker:State channel established.
INFO:apache_beam.runners.worker.data_plane:Creating client data channel for
ERROR:apache_beam.runners.worker.data_plane:Failed to read inputs in the data plane.
Traceback (most recent call last):
File "<https://builds.apache.org/job/beam_PostCommit_Python35_VR_Flink/ws/src/sdks/python/apache_beam/runners/worker/data_plane.py",> line 528, in _read_inputs
for elements in elements_iterator:
File "<https://builds.apache.org/job/beam_PostCommit_Python35_VR_Flink/ws/src/build/gradleenv/2022703439/lib/python3.5/site-packages/grpc/_channel.py",> line 416, in __next__
return self._next()
File "<https://builds.apache.org/job/beam_PostCommit_Python35_VR_Flink/ws/src/build/gradleenv/2022703439/lib/python3.5/site-packages/grpc/_channel.py",> line 689, in _next
raise self
grpc._channel._MultiThreadedRendezvous: <_MultiThreadedRendezvous of RPC that terminated with:
status = StatusCode.UNAVAILABLE
details = "DNS resolution failed"
debug_error_string = "{"created":"@1589026491.883280278","description":"Failed to pick subchannel","file":"src/core/ext/filters/client_channel/client_channel.cc","file_line":3981,"referenced_errors":[{"created":"@1589026491.883276390","description":"Resolver transient failure","file":"src/core/ext/filters/client_channel/resolving_lb_policy.cc","file_line":214,"referenced_errors":[{"created":"@1589026491.883274640","description":"DNS resolution failed","file":"src/core/ext/filters/client_channel/resolver/dns/c_ares/dns_resolver_ares.cc","file_line":357,"grpc_status":14,"referenced_errors":[{"created":"@1589026491.883266247","description":"C-ares status is not ARES_SUCCESS: Misformatted domain name","file":"src/core/ext/filters/client_channel/resolver/dns/c_ares/grpc_ares_wrapper.cc","file_line":244,"referenced_errors":[{"created":"@1589026491.883248472","description":"C-ares status is not ARES_SUCCESS: Misformatted domain name","file":"src/core/ext/filters/client_channel/resolver/dns/c_ares/grpc_ares_wrapper.cc","file_line":244}]}]}]}]}"
>
INFO:apache_beam.runners.worker.data_plane:Creating client data channel for localhost:36413
Exception in thread read_grpc_client_inputs:
Traceback (most recent call last):
File "/usr/lib/python3.5/threading.py", line 914, in _bootstrap_inner
self.run()
File "/usr/lib/python3.5/threading.py", line 862, in run
self._target(*self._args, **self._kwargs)
File "<https://builds.apache.org/job/beam_PostCommit_Python35_VR_Flink/ws/src/sdks/python/apache_beam/runners/worker/data_plane.py",> line 545, in <lambda>
target=lambda: self._read_inputs(elements_iterator),
File "<https://builds.apache.org/job/beam_PostCommit_Python35_VR_Flink/ws/src/sdks/python/apache_beam/runners/worker/data_plane.py",> line 528, in _read_inputs
for elements in elements_iterator:
File "<https://builds.apache.org/job/beam_PostCommit_Python35_VR_Flink/ws/src/build/gradleenv/2022703439/lib/python3.5/site-packages/grpc/_channel.py",> line 416, in __next__
return self._next()
File "<https://builds.apache.org/job/beam_PostCommit_Python35_VR_Flink/ws/src/build/gradleenv/2022703439/lib/python3.5/site-packages/grpc/_channel.py",> line 689, in _next
raise self
grpc._channel._MultiThreadedRendezvous: <_MultiThreadedRendezvous of RPC that terminated with:
status = StatusCode.UNAVAILABLE
details = "DNS resolution failed"
debug_error_string = "{"created":"@1589026491.883280278","description":"Failed to pick subchannel","file":"src/core/ext/filters/client_channel/client_channel.cc","file_line":3981,"referenced_errors":[{"created":"@1589026491.883276390","description":"Resolver transient failure","file":"src/core/ext/filters/client_channel/resolving_lb_policy.cc","file_line":214,"referenced_errors":[{"created":"@1589026491.883274640","description":"DNS resolution failed","file":"src/core/ext/filters/client_channel/resolver/dns/c_ares/dns_resolver_ares.cc","file_line":357,"grpc_status":14,"referenced_errors":[{"created":"@1589026491.883266247","description":"C-ares status is not ARES_SUCCESS: Misformatted domain name","file":"src/core/ext/filters/client_channel/resolver/dns/c_ares/grpc_ares_wrapper.cc","file_line":244,"referenced_errors":[{"created":"@1589026491.883248472","description":"C-ares status is not ARES_SUCCESS: Misformatted domain name","file":"src/core/ext/filters/client_channel/resolver/dns/c_ares/grpc_ares_wrapper.cc","file_line":244}]}]}]}]}"
>
INFO:apache_beam.runners.worker.sdk_worker:No more requests from control plane
INFO:apache_beam.runners.worker.sdk_worker:SDK Harness waiting for in-flight requests to complete
[assert_that/Group/GroupByKey -> [3]assert_that/{Group, Unkey, Match} (1/2)] WARN org.apache.beam.sdk.fn.data.BeamFnDataGrpcMultiplexer - Hanged up for unknown endpoint.INFO:apache_beam.runners.worker.data_plane:Closing all cached grpc data channels.
INFO:apache_beam.runners.worker.sdk_worker:Closing all cached gRPC state handlers.
INFO:apache_beam.runners.worker.sdk_worker:Done consuming work.
INFO:apache_beam.runners.portability.portable_runner:Job state changed to DONE
.INFO:__main__:removing conf dir: /tmp/flinktest-confahqng9zq
======================================================================
ERROR: test_external_transforms (__main__.FlinkRunnerTest)
----------------------------------------------------------------------
Traceback (most recent call last):
File "<https://builds.apache.org/job/beam_PostCommit_Python35_VR_Flink/ws/src/sdks/python/apache_beam/runners/portability/flink_runner_test.py",> line 198, in test_external_transforms
assert_that(res, equal_to([i for i in range(1, 10)]))
File "<https://builds.apache.org/job/beam_PostCommit_Python35_VR_Flink/ws/src/sdks/python/apache_beam/pipeline.py",> line 550, in __exit__
self.run().wait_until_finish()
File "<https://builds.apache.org/job/beam_PostCommit_Python35_VR_Flink/ws/src/sdks/python/apache_beam/runners/portability/portable_runner.py",> line 580, in wait_until_finish
self._observe_state(message_thread)
File "<https://builds.apache.org/job/beam_PostCommit_Python35_VR_Flink/ws/src/sdks/python/apache_beam/runners/portability/portable_runner.py",> line 589, in _observe_state
for state_response in self._state_stream:
File "<https://builds.apache.org/job/beam_PostCommit_Python35_VR_Flink/ws/src/build/gradleenv/2022703439/lib/python3.5/site-packages/grpc/_channel.py",> line 416, in __next__
return self._next()
File "<https://builds.apache.org/job/beam_PostCommit_Python35_VR_Flink/ws/src/build/gradleenv/2022703439/lib/python3.5/site-packages/grpc/_channel.py",> line 697, in _next
_common.wait(self._state.condition.wait, _response_ready)
File "<https://builds.apache.org/job/beam_PostCommit_Python35_VR_Flink/ws/src/build/gradleenv/2022703439/lib/python3.5/site-packages/grpc/_common.py",> line 139, in wait
_wait_once(wait_fn, MAXIMUM_WAIT_TIMEOUT, spin_cb)
File "<https://builds.apache.org/job/beam_PostCommit_Python35_VR_Flink/ws/src/build/gradleenv/2022703439/lib/python3.5/site-packages/grpc/_common.py",> line 104, in _wait_once
wait_fn(timeout=timeout)
File "/usr/lib/python3.5/threading.py", line 297, in wait
gotit = waiter.acquire(True, timeout)
File "<https://builds.apache.org/job/beam_PostCommit_Python35_VR_Flink/ws/src/sdks/python/apache_beam/runners/portability/portable_runner_test.py",> line 82, in handler
raise BaseException(msg)
BaseException: Timed out after 60 seconds.
----------------------------------------------------------------------
Ran 80 tests in 167.713s
FAILED (errors=1, skipped=16)
==================== Timed out after 60 seconds. ====================
# Thread: <Thread(read_grpc_client_inputs, started daemon 139739260753664)>
# Thread: <Thread(Thread-168, started daemon 139739269146368)>
# Thread: <_Worker(Thread-154, started daemon 139739311109888)>
# Thread: <Thread(run_worker_6-1, started daemon 139740409997056)>
# Thread: <_MainThread(MainThread, started 139741619525376)>
# Thread: <_Worker(Thread-89, started daemon 139739285931776)>
# Thread: <Thread(Thread-160, started daemon 139740401604352)>
# Thread: <Thread(Thread-138, started daemon 139739814409984)>
# Thread: <_Worker(Thread-36, started daemon 139740451960576)>
# Thread: <_Worker(Thread-162, started daemon 139739839588096)>
# Thread: <Thread(Thread-161, started daemon 139739847980800)>
# Thread: <Thread(wait_until_finish_read, started daemon 139739797624576)>
# Thread: <Thread(Thread-153, started daemon 139739806017280)>
# Thread: <Thread(Thread-166, started daemon 139739277539072)>
# Thread: <Thread(Thread-164, started daemon 139739822802688)>
# Thread: <Thread(Thread-163, started daemon 139739831195392)>
# Thread: <Thread(read_state, started daemon 139739302717184)>
# Thread: <PeriodicThread(Thread-159, started daemon 139740418389760)>
# Thread: <_Worker(Thread-62, started daemon 139740443567872)>
# Thread: <_Worker(Thread-115, started daemon 139740799633152)>
# Thread: <Thread(Thread-167, started daemon 139739294324480)>
# Thread: <_Worker(Thread-10, started daemon 139740435175168)>
> Task :sdks:python:test-suites:portable:py35:flinkCompatibilityMatrixStreamingPreOptimizeLOOPBACK FAILED
FAILURE: Build failed with an exception.
* Where:
Script '<https://builds.apache.org/job/beam_PostCommit_Python35_VR_Flink/ws/src/sdks/python/test-suites/portable/common.gradle'> line: 55
* What went wrong:
Execution failed for task ':sdks:python:test-suites:portable:py35:flinkCompatibilityMatrixStreamingPreOptimizeLOOPBACK'.
> Process 'command 'sh'' finished with non-zero exit value 1
* Try:
Run with --stacktrace option to get the stack trace. Run with --info or --debug option to get more log output. Run with --scan to get full insights.
* Get more help at https://help.gradle.org
Deprecated Gradle features were used in this build, making it incompatible with Gradle 6.0.
Use '--warning-mode all' to show the individual deprecation warnings.
See https://docs.gradle.org/5.2.1/userguide/command_line_interface.html#sec:command_line_warnings
BUILD FAILED in 14m 27s
78 actionable tasks: 58 executed, 19 from cache, 1 up-to-date
Publishing build scan...
https://gradle.com/s/ybzellhogckum
Build step 'Invoke Gradle script' changed build result to FAILURE
Build step 'Invoke Gradle script' marked build as failure
---------------------------------------------------------------------
To unsubscribe, e-mail: builds-unsubscribe@beam.apache.org
For additional commands, e-mail: builds-help@beam.apache.org
Jenkins build is back to normal : beam_PostCommit_Python35_VR_Flink
#2020
Posted by Apache Jenkins Server <je...@builds.apache.org>.
See <https://builds.apache.org/job/beam_PostCommit_Python35_VR_Flink/2020/display/redirect>
---------------------------------------------------------------------
To unsubscribe, e-mail: builds-unsubscribe@beam.apache.org
For additional commands, e-mail: builds-help@beam.apache.org
Build failed in Jenkins: beam_PostCommit_Python35_VR_Flink #2019
Posted by Apache Jenkins Server <je...@builds.apache.org>.
See <https://builds.apache.org/job/beam_PostCommit_Python35_VR_Flink/2019/display/redirect?page=changes>
Changes:
[chambers] Add a BeamJava test with Flatten with different input and output Coders
[jferriero] check lastAttemptedOffset non-null
------------------------------------------
[...truncated 4.88 MB...]
lambda: self.create_worker().do_instruction(request), request)
File "<https://builds.apache.org/job/beam_PostCommit_Python35_VR_Flink/ws/src/sdks/python/apache_beam/runners/worker/sdk_worker.py",> line 471, in do_instruction
getattr(request, request_type), request.instruction_id)
File "<https://builds.apache.org/job/beam_PostCommit_Python35_VR_Flink/ws/src/sdks/python/apache_beam/runners/worker/sdk_worker.py",> line 506, in process_bundle
bundle_processor.process_bundle(instruction_id))
File "<https://builds.apache.org/job/beam_PostCommit_Python35_VR_Flink/ws/src/sdks/python/apache_beam/runners/worker/bundle_processor.py",> line 913, in process_bundle
element.data)
File "<https://builds.apache.org/job/beam_PostCommit_Python35_VR_Flink/ws/src/sdks/python/apache_beam/runners/worker/bundle_processor.py",> line 217, in process_encoded
self.output(decoded_value)
File "<https://builds.apache.org/job/beam_PostCommit_Python35_VR_Flink/ws/src/sdks/python/apache_beam/runners/worker/operations.py",> line 332, in output
cython.cast(Receiver, self.receivers[output_index]).receive(windowed_value)
File "<https://builds.apache.org/job/beam_PostCommit_Python35_VR_Flink/ws/src/sdks/python/apache_beam/runners/worker/operations.py",> line 195, in receive
self.consumer.process(windowed_value)
File "<https://builds.apache.org/job/beam_PostCommit_Python35_VR_Flink/ws/src/sdks/python/apache_beam/runners/worker/operations.py",> line 764, in process
delayed_application = self.dofn_runner.process_with_sized_restriction(o)
File "<https://builds.apache.org/job/beam_PostCommit_Python35_VR_Flink/ws/src/sdks/python/apache_beam/runners/common.py",> line 975, in process_with_sized_restriction
watermark_estimator=watermark_estimator)
File "<https://builds.apache.org/job/beam_PostCommit_Python35_VR_Flink/ws/src/sdks/python/apache_beam/runners/common.py",> line 712, in invoke_process
windowed_value, additional_args, additional_kwargs)
File "<https://builds.apache.org/job/beam_PostCommit_Python35_VR_Flink/ws/src/sdks/python/apache_beam/runners/common.py",> line 819, in _invoke_process_per_window
self.threadsafe_restriction_tracker.check_done()
File "<https://builds.apache.org/job/beam_PostCommit_Python35_VR_Flink/ws/src/sdks/python/apache_beam/runners/sdf_utils.py",> line 115, in check_done
return self._restriction_tracker.check_done()
File "<https://builds.apache.org/job/beam_PostCommit_Python35_VR_Flink/ws/src/sdks/python/apache_beam/io/restriction_trackers.py",> line 101, in check_done
self._range.stop))
ValueError: OffsetRestrictionTracker is not done since work in range [0, 6) has not been claimed.
INFO:apache_beam.runners.portability.portable_runner:Job state changed to FAILED
.sssINFO:apache_beam.runners.worker.worker_pool_main:Listening for workers at localhost:39811
WARNING:root:Make sure that locally built Python SDK docker image has Python 3.5 interpreter.
INFO:root:Using Python SDK docker image: apache/beam_python3.5_sdk:2.22.0.dev. If the image is not available at local, we will try to pull from hub.docker.com
INFO:apache_beam.runners.portability.portable_runner:Environment "LOOPBACK" has started a component necessary for the execution. Be sure to run the pipeline using
with Pipeline() as p:
p.apply(..)
This ensures that the pipeline finishes before this program exits.
INFO:apache_beam.runners.portability.portable_runner:Job state changed to STOPPED
INFO:apache_beam.runners.portability.portable_runner:Job state changed to STARTING
INFO:apache_beam.runners.portability.portable_runner:Job state changed to RUNNING
[flink-runner-job-invoker] WARN org.apache.flink.runtime.webmonitor.WebMonitorUtils - Log file environment variable 'log.file' is not set.
[flink-runner-job-invoker] WARN org.apache.flink.runtime.webmonitor.WebMonitorUtils - JobManager log files are unavailable in the web dashboard. Log file location not found in environment variable 'log.file' or configuration key 'Key: 'web.log.path' , default: null (fallback keys: [{key=jobmanager.web.log.path, isDeprecated=true}])'.
[[5]{Create, Map(<lambda at fn_runner_test.py:474>), WindowInto(WindowIntoFn), Map(<lambda at fn_runner_test.py:477>)} (1/2)] WARN org.apache.flink.metrics.MetricGroup - The operator name [5]{Create, Map(<lambda at fn_runner_test.py:474>), WindowInto(WindowIntoFn), Map(<lambda at fn_runner_test.py:477>)} exceeded the 80 characters length limit and was truncated.
[[5]{Create, Map(<lambda at fn_runner_test.py:474>), WindowInto(WindowIntoFn), Map(<lambda at fn_runner_test.py:477>)} (2/2)] WARN org.apache.flink.metrics.MetricGroup - The operator name [5]{Create, Map(<lambda at fn_runner_test.py:474>), WindowInto(WindowIntoFn), Map(<lambda at fn_runner_test.py:477>)} exceeded the 80 characters length limit and was truncated.
INFO:apache_beam.runners.worker.statecache:Creating state cache with size 0
INFO:apache_beam.runners.worker.sdk_worker:Creating insecure control channel for localhost:41385.
INFO:apache_beam.runners.worker.sdk_worker:Control channel established.
INFO:apache_beam.runners.worker.sdk_worker:Initializing SDKHarness with unbounded number of workers.
INFO:apache_beam.runners.worker.sdk_worker:Creating insecure state channel for localhost:42763.
INFO:apache_beam.runners.worker.sdk_worker:State channel established.
INFO:apache_beam.runners.worker.data_plane:Creating client data channel for
ERROR:apache_beam.runners.worker.data_plane:Failed to read inputs in the data plane.
Traceback (most recent call last):
File "<https://builds.apache.org/job/beam_PostCommit_Python35_VR_Flink/ws/src/sdks/python/apache_beam/runners/worker/data_plane.py",> line 528, in _read_inputs
for elements in elements_iterator:
File "<https://builds.apache.org/job/beam_PostCommit_Python35_VR_Flink/ws/src/build/gradleenv/2022703439/lib/python3.5/site-packages/grpc/_channel.py",> line 416, in __next__
return self._next()
File "<https://builds.apache.org/job/beam_PostCommit_Python35_VR_Flink/ws/src/build/gradleenv/2022703439/lib/python3.5/site-packages/grpc/_channel.py",> line 689, in _next
raise self
grpc._channel._MultiThreadedRendezvous: <_MultiThreadedRendezvous of RPC that terminated with:
status = StatusCode.UNAVAILABLE
details = "DNS resolution failed"
debug_error_string = "{"created":"@1589048831.622482169","description":"Failed to pick subchannel","file":"src/core/ext/filters/client_channel/client_channel.cc","file_line":3981,"referenced_errors":[{"created":"@1589048831.622477405","description":"Resolver transient failure","file":"src/core/ext/filters/client_channel/resolving_lb_policy.cc","file_line":214,"referenced_errors":[{"created":"@1589048831.622475840","description":"DNS resolution failed","file":"src/core/ext/filters/client_channel/resolver/dns/c_ares/dns_resolver_ares.cc","file_line":357,"grpc_status":14,"referenced_errors":[{"created":"@1589048831.622465149","description":"C-ares status is not ARES_SUCCESS: Misformatted domain name","file":"src/core/ext/filters/client_channel/resolver/dns/c_ares/grpc_ares_wrapper.cc","file_line":244,"referenced_errors":[{"created":"@1589048831.622442761","description":"C-ares status is not ARES_SUCCESS: Misformatted domain name","file":"src/core/ext/filters/client_channel/resolver/dns/c_ares/grpc_ares_wrapper.cc","file_line":244}]}]}]}]}"
>
INFO:apache_beam.runners.worker.data_plane:Creating client data channel for localhost:37669
Exception in thread read_grpc_client_inputs:
Traceback (most recent call last):
File "/usr/lib/python3.5/threading.py", line 914, in _bootstrap_inner
self.run()
File "/usr/lib/python3.5/threading.py", line 862, in run
self._target(*self._args, **self._kwargs)
File "<https://builds.apache.org/job/beam_PostCommit_Python35_VR_Flink/ws/src/sdks/python/apache_beam/runners/worker/data_plane.py",> line 545, in <lambda>
target=lambda: self._read_inputs(elements_iterator),
File "<https://builds.apache.org/job/beam_PostCommit_Python35_VR_Flink/ws/src/sdks/python/apache_beam/runners/worker/data_plane.py",> line 528, in _read_inputs
for elements in elements_iterator:
File "<https://builds.apache.org/job/beam_PostCommit_Python35_VR_Flink/ws/src/build/gradleenv/2022703439/lib/python3.5/site-packages/grpc/_channel.py",> line 416, in __next__
return self._next()
File "<https://builds.apache.org/job/beam_PostCommit_Python35_VR_Flink/ws/src/build/gradleenv/2022703439/lib/python3.5/site-packages/grpc/_channel.py",> line 689, in _next
raise self
grpc._channel._MultiThreadedRendezvous: <_MultiThreadedRendezvous of RPC that terminated with:
status = StatusCode.UNAVAILABLE
details = "DNS resolution failed"
debug_error_string = "{"created":"@1589048831.622482169","description":"Failed to pick subchannel","file":"src/core/ext/filters/client_channel/client_channel.cc","file_line":3981,"referenced_errors":[{"created":"@1589048831.622477405","description":"Resolver transient failure","file":"src/core/ext/filters/client_channel/resolving_lb_policy.cc","file_line":214,"referenced_errors":[{"created":"@1589048831.622475840","description":"DNS resolution failed","file":"src/core/ext/filters/client_channel/resolver/dns/c_ares/dns_resolver_ares.cc","file_line":357,"grpc_status":14,"referenced_errors":[{"created":"@1589048831.622465149","description":"C-ares status is not ARES_SUCCESS: Misformatted domain name","file":"src/core/ext/filters/client_channel/resolver/dns/c_ares/grpc_ares_wrapper.cc","file_line":244,"referenced_errors":[{"created":"@1589048831.622442761","description":"C-ares status is not ARES_SUCCESS: Misformatted domain name","file":"src/core/ext/filters/client_channel/resolver/dns/c_ares/grpc_ares_wrapper.cc","file_line":244}]}]}]}]}"
>
INFO:apache_beam.runners.worker.sdk_worker:No more requests from control plane
INFO:apache_beam.runners.worker.sdk_worker:SDK Harness waiting for in-flight requests to complete
INFO:apache_beam.runners.worker.data_plane:Closing all cached grpc data channels.
INFO:apache_beam.runners.worker.sdk_worker:Closing all cached gRPC state handlers.
[assert_that/Group/GroupByKey -> [3]assert_that/{Group, Unkey, Match} (1/2)] WARN org.apache.beam.sdk.fn.data.BeamFnDataGrpcMultiplexer - Hanged up for unknown endpoint.
INFO:apache_beam.runners.worker.sdk_worker:Done consuming work.
INFO:apache_beam.runners.portability.portable_runner:Job state changed to DONE
.INFO:apache_beam.runners.worker.worker_pool_main:Listening for workers at localhost:45877
WARNING:root:Make sure that locally built Python SDK docker image has Python 3.5 interpreter.
INFO:root:Using Python SDK docker image: apache/beam_python3.5_sdk:2.22.0.dev. If the image is not available at local, we will try to pull from hub.docker.com
INFO:apache_beam.runners.portability.portable_runner:Environment "LOOPBACK" has started a component necessary for the execution. Be sure to run the pipeline using
with Pipeline() as p:
p.apply(..)
This ensures that the pipeline finishes before this program exits.
INFO:apache_beam.runners.portability.portable_runner:Job state changed to STOPPED
INFO:apache_beam.runners.portability.portable_runner:Job state changed to STARTING
INFO:apache_beam.runners.portability.portable_runner:Job state changed to RUNNING
[flink-runner-job-invoker] WARN org.apache.flink.runtime.webmonitor.WebMonitorUtils - Log file environment variable 'log.file' is not set.
[flink-runner-job-invoker] WARN org.apache.flink.runtime.webmonitor.WebMonitorUtils - JobManager log files are unavailable in the web dashboard. Log file location not found in environment variable 'log.file' or configuration key 'Key: 'web.log.path' , default: null (fallback keys: [{key=jobmanager.web.log.path, isDeprecated=true}])'.
INFO:apache_beam.runners.worker.statecache:Creating state cache with size 0
INFO:apache_beam.runners.worker.sdk_worker:Creating insecure control channel for localhost:34509.
INFO:apache_beam.runners.worker.sdk_worker:Control channel established.
INFO:apache_beam.runners.worker.sdk_worker:Initializing SDKHarness with unbounded number of workers.
INFO:apache_beam.runners.worker.sdk_worker:Creating insecure state channel for localhost:45137.
INFO:apache_beam.runners.worker.sdk_worker:State channel established.
INFO:apache_beam.runners.worker.data_plane:Creating client data channel for
ERROR:apache_beam.runners.worker.data_plane:Failed to read inputs in the data plane.
Traceback (most recent call last):
File "<https://builds.apache.org/job/beam_PostCommit_Python35_VR_Flink/ws/src/sdks/python/apache_beam/runners/worker/data_plane.py",> line 528, in _read_inputs
for elements in elements_iterator:
File "<https://builds.apache.org/job/beam_PostCommit_Python35_VR_Flink/ws/src/build/gradleenv/2022703439/lib/python3.5/site-packages/grpc/_channel.py",> line 416, in __next__
return self._next()
File "<https://builds.apache.org/job/beam_PostCommit_Python35_VR_Flink/ws/src/build/gradleenv/2022703439/lib/python3.5/site-packages/grpc/_channel.py",> line 689, in _next
raise self
grpc._channel._MultiThreadedRendezvous: <_MultiThreadedRendezvous of RPC that terminated with:
status = StatusCode.UNAVAILABLE
details = "DNS resolution failed"
debug_error_string = "{"created":"@1589048838.073628596","description":"Failed to pick subchannel","file":"src/core/ext/filters/client_channel/client_channel.cc","file_line":3981,"referenced_errors":[{"created":"@1589048838.073623996","description":"Resolver transient failure","file":"src/core/ext/filters/client_channel/resolving_lb_policy.cc","file_line":214,"referenced_errors":[{"created":"@1589048838.073622078","description":"DNS resolution failed","file":"src/core/ext/filters/client_channel/resolver/dns/c_ares/dns_resolver_ares.cc","file_line":357,"grpc_status":14,"referenced_errors":[{"created":"@1589048838.073610843","description":"C-ares status is not ARES_SUCCESS: Misformatted domain name","file":"src/core/ext/filters/client_channel/resolver/dns/c_ares/grpc_ares_wrapper.cc","file_line":244,"referenced_errors":[{"created":"@1589048838.073587679","description":"C-ares status is not ARES_SUCCESS: Misformatted domain name","file":"src/core/ext/filters/client_channel/resolver/dns/c_ares/grpc_ares_wrapper.cc","file_line":244}]}]}]}]}"
>
INFO:apache_beam.runners.worker.data_plane:Creating client data channel for localhost:45749
Exception in thread read_grpc_client_inputs:
Traceback (most recent call last):
File "/usr/lib/python3.5/threading.py", line 914, in _bootstrap_inner
self.run()
File "/usr/lib/python3.5/threading.py", line 862, in run
self._target(*self._args, **self._kwargs)
File "<https://builds.apache.org/job/beam_PostCommit_Python35_VR_Flink/ws/src/sdks/python/apache_beam/runners/worker/data_plane.py",> line 545, in <lambda>
target=lambda: self._read_inputs(elements_iterator),
File "<https://builds.apache.org/job/beam_PostCommit_Python35_VR_Flink/ws/src/sdks/python/apache_beam/runners/worker/data_plane.py",> line 528, in _read_inputs
for elements in elements_iterator:
File "<https://builds.apache.org/job/beam_PostCommit_Python35_VR_Flink/ws/src/build/gradleenv/2022703439/lib/python3.5/site-packages/grpc/_channel.py",> line 416, in __next__
return self._next()
File "<https://builds.apache.org/job/beam_PostCommit_Python35_VR_Flink/ws/src/build/gradleenv/2022703439/lib/python3.5/site-packages/grpc/_channel.py",> line 689, in _next
raise self
grpc._channel._MultiThreadedRendezvous: <_MultiThreadedRendezvous of RPC that terminated with:
status = StatusCode.UNAVAILABLE
details = "DNS resolution failed"
debug_error_string = "{"created":"@1589048838.073628596","description":"Failed to pick subchannel","file":"src/core/ext/filters/client_channel/client_channel.cc","file_line":3981,"referenced_errors":[{"created":"@1589048838.073623996","description":"Resolver transient failure","file":"src/core/ext/filters/client_channel/resolving_lb_policy.cc","file_line":214,"referenced_errors":[{"created":"@1589048838.073622078","description":"DNS resolution failed","file":"src/core/ext/filters/client_channel/resolver/dns/c_ares/dns_resolver_ares.cc","file_line":357,"grpc_status":14,"referenced_errors":[{"created":"@1589048838.073610843","description":"C-ares status is not ARES_SUCCESS: Misformatted domain name","file":"src/core/ext/filters/client_channel/resolver/dns/c_ares/grpc_ares_wrapper.cc","file_line":244,"referenced_errors":[{"created":"@1589048838.073587679","description":"C-ares status is not ARES_SUCCESS: Misformatted domain name","file":"src/core/ext/filters/client_channel/resolver/dns/c_ares/grpc_ares_wrapper.cc","file_line":244}]}]}]}]}"
>
INFO:apache_beam.runners.worker.sdk_worker:No more requests from control plane
INFO:apache_beam.runners.worker.sdk_worker:SDK Harness waiting for in-flight requests to complete
INFO:apache_beam.runners.worker.data_plane:Closing all cached grpc data channels.
INFO:apache_beam.runners.worker.sdk_worker:Closing all cached gRPC state handlers.
[grpc-default-executor-3] WARN org.apache.beam.sdk.fn.data.BeamFnDataGrpcMultiplexer - Hanged up for unknown endpoint.
[assert_that/Group/GroupByKey -> [3]assert_that/{Group, Unkey, Match} (1/2)] WARN org.apache.beam.sdk.fn.data.BeamFnDataGrpcMultiplexer - Hanged up for unknown endpoint.
INFO:apache_beam.runners.worker.sdk_worker:Done consuming work.
INFO:apache_beam.runners.portability.portable_runner:Job state changed to DONE
.INFO:__main__:removing conf dir: /tmp/flinktest-confoe97n1wa
==================== Timed out after 60 seconds. ====================
# Thread: <Thread(wait_until_finish_read, started daemon 139890079549184)>
# Thread: <Thread(Thread-173, started daemon 139890096334592)>
# Thread: <_MainThread(MainThread, started 139892327229184)>
# Thread: <_Worker(Thread-57, started daemon 139891178469120)>
# Thread: <Thread(Thread-159, started daemon 139890054371072)>
# Thread: <_Worker(Thread-10, started daemon 139891161683712)>
# Thread: <_Worker(Thread-80, started daemon 139891170076416)>
# Thread: <_Worker(Thread-35, started daemon 139891153291008)>
# Thread: <_Worker(Thread-102, started daemon 139890087941888)>
# Thread: <_Worker(Thread-137, started daemon 139891144111872)>
======================================================================
ERROR: test_external_transforms (__main__.FlinkRunnerTest)
----------------------------------------------------------------------
Traceback (most recent call last):
File "<https://builds.apache.org/job/beam_PostCommit_Python35_VR_Flink/ws/src/sdks/python/apache_beam/runners/portability/flink_runner_test.py",> line 219, in test_external_transforms
expansion_service=get_expansion_service()))
File "<https://builds.apache.org/job/beam_PostCommit_Python35_VR_Flink/ws/src/sdks/python/apache_beam/pipeline.py",> line 550, in __exit__
self.run().wait_until_finish()
File "<https://builds.apache.org/job/beam_PostCommit_Python35_VR_Flink/ws/src/sdks/python/apache_beam/runners/portability/portable_runner.py",> line 580, in wait_until_finish
self._observe_state(message_thread)
File "<https://builds.apache.org/job/beam_PostCommit_Python35_VR_Flink/ws/src/sdks/python/apache_beam/runners/portability/portable_runner.py",> line 589, in _observe_state
for state_response in self._state_stream:
File "<https://builds.apache.org/job/beam_PostCommit_Python35_VR_Flink/ws/src/build/gradleenv/2022703439/lib/python3.5/site-packages/grpc/_channel.py",> line 416, in __next__
return self._next()
File "<https://builds.apache.org/job/beam_PostCommit_Python35_VR_Flink/ws/src/build/gradleenv/2022703439/lib/python3.5/site-packages/grpc/_channel.py",> line 697, in _next
_common.wait(self._state.condition.wait, _response_ready)
File "<https://builds.apache.org/job/beam_PostCommit_Python35_VR_Flink/ws/src/build/gradleenv/2022703439/lib/python3.5/site-packages/grpc/_common.py",> line 139, in wait
_wait_once(wait_fn, MAXIMUM_WAIT_TIMEOUT, spin_cb)
File "<https://builds.apache.org/job/beam_PostCommit_Python35_VR_Flink/ws/src/build/gradleenv/2022703439/lib/python3.5/site-packages/grpc/_common.py",> line 104, in _wait_once
wait_fn(timeout=timeout)
File "/usr/lib/python3.5/threading.py", line 297, in wait
gotit = waiter.acquire(True, timeout)
File "<https://builds.apache.org/job/beam_PostCommit_Python35_VR_Flink/ws/src/sdks/python/apache_beam/runners/portability/portable_runner_test.py",> line 82, in handler
raise BaseException(msg)
BaseException: Timed out after 60 seconds.
----------------------------------------------------------------------
Ran 80 tests in 548.913s
FAILED (errors=1, skipped=16)
> Task :sdks:python:test-suites:portable:py35:flinkCompatibilityMatrixStreamingPreOptimizeLOOPBACK FAILED
FAILURE: Build completed with 2 failures.
1: Task failed with an exception.
-----------
* Where:
Script '<https://builds.apache.org/job/beam_PostCommit_Python35_VR_Flink/ws/src/sdks/python/test-suites/portable/common.gradle'> line: 55
* What went wrong:
Execution failed for task ':sdks:python:test-suites:portable:py35:flinkCompatibilityMatrixStreamingLOOPBACK'.
> Process 'command 'sh'' finished with non-zero exit value 1
* Try:
Run with --stacktrace option to get the stack trace. Run with --info or --debug option to get more log output. Run with --scan to get full insights.
==============================================================================
2: Task failed with an exception.
-----------
* Where:
Script '<https://builds.apache.org/job/beam_PostCommit_Python35_VR_Flink/ws/src/sdks/python/test-suites/portable/common.gradle'> line: 55
* What went wrong:
Execution failed for task ':sdks:python:test-suites:portable:py35:flinkCompatibilityMatrixStreamingPreOptimizeLOOPBACK'.
> Process 'command 'sh'' finished with non-zero exit value 1
* Try:
Run with --stacktrace option to get the stack trace. Run with --info or --debug option to get more log output. Run with --scan to get full insights.
==============================================================================
* Get more help at https://help.gradle.org
Deprecated Gradle features were used in this build, making it incompatible with Gradle 6.0.
Use '--warning-mode all' to show the individual deprecation warnings.
See https://docs.gradle.org/5.2.1/userguide/command_line_interface.html#sec:command_line_warnings
BUILD FAILED in 26m 58s
78 actionable tasks: 58 executed, 19 from cache, 1 up-to-date
Publishing build scan...
https://gradle.com/s/dzwiyrlwhohiy
Build step 'Invoke Gradle script' changed build result to FAILURE
Build step 'Invoke Gradle script' marked build as failure
---------------------------------------------------------------------
To unsubscribe, e-mail: builds-unsubscribe@beam.apache.org
For additional commands, e-mail: builds-help@beam.apache.org