You are viewing a plain text version of this content. The canonical link for it is here.
Posted to builds@cassandra.apache.org by Apache Jenkins Server <je...@builds.apache.org> on 2023/06/28 00:21:02 UTC
Build complete: Cassandra-trunk #1611 [UNSTABLE] eda0bcbefaf38e4069ac6db3a00937d778090083
-------------------------------------------------------------------------------
Build Cassandra-trunk #1611 Still Unstable
URL: https://ci-cassandra.apache.org/job/Cassandra-trunk/1611/
-------------------------------------------------------------------------------
Changes:
No changes
-------------------------------------------------------------------------------
Failed Tests:
5 tests failed.
FAILED: dtest-novnode.commitlog_test.TestCommitLog.test_commitlog_replay_on_startup
FAILED: dtest-novnode.replace_address_test.TestReplaceAddress.test_fail_when_seed
FAILED: dtest-offheap.repair_tests.incremental_repair_test.TestIncRepair.test_multiple_full_repairs_lcs
FAILED: dtest-offheap.cqlsh_tests.test_cqlsh_copy.TestCqlshCopy.test_bulk_round_trip_default
FAILED: dtest.bootstrap_test.TestBootstrap.test_simultaneous_bootstrap
-------------------------------------------------------------------------------
For complete test report and logs see https://nightlies.apache.org/cassandra/Cassandra-trunk/1611/