You are viewing a plain text version of this content. The canonical link for it is here.
Posted to builds@solr.apache.org by Policeman Jenkins Server <je...@thetaphi.de> on 2023/11/21 05:03:03 UTC

[JENKINS] Solr-main-Linux (64bit/openj9/jdk-17.0.8) - Build # 15712 - Unstable!

Build: https://jenkins.thetaphi.de/job/Solr-main-Linux/15712/
Java: 64bit/openj9/jdk-17.0.8 -XX:-UseCompressedOops -Xgcpolicy:optthruput

5 tests failed.
FAILED:  org.apache.solr.core.BlobRepositoryMockingTest.testGetBlobIncrRefByUrl

Error Message:
org.mockito.exceptions.base.MockitoException: 
Mockito cannot mock this class: class java.util.concurrent.ConcurrentHashMap.

Mockito can only mock non-private & non-final classes, but the root cause of this error might be different.
Please check the full stacktrace to understand what the issue is.
If you're still not sure why you're getting this error, please open an issue on GitHub.


Java               : 17
JVM vendor name    : Eclipse OpenJ9
JVM vendor version : openj9-0.40.0
JVM name           : Eclipse OpenJ9 VM
JVM version        : 17.0.8.1+1
JVM info           : JRE 17 Linux amd64-64-Bit 20230824_549 (JIT enabled, AOT enabled)
OpenJ9   - d12d10c9e
OMR      - e80bff83b
JCL      - 8ecf238a124 based on jdk-17.0.8.1+1
OS name            : Linux
OS version         : 6.2.0-36-generic


Underlying exception : java.security.AccessControlException: Access denied ("java.lang.RuntimePermission" "accessClassInPackage.openj9.internal.criu")

Stack Trace:
org.mockito.exceptions.base.MockitoException: 
Mockito cannot mock this class: class java.util.concurrent.ConcurrentHashMap.

Mockito can only mock non-private & non-final classes, but the root cause of this error might be different.
Please check the full stacktrace to understand what the issue is.
If you're still not sure why you're getting this error, please open an issue on GitHub.


Java               : 17
JVM vendor name    : Eclipse OpenJ9
JVM vendor version : openj9-0.40.0
JVM name           : Eclipse OpenJ9 VM
JVM version        : 17.0.8.1+1
JVM info           : JRE 17 Linux amd64-64-Bit 20230824_549 (JIT enabled, AOT enabled)
OpenJ9   - d12d10c9e
OMR      - e80bff83b
JCL      - 8ecf238a124 based on jdk-17.0.8.1+1
OS name            : Linux
OS version         : 6.2.0-36-generic


Underlying exception : java.security.AccessControlException: Access denied ("java.lang.RuntimePermission" "accessClassInPackage.openj9.internal.criu")
	at __randomizedtesting.SeedInfo.seed([CBD3BEA3714144F3:131596F64B8191E8]:0)
	at app//org.apache.solr.core.BlobRepositoryMockingTest.<init>(BlobRepositoryMockingTest.java:52)
	at java.base@17.0.8.1/jdk.internal.reflect.NativeConstructorAccessorImpl.newInstance0(Native Method)
	at java.base@17.0.8.1/jdk.internal.reflect.NativeConstructorAccessorImpl.newInstance(NativeConstructorAccessorImpl.java:77)
	at java.base@17.0.8.1/jdk.internal.reflect.DelegatingConstructorAccessorImpl.newInstance(DelegatingConstructorAccessorImpl.java:45)
	at java.base@17.0.8.1/java.lang.reflect.Constructor.newInstanceWithCaller(Constructor.java:499)
	at java.base@17.0.8.1/java.lang.reflect.Constructor.newInstance(Constructor.java:480)
	at app//com.carrotsearch.randomizedtesting.RandomizedRunner$NewInstanceProvider.newInstance(RandomizedRunner.java:1588)
	at app//com.carrotsearch.randomizedtesting.RandomizedRunner.runSingleTest(RandomizedRunner.java:941)
	at app//com.carrotsearch.randomizedtesting.RandomizedRunner$5.evaluate(RandomizedRunner.java:840)
	at app//com.carrotsearch.randomizedtesting.RandomizedRunner$6.evaluate(RandomizedRunner.java:891)
	at app//com.carrotsearch.randomizedtesting.RandomizedRunner$7.evaluate(RandomizedRunner.java:902)
	at app//com.carrotsearch.randomizedtesting.rules.StatementAdapter.evaluate(StatementAdapter.java:36)
	at app//com.carrotsearch.randomizedtesting.rules.StatementAdapter.evaluate(StatementAdapter.java:36)
	at app//org.apache.lucene.tests.util.AbstractBeforeAfterRule$1.evaluate(AbstractBeforeAfterRule.java:43)
	at app//com.carrotsearch.randomizedtesting.rules.SystemPropertiesRestoreRule$1.evaluate(SystemPropertiesRestoreRule.java:80)
	at app//org.junit.rules.RunRules.evaluate(RunRules.java:20)
	at app//org.apache.lucene.tests.util.AbstractBeforeAfterRule$1.evaluate(AbstractBeforeAfterRule.java:43)
	at app//com.carrotsearch.randomizedtesting.rules.StatementAdapter.evaluate(StatementAdapter.java:36)
	at app//org.apache.lucene.tests.util.TestRuleStoreClassName$1.evaluate(TestRuleStoreClassName.java:38)
	at app//com.carrotsearch.randomizedtesting.rules.NoShadowingOrOverridesOnMethodsRule$1.evaluate(NoShadowingOrOverridesOnMethodsRule.java:40)
	at app//com.carrotsearch.randomizedtesting.rules.NoShadowingOrOverridesOnMethodsRule$1.evaluate(NoShadowingOrOverridesOnMethodsRule.java:40)
	at app//com.carrotsearch.randomizedtesting.rules.StatementAdapter.evaluate(StatementAdapter.java:36)
	at app//com.carrotsearch.randomizedtesting.rules.StatementAdapter.evaluate(StatementAdapter.java:36)
	at app//org.apache.lucene.tests.util.TestRuleAssertionsRequired$1.evaluate(TestRuleAssertionsRequired.java:53)
	at app//org.apache.lucene.tests.util.AbstractBeforeAfterRule$1.evaluate(AbstractBeforeAfterRule.java:43)
	at app//org.apache.lucene.tests.util.TestRuleMarkFailure$1.evaluate(TestRuleMarkFailure.java:44)
	at app//org.apache.lucene.tests.util.TestRuleIgnoreAfterMaxFailures$1.evaluate(TestRuleIgnoreAfterMaxFailures.java:60)
	at app//org.apache.lucene.tests.util.TestRuleIgnoreTestSuites$1.evaluate(TestRuleIgnoreTestSuites.java:47)
	at app//org.junit.rules.RunRules.evaluate(RunRules.java:20)
	at app//com.carrotsearch.randomizedtesting.rules.StatementAdapter.evaluate(StatementAdapter.java:36)
	at app//com.carrotsearch.randomizedtesting.ThreadLeakControl$StatementRunner.run(ThreadLeakControl.java:390)
	at app//com.carrotsearch.randomizedtesting.ThreadLeakControl.lambda$forkTimeoutingTask$0(ThreadLeakControl.java:850)
	at java.base@17.0.8.1/java.lang.Thread.run(Thread.java:857)
Caused by: java.security.AccessControlException: Access denied ("java.lang.RuntimePermission" "accessClassInPackage.openj9.internal.criu")
	at java.base@17.0.8.1/java.security.AccessController.throwACE(AccessController.java:177)
	at java.base@17.0.8.1/java.security.AccessController.checkPermissionHelper(AccessController.java:239)
	at java.base@17.0.8.1/java.security.AccessController.checkPermission(AccessController.java:386)
	at java.base@17.0.8.1/java.lang.SecurityManager.checkPermission(SecurityManager.java:416)
	at java.base@17.0.8.1/java.lang.SecurityManager.checkPackageAccess(SecurityManager.java:1332)
	at java.base@17.0.8.1/java.lang.Class.checkMemberAccess(Class.java:286)
	at java.base@17.0.8.1/java.lang.Class.getDeclaredConstructors(Class.java:869)
	at app//net.bytebuddy.description.method.MethodList$ForLoadedMethods.<init>(MethodList.java:151)
	at app//net.bytebuddy.description.type.TypeDescription$ForLoadedType.getDeclaredMethods(TypeDescription.java:8940)
	at app//net.bytebuddy.implementation.attribute.AnnotationAppender$Default.handle(AnnotationAppender.java:312)
	at app//net.bytebuddy.implementation.attribute.AnnotationAppender$Default.doAppend(AnnotationAppender.java:377)
	at app//net.bytebuddy.implementation.attribute.AnnotationAppender$Default.append(AnnotationAppender.java:354)
	at app//net.bytebuddy.implementation.attribute.MethodAttributeAppender$ForInstrumentedMethod.apply(MethodAttributeAppender.java:203)
	at app//net.bytebuddy.implementation.attribute.MethodAttributeAppender$Compound.apply(MethodAttributeAppender.java:484)
	at app//net.bytebuddy.dynamic.scaffold.TypeWriter$MethodPool$Record$ForDefinedMethod$WithBody.applyAttributes(TypeWriter.java:723)
	at app//net.bytebuddy.dynamic.scaffold.TypeWriter$MethodPool$Record$ForDefinedMethod$WithBody.applyBody(TypeWriter.java:713)
	at app//net.bytebuddy.dynamic.scaffold.TypeWriter$MethodPool$Record$ForDefinedMethod.apply(TypeWriter.java:622)
	at app//net.bytebuddy.dynamic.scaffold.TypeWriter$Default$ForCreation.create(TypeWriter.java:6043)
	at app//net.bytebuddy.dynamic.scaffold.TypeWriter$Default.make(TypeWriter.java:2224)
	at app//net.bytebuddy.dynamic.DynamicType$Builder$AbstractBase$UsingTypeWriter.make(DynamicType.java:4055)
	at app//net.bytebuddy.dynamic.DynamicType$Builder$AbstractBase.make(DynamicType.java:3739)
	at app//org.mockito.internal.creation.bytebuddy.SubclassBytecodeGenerator.mockClass(SubclassBytecodeGenerator.java:296)
	at app//org.mockito.internal.creation.bytebuddy.TypeCachingBytecodeGenerator.lambda$mockClass$0(TypeCachingBytecodeGenerator.java:78)
	at app//net.bytebuddy.TypeCache.findOrInsert(TypeCache.java:168)
	at app//net.bytebuddy.TypeCache$WithInlineExpunction.findOrInsert(TypeCache.java:399)
	at app//net.bytebuddy.TypeCache.findOrInsert(TypeCache.java:190)
	at app//net.bytebuddy.TypeCache$WithInlineExpunction.findOrInsert(TypeCache.java:410)
	at app//org.mockito.internal.creation.bytebuddy.TypeCachingBytecodeGenerator.mockClass(TypeCachingBytecodeGenerator.java:75)
	at app//org.mockito.internal.creation.bytebuddy.SubclassByteBuddyMockMaker.createMockType(SubclassByteBuddyMockMaker.java:77)
	at app//org.mockito.internal.creation.bytebuddy.SubclassByteBuddyMockMaker.createMock(SubclassByteBuddyMockMaker.java:43)
	at app//org.mockito.internal.creation.bytebuddy.ByteBuddyMockMaker.createMock(ByteBuddyMockMaker.java:41)
	at app//org.mockito.internal.util.MockUtil.createMock(MockUtil.java:99)
	at app//org.mockito.internal.MockitoCore.mock(MockitoCore.java:88)
	at app//org.mockito.Mockito.mock(Mockito.java:2101)
	at app//org.mockito.Mockito.mock(Mockito.java:2016)
	... 33 more


FAILED:  org.apache.solr.core.BlobRepositoryMockingTest.testGetBlobIncrRefString

Error Message:
org.mockito.exceptions.base.MockitoException: 
Mockito cannot mock this class: class java.util.concurrent.ConcurrentHashMap.

Mockito can only mock non-private & non-final classes, but the root cause of this error might be different.
Please check the full stacktrace to understand what the issue is.
If you're still not sure why you're getting this error, please open an issue on GitHub.


Java               : 17
JVM vendor name    : Eclipse OpenJ9
JVM vendor version : openj9-0.40.0
JVM name           : Eclipse OpenJ9 VM
JVM version        : 17.0.8.1+1
JVM info           : JRE 17 Linux amd64-64-Bit 20230824_549 (JIT enabled, AOT enabled)
OpenJ9   - d12d10c9e
OMR      - e80bff83b
JCL      - 8ecf238a124 based on jdk-17.0.8.1+1
OS name            : Linux
OS version         : 6.2.0-36-generic


Underlying exception : java.security.AccessControlException: Access denied ("java.lang.RuntimePermission" "accessClassInPackage.openj9.internal.criu")

Stack Trace:
org.mockito.exceptions.base.MockitoException: 
Mockito cannot mock this class: class java.util.concurrent.ConcurrentHashMap.

Mockito can only mock non-private & non-final classes, but the root cause of this error might be different.
Please check the full stacktrace to understand what the issue is.
If you're still not sure why you're getting this error, please open an issue on GitHub.


Java               : 17
JVM vendor name    : Eclipse OpenJ9
JVM vendor version : openj9-0.40.0
JVM name           : Eclipse OpenJ9 VM
JVM version        : 17.0.8.1+1
JVM info           : JRE 17 Linux amd64-64-Bit 20230824_549 (JIT enabled, AOT enabled)
OpenJ9   - d12d10c9e
OMR      - e80bff83b
JCL      - 8ecf238a124 based on jdk-17.0.8.1+1
OS name            : Linux
OS version         : 6.2.0-36-generic


Underlying exception : java.security.AccessControlException: Access denied ("java.lang.RuntimePermission" "accessClassInPackage.openj9.internal.criu")
	at __randomizedtesting.SeedInfo.seed([CBD3BEA3714144F3:BDC2CB818E6FE123]:0)
	at app//org.apache.solr.core.BlobRepositoryMockingTest.<init>(BlobRepositoryMockingTest.java:52)
	at java.base@17.0.8.1/jdk.internal.reflect.NativeConstructorAccessorImpl.newInstance0(Native Method)
	at java.base@17.0.8.1/jdk.internal.reflect.NativeConstructorAccessorImpl.newInstance(NativeConstructorAccessorImpl.java:77)
	at java.base@17.0.8.1/jdk.internal.reflect.DelegatingConstructorAccessorImpl.newInstance(DelegatingConstructorAccessorImpl.java:45)
	at java.base@17.0.8.1/java.lang.reflect.Constructor.newInstanceWithCaller(Constructor.java:499)
	at java.base@17.0.8.1/java.lang.reflect.Constructor.newInstance(Constructor.java:480)
	at app//com.carrotsearch.randomizedtesting.RandomizedRunner$NewInstanceProvider.newInstance(RandomizedRunner.java:1588)
	at app//com.carrotsearch.randomizedtesting.RandomizedRunner.runSingleTest(RandomizedRunner.java:941)
	at app//com.carrotsearch.randomizedtesting.RandomizedRunner$5.evaluate(RandomizedRunner.java:840)
	at app//com.carrotsearch.randomizedtesting.RandomizedRunner$6.evaluate(RandomizedRunner.java:891)
	at app//com.carrotsearch.randomizedtesting.RandomizedRunner$7.evaluate(RandomizedRunner.java:902)
	at app//com.carrotsearch.randomizedtesting.rules.StatementAdapter.evaluate(StatementAdapter.java:36)
	at app//com.carrotsearch.randomizedtesting.rules.StatementAdapter.evaluate(StatementAdapter.java:36)
	at app//org.apache.lucene.tests.util.AbstractBeforeAfterRule$1.evaluate(AbstractBeforeAfterRule.java:43)
	at app//com.carrotsearch.randomizedtesting.rules.SystemPropertiesRestoreRule$1.evaluate(SystemPropertiesRestoreRule.java:80)
	at app//org.junit.rules.RunRules.evaluate(RunRules.java:20)
	at app//org.apache.lucene.tests.util.AbstractBeforeAfterRule$1.evaluate(AbstractBeforeAfterRule.java:43)
	at app//com.carrotsearch.randomizedtesting.rules.StatementAdapter.evaluate(StatementAdapter.java:36)
	at app//org.apache.lucene.tests.util.TestRuleStoreClassName$1.evaluate(TestRuleStoreClassName.java:38)
	at app//com.carrotsearch.randomizedtesting.rules.NoShadowingOrOverridesOnMethodsRule$1.evaluate(NoShadowingOrOverridesOnMethodsRule.java:40)
	at app//com.carrotsearch.randomizedtesting.rules.NoShadowingOrOverridesOnMethodsRule$1.evaluate(NoShadowingOrOverridesOnMethodsRule.java:40)
	at app//com.carrotsearch.randomizedtesting.rules.StatementAdapter.evaluate(StatementAdapter.java:36)
	at app//com.carrotsearch.randomizedtesting.rules.StatementAdapter.evaluate(StatementAdapter.java:36)
	at app//org.apache.lucene.tests.util.TestRuleAssertionsRequired$1.evaluate(TestRuleAssertionsRequired.java:53)
	at app//org.apache.lucene.tests.util.AbstractBeforeAfterRule$1.evaluate(AbstractBeforeAfterRule.java:43)
	at app//org.apache.lucene.tests.util.TestRuleMarkFailure$1.evaluate(TestRuleMarkFailure.java:44)
	at app//org.apache.lucene.tests.util.TestRuleIgnoreAfterMaxFailures$1.evaluate(TestRuleIgnoreAfterMaxFailures.java:60)
	at app//org.apache.lucene.tests.util.TestRuleIgnoreTestSuites$1.evaluate(TestRuleIgnoreTestSuites.java:47)
	at app//org.junit.rules.RunRules.evaluate(RunRules.java:20)
	at app//com.carrotsearch.randomizedtesting.rules.StatementAdapter.evaluate(StatementAdapter.java:36)
	at app//com.carrotsearch.randomizedtesting.ThreadLeakControl$StatementRunner.run(ThreadLeakControl.java:390)
	at app//com.carrotsearch.randomizedtesting.ThreadLeakControl.lambda$forkTimeoutingTask$0(ThreadLeakControl.java:850)
	at java.base@17.0.8.1/java.lang.Thread.run(Thread.java:857)
Caused by: java.security.AccessControlException: Access denied ("java.lang.RuntimePermission" "accessClassInPackage.openj9.internal.criu")
	at java.base@17.0.8.1/java.security.AccessController.throwACE(AccessController.java:177)
	at java.base@17.0.8.1/java.security.AccessController.checkPermissionHelper(AccessController.java:239)
	at java.base@17.0.8.1/java.security.AccessController.checkPermission(AccessController.java:386)
	at java.base@17.0.8.1/java.lang.SecurityManager.checkPermission(SecurityManager.java:416)
	at java.base@17.0.8.1/java.lang.SecurityManager.checkPackageAccess(SecurityManager.java:1332)
	at java.base@17.0.8.1/java.lang.Class.checkMemberAccess(Class.java:286)
	at java.base@17.0.8.1/java.lang.Class.getDeclaredConstructors(Class.java:869)
	at app//net.bytebuddy.description.method.MethodList$ForLoadedMethods.<init>(MethodList.java:151)
	at app//net.bytebuddy.description.type.TypeDescription$ForLoadedType.getDeclaredMethods(TypeDescription.java:8940)
	at app//net.bytebuddy.implementation.attribute.AnnotationAppender$Default.handle(AnnotationAppender.java:312)
	at app//net.bytebuddy.implementation.attribute.AnnotationAppender$Default.doAppend(AnnotationAppender.java:377)
	at app//net.bytebuddy.implementation.attribute.AnnotationAppender$Default.append(AnnotationAppender.java:354)
	at app//net.bytebuddy.implementation.attribute.MethodAttributeAppender$ForInstrumentedMethod.apply(MethodAttributeAppender.java:203)
	at app//net.bytebuddy.implementation.attribute.MethodAttributeAppender$Compound.apply(MethodAttributeAppender.java:484)
	at app//net.bytebuddy.dynamic.scaffold.TypeWriter$MethodPool$Record$ForDefinedMethod$WithBody.applyAttributes(TypeWriter.java:723)
	at app//net.bytebuddy.dynamic.scaffold.TypeWriter$MethodPool$Record$ForDefinedMethod$WithBody.applyBody(TypeWriter.java:713)
	at app//net.bytebuddy.dynamic.scaffold.TypeWriter$MethodPool$Record$ForDefinedMethod.apply(TypeWriter.java:622)
	at app//net.bytebuddy.dynamic.scaffold.TypeWriter$Default$ForCreation.create(TypeWriter.java:6043)
	at app//net.bytebuddy.dynamic.scaffold.TypeWriter$Default.make(TypeWriter.java:2224)
	at app//net.bytebuddy.dynamic.DynamicType$Builder$AbstractBase$UsingTypeWriter.make(DynamicType.java:4055)
	at app//net.bytebuddy.dynamic.DynamicType$Builder$AbstractBase.make(DynamicType.java:3739)
	at app//org.mockito.internal.creation.bytebuddy.SubclassBytecodeGenerator.mockClass(SubclassBytecodeGenerator.java:296)
	at app//org.mockito.internal.creation.bytebuddy.TypeCachingBytecodeGenerator.lambda$mockClass$0(TypeCachingBytecodeGenerator.java:78)
	at app//net.bytebuddy.TypeCache.findOrInsert(TypeCache.java:168)
	at app//net.bytebuddy.TypeCache$WithInlineExpunction.findOrInsert(TypeCache.java:399)
	at app//net.bytebuddy.TypeCache.findOrInsert(TypeCache.java:190)
	at app//net.bytebuddy.TypeCache$WithInlineExpunction.findOrInsert(TypeCache.java:410)
	at app//org.mockito.internal.creation.bytebuddy.TypeCachingBytecodeGenerator.mockClass(TypeCachingBytecodeGenerator.java:75)
	at app//org.mockito.internal.creation.bytebuddy.SubclassByteBuddyMockMaker.createMockType(SubclassByteBuddyMockMaker.java:77)
	at app//org.mockito.internal.creation.bytebuddy.SubclassByteBuddyMockMaker.createMock(SubclassByteBuddyMockMaker.java:43)
	at app//org.mockito.internal.creation.bytebuddy.ByteBuddyMockMaker.createMock(ByteBuddyMockMaker.java:41)
	at app//org.mockito.internal.util.MockUtil.createMock(MockUtil.java:99)
	at app//org.mockito.internal.MockitoCore.mock(MockitoCore.java:88)
	at app//org.mockito.Mockito.mock(Mockito.java:2101)
	at app//org.mockito.Mockito.mock(Mockito.java:2016)
	... 33 more


FAILED:  org.apache.solr.core.BlobRepositoryMockingTest.testGetBlobIncrRefStringDecoder

Error Message:
org.mockito.exceptions.base.MockitoException: 
Mockito cannot mock this class: class java.util.concurrent.ConcurrentHashMap.

Mockito can only mock non-private & non-final classes, but the root cause of this error might be different.
Please check the full stacktrace to understand what the issue is.
If you're still not sure why you're getting this error, please open an issue on GitHub.


Java               : 17
JVM vendor name    : Eclipse OpenJ9
JVM vendor version : openj9-0.40.0
JVM name           : Eclipse OpenJ9 VM
JVM version        : 17.0.8.1+1
JVM info           : JRE 17 Linux amd64-64-Bit 20230824_549 (JIT enabled, AOT enabled)
OpenJ9   - d12d10c9e
OMR      - e80bff83b
JCL      - 8ecf238a124 based on jdk-17.0.8.1+1
OS name            : Linux
OS version         : 6.2.0-36-generic


Underlying exception : java.security.AccessControlException: Access denied ("java.lang.RuntimePermission" "accessClassInPackage.openj9.internal.criu")

Stack Trace:
org.mockito.exceptions.base.MockitoException: 
Mockito cannot mock this class: class java.util.concurrent.ConcurrentHashMap.

Mockito can only mock non-private & non-final classes, but the root cause of this error might be different.
Please check the full stacktrace to understand what the issue is.
If you're still not sure why you're getting this error, please open an issue on GitHub.


Java               : 17
JVM vendor name    : Eclipse OpenJ9
JVM vendor version : openj9-0.40.0
JVM name           : Eclipse OpenJ9 VM
JVM version        : 17.0.8.1+1
JVM info           : JRE 17 Linux amd64-64-Bit 20230824_549 (JIT enabled, AOT enabled)
OpenJ9   - d12d10c9e
OMR      - e80bff83b
JCL      - 8ecf238a124 based on jdk-17.0.8.1+1
OS name            : Linux
OS version         : 6.2.0-36-generic


Underlying exception : java.security.AccessControlException: Access denied ("java.lang.RuntimePermission" "accessClassInPackage.openj9.internal.criu")
	at __randomizedtesting.SeedInfo.seed([CBD3BEA3714144F3:9B00747B72DADB3E]:0)
	at app//org.apache.solr.core.BlobRepositoryMockingTest.<init>(BlobRepositoryMockingTest.java:52)
	at java.base@17.0.8.1/jdk.internal.reflect.NativeConstructorAccessorImpl.newInstance0(Native Method)
	at java.base@17.0.8.1/jdk.internal.reflect.NativeConstructorAccessorImpl.newInstance(NativeConstructorAccessorImpl.java:77)
	at java.base@17.0.8.1/jdk.internal.reflect.DelegatingConstructorAccessorImpl.newInstance(DelegatingConstructorAccessorImpl.java:45)
	at java.base@17.0.8.1/java.lang.reflect.Constructor.newInstanceWithCaller(Constructor.java:499)
	at java.base@17.0.8.1/java.lang.reflect.Constructor.newInstance(Constructor.java:480)
	at app//com.carrotsearch.randomizedtesting.RandomizedRunner$NewInstanceProvider.newInstance(RandomizedRunner.java:1588)
	at app//com.carrotsearch.randomizedtesting.RandomizedRunner.runSingleTest(RandomizedRunner.java:941)
	at app//com.carrotsearch.randomizedtesting.RandomizedRunner$5.evaluate(RandomizedRunner.java:840)
	at app//com.carrotsearch.randomizedtesting.RandomizedRunner$6.evaluate(RandomizedRunner.java:891)
	at app//com.carrotsearch.randomizedtesting.RandomizedRunner$7.evaluate(RandomizedRunner.java:902)
	at app//com.carrotsearch.randomizedtesting.rules.StatementAdapter.evaluate(StatementAdapter.java:36)
	at app//com.carrotsearch.randomizedtesting.rules.StatementAdapter.evaluate(StatementAdapter.java:36)
	at app//org.apache.lucene.tests.util.AbstractBeforeAfterRule$1.evaluate(AbstractBeforeAfterRule.java:43)
	at app//com.carrotsearch.randomizedtesting.rules.SystemPropertiesRestoreRule$1.evaluate(SystemPropertiesRestoreRule.java:80)
	at app//org.junit.rules.RunRules.evaluate(RunRules.java:20)
	at app//org.apache.lucene.tests.util.AbstractBeforeAfterRule$1.evaluate(AbstractBeforeAfterRule.java:43)
	at app//com.carrotsearch.randomizedtesting.rules.StatementAdapter.evaluate(StatementAdapter.java:36)
	at app//org.apache.lucene.tests.util.TestRuleStoreClassName$1.evaluate(TestRuleStoreClassName.java:38)
	at app//com.carrotsearch.randomizedtesting.rules.NoShadowingOrOverridesOnMethodsRule$1.evaluate(NoShadowingOrOverridesOnMethodsRule.java:40)
	at app//com.carrotsearch.randomizedtesting.rules.NoShadowingOrOverridesOnMethodsRule$1.evaluate(NoShadowingOrOverridesOnMethodsRule.java:40)
	at app//com.carrotsearch.randomizedtesting.rules.StatementAdapter.evaluate(StatementAdapter.java:36)
	at app//com.carrotsearch.randomizedtesting.rules.StatementAdapter.evaluate(StatementAdapter.java:36)
	at app//org.apache.lucene.tests.util.TestRuleAssertionsRequired$1.evaluate(TestRuleAssertionsRequired.java:53)
	at app//org.apache.lucene.tests.util.AbstractBeforeAfterRule$1.evaluate(AbstractBeforeAfterRule.java:43)
	at app//org.apache.lucene.tests.util.TestRuleMarkFailure$1.evaluate(TestRuleMarkFailure.java:44)
	at app//org.apache.lucene.tests.util.TestRuleIgnoreAfterMaxFailures$1.evaluate(TestRuleIgnoreAfterMaxFailures.java:60)
	at app//org.apache.lucene.tests.util.TestRuleIgnoreTestSuites$1.evaluate(TestRuleIgnoreTestSuites.java:47)
	at app//org.junit.rules.RunRules.evaluate(RunRules.java:20)
	at app//com.carrotsearch.randomizedtesting.rules.StatementAdapter.evaluate(StatementAdapter.java:36)
	at app//com.carrotsearch.randomizedtesting.ThreadLeakControl$StatementRunner.run(ThreadLeakControl.java:390)
	at app//com.carrotsearch.randomizedtesting.ThreadLeakControl.lambda$forkTimeoutingTask$0(ThreadLeakControl.java:850)
	at java.base@17.0.8.1/java.lang.Thread.run(Thread.java:857)
Caused by: java.security.AccessControlException: Access denied ("java.lang.RuntimePermission" "accessClassInPackage.openj9.internal.criu")
	at java.base@17.0.8.1/java.security.AccessController.throwACE(AccessController.java:177)
	at java.base@17.0.8.1/java.security.AccessController.checkPermissionHelper(AccessController.java:239)
	at java.base@17.0.8.1/java.security.AccessController.checkPermission(AccessController.java:386)
	at java.base@17.0.8.1/java.lang.SecurityManager.checkPermission(SecurityManager.java:416)
	at java.base@17.0.8.1/java.lang.SecurityManager.checkPackageAccess(SecurityManager.java:1332)
	at java.base@17.0.8.1/java.lang.Class.checkMemberAccess(Class.java:286)
	at java.base@17.0.8.1/java.lang.Class.getDeclaredConstructors(Class.java:869)
	at app//net.bytebuddy.description.method.MethodList$ForLoadedMethods.<init>(MethodList.java:151)
	at app//net.bytebuddy.description.type.TypeDescription$ForLoadedType.getDeclaredMethods(TypeDescription.java:8940)
	at app//net.bytebuddy.implementation.attribute.AnnotationAppender$Default.handle(AnnotationAppender.java:312)
	at app//net.bytebuddy.implementation.attribute.AnnotationAppender$Default.doAppend(AnnotationAppender.java:377)
	at app//net.bytebuddy.implementation.attribute.AnnotationAppender$Default.append(AnnotationAppender.java:354)
	at app//net.bytebuddy.implementation.attribute.MethodAttributeAppender$ForInstrumentedMethod.apply(MethodAttributeAppender.java:203)
	at app//net.bytebuddy.implementation.attribute.MethodAttributeAppender$Compound.apply(MethodAttributeAppender.java:484)
	at app//net.bytebuddy.dynamic.scaffold.TypeWriter$MethodPool$Record$ForDefinedMethod$WithBody.applyAttributes(TypeWriter.java:723)
	at app//net.bytebuddy.dynamic.scaffold.TypeWriter$MethodPool$Record$ForDefinedMethod$WithBody.applyBody(TypeWriter.java:713)
	at app//net.bytebuddy.dynamic.scaffold.TypeWriter$MethodPool$Record$ForDefinedMethod.apply(TypeWriter.java:622)
	at app//net.bytebuddy.dynamic.scaffold.TypeWriter$Default$ForCreation.create(TypeWriter.java:6043)
	at app//net.bytebuddy.dynamic.scaffold.TypeWriter$Default.make(TypeWriter.java:2224)
	at app//net.bytebuddy.dynamic.DynamicType$Builder$AbstractBase$UsingTypeWriter.make(DynamicType.java:4055)
	at app//net.bytebuddy.dynamic.DynamicType$Builder$AbstractBase.make(DynamicType.java:3739)
	at app//org.mockito.internal.creation.bytebuddy.SubclassBytecodeGenerator.mockClass(SubclassBytecodeGenerator.java:296)
	at app//org.mockito.internal.creation.bytebuddy.TypeCachingBytecodeGenerator.lambda$mockClass$0(TypeCachingBytecodeGenerator.java:78)
	at app//net.bytebuddy.TypeCache.findOrInsert(TypeCache.java:168)
	at app//net.bytebuddy.TypeCache$WithInlineExpunction.findOrInsert(TypeCache.java:399)
	at app//net.bytebuddy.TypeCache.findOrInsert(TypeCache.java:190)
	at app//net.bytebuddy.TypeCache$WithInlineExpunction.findOrInsert(TypeCache.java:410)
	at app//org.mockito.internal.creation.bytebuddy.TypeCachingBytecodeGenerator.mockClass(TypeCachingBytecodeGenerator.java:75)
	at app//org.mockito.internal.creation.bytebuddy.SubclassByteBuddyMockMaker.createMockType(SubclassByteBuddyMockMaker.java:77)
	at app//org.mockito.internal.creation.bytebuddy.SubclassByteBuddyMockMaker.createMock(SubclassByteBuddyMockMaker.java:43)
	at app//org.mockito.internal.creation.bytebuddy.ByteBuddyMockMaker.createMock(ByteBuddyMockMaker.java:41)
	at app//org.mockito.internal.util.MockUtil.createMock(MockUtil.java:99)
	at app//org.mockito.internal.MockitoCore.mock(MockitoCore.java:88)
	at app//org.mockito.Mockito.mock(Mockito.java:2101)
	at app//org.mockito.Mockito.mock(Mockito.java:2016)
	... 33 more


FAILED:  org.apache.solr.core.BlobRepositoryMockingTest.testCloudOnly

Error Message:
org.mockito.exceptions.base.MockitoException: 
Mockito cannot mock this class: class java.util.concurrent.ConcurrentHashMap.

Mockito can only mock non-private & non-final classes, but the root cause of this error might be different.
Please check the full stacktrace to understand what the issue is.
If you're still not sure why you're getting this error, please open an issue on GitHub.


Java               : 17
JVM vendor name    : Eclipse OpenJ9
JVM vendor version : openj9-0.40.0
JVM name           : Eclipse OpenJ9 VM
JVM version        : 17.0.8.1+1
JVM info           : JRE 17 Linux amd64-64-Bit 20230824_549 (JIT enabled, AOT enabled)
OpenJ9   - d12d10c9e
OMR      - e80bff83b
JCL      - 8ecf238a124 based on jdk-17.0.8.1+1
OS name            : Linux
OS version         : 6.2.0-36-generic


Underlying exception : java.security.AccessControlException: Access denied ("java.lang.RuntimePermission" "accessClassInPackage.openj9.internal.criu")

Stack Trace:
org.mockito.exceptions.base.MockitoException: 
Mockito cannot mock this class: class java.util.concurrent.ConcurrentHashMap.

Mockito can only mock non-private & non-final classes, but the root cause of this error might be different.
Please check the full stacktrace to understand what the issue is.
If you're still not sure why you're getting this error, please open an issue on GitHub.


Java               : 17
JVM vendor name    : Eclipse OpenJ9
JVM vendor version : openj9-0.40.0
JVM name           : Eclipse OpenJ9 VM
JVM version        : 17.0.8.1+1
JVM info           : JRE 17 Linux amd64-64-Bit 20230824_549 (JIT enabled, AOT enabled)
OpenJ9   - d12d10c9e
OMR      - e80bff83b
JCL      - 8ecf238a124 based on jdk-17.0.8.1+1
OS name            : Linux
OS version         : 6.2.0-36-generic


Underlying exception : java.security.AccessControlException: Access denied ("java.lang.RuntimePermission" "accessClassInPackage.openj9.internal.criu")
	at __randomizedtesting.SeedInfo.seed([CBD3BEA3714144F3:F902855589A1B3CC]:0)
	at app//org.apache.solr.core.BlobRepositoryMockingTest.<init>(BlobRepositoryMockingTest.java:52)
	at java.base@17.0.8.1/jdk.internal.reflect.NativeConstructorAccessorImpl.newInstance0(Native Method)
	at java.base@17.0.8.1/jdk.internal.reflect.NativeConstructorAccessorImpl.newInstance(NativeConstructorAccessorImpl.java:77)
	at java.base@17.0.8.1/jdk.internal.reflect.DelegatingConstructorAccessorImpl.newInstance(DelegatingConstructorAccessorImpl.java:45)
	at java.base@17.0.8.1/java.lang.reflect.Constructor.newInstanceWithCaller(Constructor.java:499)
	at java.base@17.0.8.1/java.lang.reflect.Constructor.newInstance(Constructor.java:480)
	at app//com.carrotsearch.randomizedtesting.RandomizedRunner$NewInstanceProvider.newInstance(RandomizedRunner.java:1588)
	at app//com.carrotsearch.randomizedtesting.RandomizedRunner.runSingleTest(RandomizedRunner.java:941)
	at app//com.carrotsearch.randomizedtesting.RandomizedRunner$5.evaluate(RandomizedRunner.java:840)
	at app//com.carrotsearch.randomizedtesting.RandomizedRunner$6.evaluate(RandomizedRunner.java:891)
	at app//com.carrotsearch.randomizedtesting.RandomizedRunner$7.evaluate(RandomizedRunner.java:902)
	at app//com.carrotsearch.randomizedtesting.rules.StatementAdapter.evaluate(StatementAdapter.java:36)
	at app//com.carrotsearch.randomizedtesting.rules.StatementAdapter.evaluate(StatementAdapter.java:36)
	at app//org.apache.lucene.tests.util.AbstractBeforeAfterRule$1.evaluate(AbstractBeforeAfterRule.java:43)
	at app//com.carrotsearch.randomizedtesting.rules.SystemPropertiesRestoreRule$1.evaluate(SystemPropertiesRestoreRule.java:80)
	at app//org.junit.rules.RunRules.evaluate(RunRules.java:20)
	at app//org.apache.lucene.tests.util.AbstractBeforeAfterRule$1.evaluate(AbstractBeforeAfterRule.java:43)
	at app//com.carrotsearch.randomizedtesting.rules.StatementAdapter.evaluate(StatementAdapter.java:36)
	at app//org.apache.lucene.tests.util.TestRuleStoreClassName$1.evaluate(TestRuleStoreClassName.java:38)
	at app//com.carrotsearch.randomizedtesting.rules.NoShadowingOrOverridesOnMethodsRule$1.evaluate(NoShadowingOrOverridesOnMethodsRule.java:40)
	at app//com.carrotsearch.randomizedtesting.rules.NoShadowingOrOverridesOnMethodsRule$1.evaluate(NoShadowingOrOverridesOnMethodsRule.java:40)
	at app//com.carrotsearch.randomizedtesting.rules.StatementAdapter.evaluate(StatementAdapter.java:36)
	at app//com.carrotsearch.randomizedtesting.rules.StatementAdapter.evaluate(StatementAdapter.java:36)
	at app//org.apache.lucene.tests.util.TestRuleAssertionsRequired$1.evaluate(TestRuleAssertionsRequired.java:53)
	at app//org.apache.lucene.tests.util.AbstractBeforeAfterRule$1.evaluate(AbstractBeforeAfterRule.java:43)
	at app//org.apache.lucene.tests.util.TestRuleMarkFailure$1.evaluate(TestRuleMarkFailure.java:44)
	at app//org.apache.lucene.tests.util.TestRuleIgnoreAfterMaxFailures$1.evaluate(TestRuleIgnoreAfterMaxFailures.java:60)
	at app//org.apache.lucene.tests.util.TestRuleIgnoreTestSuites$1.evaluate(TestRuleIgnoreTestSuites.java:47)
	at app//org.junit.rules.RunRules.evaluate(RunRules.java:20)
	at app//com.carrotsearch.randomizedtesting.rules.StatementAdapter.evaluate(StatementAdapter.java:36)
	at app//com.carrotsearch.randomizedtesting.ThreadLeakControl$StatementRunner.run(ThreadLeakControl.java:390)
	at app//com.carrotsearch.randomizedtesting.ThreadLeakControl.lambda$forkTimeoutingTask$0(ThreadLeakControl.java:850)
	at java.base@17.0.8.1/java.lang.Thread.run(Thread.java:857)
Caused by: java.security.AccessControlException: Access denied ("java.lang.RuntimePermission" "accessClassInPackage.openj9.internal.criu")
	at java.base@17.0.8.1/java.security.AccessController.throwACE(AccessController.java:177)
	at java.base@17.0.8.1/java.security.AccessController.checkPermissionHelper(AccessController.java:239)
	at java.base@17.0.8.1/java.security.AccessController.checkPermission(AccessController.java:386)
	at java.base@17.0.8.1/java.lang.SecurityManager.checkPermission(SecurityManager.java:416)
	at java.base@17.0.8.1/java.lang.SecurityManager.checkPackageAccess(SecurityManager.java:1332)
	at java.base@17.0.8.1/java.lang.Class.checkMemberAccess(Class.java:286)
	at java.base@17.0.8.1/java.lang.Class.getDeclaredConstructors(Class.java:869)
	at app//net.bytebuddy.description.method.MethodList$ForLoadedMethods.<init>(MethodList.java:151)
	at app//net.bytebuddy.description.type.TypeDescription$ForLoadedType.getDeclaredMethods(TypeDescription.java:8940)
	at app//net.bytebuddy.implementation.attribute.AnnotationAppender$Default.handle(AnnotationAppender.java:312)
	at app//net.bytebuddy.implementation.attribute.AnnotationAppender$Default.doAppend(AnnotationAppender.java:377)
	at app//net.bytebuddy.implementation.attribute.AnnotationAppender$Default.append(AnnotationAppender.java:354)
	at app//net.bytebuddy.implementation.attribute.MethodAttributeAppender$ForInstrumentedMethod.apply(MethodAttributeAppender.java:203)
	at app//net.bytebuddy.implementation.attribute.MethodAttributeAppender$Compound.apply(MethodAttributeAppender.java:484)
	at app//net.bytebuddy.dynamic.scaffold.TypeWriter$MethodPool$Record$ForDefinedMethod$WithBody.applyAttributes(TypeWriter.java:723)
	at app//net.bytebuddy.dynamic.scaffold.TypeWriter$MethodPool$Record$ForDefinedMethod$WithBody.applyBody(TypeWriter.java:713)
	at app//net.bytebuddy.dynamic.scaffold.TypeWriter$MethodPool$Record$ForDefinedMethod.apply(TypeWriter.java:622)
	at app//net.bytebuddy.dynamic.scaffold.TypeWriter$Default$ForCreation.create(TypeWriter.java:6043)
	at app//net.bytebuddy.dynamic.scaffold.TypeWriter$Default.make(TypeWriter.java:2224)
	at app//net.bytebuddy.dynamic.DynamicType$Builder$AbstractBase$UsingTypeWriter.make(DynamicType.java:4055)
	at app//net.bytebuddy.dynamic.DynamicType$Builder$AbstractBase.make(DynamicType.java:3739)
	at app//org.mockito.internal.creation.bytebuddy.SubclassBytecodeGenerator.mockClass(SubclassBytecodeGenerator.java:296)
	at app//org.mockito.internal.creation.bytebuddy.TypeCachingBytecodeGenerator.lambda$mockClass$0(TypeCachingBytecodeGenerator.java:78)
	at app//net.bytebuddy.TypeCache.findOrInsert(TypeCache.java:168)
	at app//net.bytebuddy.TypeCache$WithInlineExpunction.findOrInsert(TypeCache.java:399)
	at app//net.bytebuddy.TypeCache.findOrInsert(TypeCache.java:190)
	at app//net.bytebuddy.TypeCache$WithInlineExpunction.findOrInsert(TypeCache.java:410)
	at app//org.mockito.internal.creation.bytebuddy.TypeCachingBytecodeGenerator.mockClass(TypeCachingBytecodeGenerator.java:75)
	at app//org.mockito.internal.creation.bytebuddy.SubclassByteBuddyMockMaker.createMockType(SubclassByteBuddyMockMaker.java:77)
	at app//org.mockito.internal.creation.bytebuddy.SubclassByteBuddyMockMaker.createMock(SubclassByteBuddyMockMaker.java:43)
	at app//org.mockito.internal.creation.bytebuddy.ByteBuddyMockMaker.createMock(ByteBuddyMockMaker.java:41)
	at app//org.mockito.internal.util.MockUtil.createMock(MockUtil.java:99)
	at app//org.mockito.internal.MockitoCore.mock(MockitoCore.java:88)
	at app//org.mockito.Mockito.mock(Mockito.java:2101)
	at app//org.mockito.Mockito.mock(Mockito.java:2016)
	... 33 more


FAILED:  org.apache.solr.core.BlobRepositoryMockingTest.testCachedAlready

Error Message:
org.mockito.exceptions.base.MockitoException: 
Mockito cannot mock this class: class java.util.concurrent.ConcurrentHashMap.

Mockito can only mock non-private & non-final classes, but the root cause of this error might be different.
Please check the full stacktrace to understand what the issue is.
If you're still not sure why you're getting this error, please open an issue on GitHub.


Java               : 17
JVM vendor name    : Eclipse OpenJ9
JVM vendor version : openj9-0.40.0
JVM name           : Eclipse OpenJ9 VM
JVM version        : 17.0.8.1+1
JVM info           : JRE 17 Linux amd64-64-Bit 20230824_549 (JIT enabled, AOT enabled)
OpenJ9   - d12d10c9e
OMR      - e80bff83b
JCL      - 8ecf238a124 based on jdk-17.0.8.1+1
OS name            : Linux
OS version         : 6.2.0-36-generic


Underlying exception : java.security.AccessControlException: Access denied ("java.lang.RuntimePermission" "accessClassInPackage.openj9.internal.criu")

Stack Trace:
org.mockito.exceptions.base.MockitoException: 
Mockito cannot mock this class: class java.util.concurrent.ConcurrentHashMap.

Mockito can only mock non-private & non-final classes, but the root cause of this error might be different.
Please check the full stacktrace to understand what the issue is.
If you're still not sure why you're getting this error, please open an issue on GitHub.


Java               : 17
JVM vendor name    : Eclipse OpenJ9
JVM vendor version : openj9-0.40.0
JVM name           : Eclipse OpenJ9 VM
JVM version        : 17.0.8.1+1
JVM info           : JRE 17 Linux amd64-64-Bit 20230824_549 (JIT enabled, AOT enabled)
OpenJ9   - d12d10c9e
OMR      - e80bff83b
JCL      - 8ecf238a124 based on jdk-17.0.8.1+1
OS name            : Linux
OS version         : 6.2.0-36-generic


Underlying exception : java.security.AccessControlException: Access denied ("java.lang.RuntimePermission" "accessClassInPackage.openj9.internal.criu")
	at __randomizedtesting.SeedInfo.seed([CBD3BEA3714144F3:FC109D8D51091872]:0)
	at app//org.apache.solr.core.BlobRepositoryMockingTest.<init>(BlobRepositoryMockingTest.java:52)
	at java.base@17.0.8.1/jdk.internal.reflect.NativeConstructorAccessorImpl.newInstance0(Native Method)
	at java.base@17.0.8.1/jdk.internal.reflect.NativeConstructorAccessorImpl.newInstance(NativeConstructorAccessorImpl.java:77)
	at java.base@17.0.8.1/jdk.internal.reflect.DelegatingConstructorAccessorImpl.newInstance(DelegatingConstructorAccessorImpl.java:45)
	at java.base@17.0.8.1/java.lang.reflect.Constructor.newInstanceWithCaller(Constructor.java:499)
	at java.base@17.0.8.1/java.lang.reflect.Constructor.newInstance(Constructor.java:480)
	at app//com.carrotsearch.randomizedtesting.RandomizedRunner$NewInstanceProvider.newInstance(RandomizedRunner.java:1588)
	at app//com.carrotsearch.randomizedtesting.RandomizedRunner.runSingleTest(RandomizedRunner.java:941)
	at app//com.carrotsearch.randomizedtesting.RandomizedRunner$5.evaluate(RandomizedRunner.java:840)
	at app//com.carrotsearch.randomizedtesting.RandomizedRunner$6.evaluate(RandomizedRunner.java:891)
	at app//com.carrotsearch.randomizedtesting.RandomizedRunner$7.evaluate(RandomizedRunner.java:902)
	at app//com.carrotsearch.randomizedtesting.rules.StatementAdapter.evaluate(StatementAdapter.java:36)
	at app//com.carrotsearch.randomizedtesting.rules.StatementAdapter.evaluate(StatementAdapter.java:36)
	at app//org.apache.lucene.tests.util.AbstractBeforeAfterRule$1.evaluate(AbstractBeforeAfterRule.java:43)
	at app//com.carrotsearch.randomizedtesting.rules.SystemPropertiesRestoreRule$1.evaluate(SystemPropertiesRestoreRule.java:80)
	at app//org.junit.rules.RunRules.evaluate(RunRules.java:20)
	at app//org.apache.lucene.tests.util.AbstractBeforeAfterRule$1.evaluate(AbstractBeforeAfterRule.java:43)
	at app//com.carrotsearch.randomizedtesting.rules.StatementAdapter.evaluate(StatementAdapter.java:36)
	at app//org.apache.lucene.tests.util.TestRuleStoreClassName$1.evaluate(TestRuleStoreClassName.java:38)
	at app//com.carrotsearch.randomizedtesting.rules.NoShadowingOrOverridesOnMethodsRule$1.evaluate(NoShadowingOrOverridesOnMethodsRule.java:40)
	at app//com.carrotsearch.randomizedtesting.rules.NoShadowingOrOverridesOnMethodsRule$1.evaluate(NoShadowingOrOverridesOnMethodsRule.java:40)
	at app//com.carrotsearch.randomizedtesting.rules.StatementAdapter.evaluate(StatementAdapter.java:36)
	at app//com.carrotsearch.randomizedtesting.rules.StatementAdapter.evaluate(StatementAdapter.java:36)
	at app//org.apache.lucene.tests.util.TestRuleAssertionsRequired$1.evaluate(TestRuleAssertionsRequired.java:53)
	at app//org.apache.lucene.tests.util.AbstractBeforeAfterRule$1.evaluate(AbstractBeforeAfterRule.java:43)
	at app//org.apache.lucene.tests.util.TestRuleMarkFailure$1.evaluate(TestRuleMarkFailure.java:44)
	at app//org.apache.lucene.tests.util.TestRuleIgnoreAfterMaxFailures$1.evaluate(TestRuleIgnoreAfterMaxFailures.java:60)
	at app//org.apache.lucene.tests.util.TestRuleIgnoreTestSuites$1.evaluate(TestRuleIgnoreTestSuites.java:47)
	at app//org.junit.rules.RunRules.evaluate(RunRules.java:20)
	at app//com.carrotsearch.randomizedtesting.rules.StatementAdapter.evaluate(StatementAdapter.java:36)
	at app//com.carrotsearch.randomizedtesting.ThreadLeakControl$StatementRunner.run(ThreadLeakControl.java:390)
	at app//com.carrotsearch.randomizedtesting.ThreadLeakControl.lambda$forkTimeoutingTask$0(ThreadLeakControl.java:850)
	at java.base@17.0.8.1/java.lang.Thread.run(Thread.java:857)
Caused by: java.security.AccessControlException: Access denied ("java.lang.RuntimePermission" "accessClassInPackage.openj9.internal.criu")
	at java.base@17.0.8.1/java.security.AccessController.throwACE(AccessController.java:177)
	at java.base@17.0.8.1/java.security.AccessController.checkPermissionHelper(AccessController.java:239)
	at java.base@17.0.8.1/java.security.AccessController.checkPermission(AccessController.java:386)
	at java.base@17.0.8.1/java.lang.SecurityManager.checkPermission(SecurityManager.java:416)
	at java.base@17.0.8.1/java.lang.SecurityManager.checkPackageAccess(SecurityManager.java:1332)
	at java.base@17.0.8.1/java.lang.Class.checkMemberAccess(Class.java:286)
	at java.base@17.0.8.1/java.lang.Class.getDeclaredConstructors(Class.java:869)
	at app//net.bytebuddy.description.method.MethodList$ForLoadedMethods.<init>(MethodList.java:151)
	at app//net.bytebuddy.description.type.TypeDescription$ForLoadedType.getDeclaredMethods(TypeDescription.java:8940)
	at app//net.bytebuddy.implementation.attribute.AnnotationAppender$Default.handle(AnnotationAppender.java:312)
	at app//net.bytebuddy.implementation.attribute.AnnotationAppender$Default.doAppend(AnnotationAppender.java:377)
	at app//net.bytebuddy.implementation.attribute.AnnotationAppender$Default.append(AnnotationAppender.java:354)
	at app//net.bytebuddy.implementation.attribute.MethodAttributeAppender$ForInstrumentedMethod.apply(MethodAttributeAppender.java:203)
	at app//net.bytebuddy.implementation.attribute.MethodAttributeAppender$Compound.apply(MethodAttributeAppender.java:484)
	at app//net.bytebuddy.dynamic.scaffold.TypeWriter$MethodPool$Record$ForDefinedMethod$WithBody.applyAttributes(TypeWriter.java:723)
	at app//net.bytebuddy.dynamic.scaffold.TypeWriter$MethodPool$Record$ForDefinedMethod$WithBody.applyBody(TypeWriter.java:713)
	at app//net.bytebuddy.dynamic.scaffold.TypeWriter$MethodPool$Record$ForDefinedMethod.apply(TypeWriter.java:622)
	at app//net.bytebuddy.dynamic.scaffold.TypeWriter$Default$ForCreation.create(TypeWriter.java:6043)
	at app//net.bytebuddy.dynamic.scaffold.TypeWriter$Default.make(TypeWriter.java:2224)
	at app//net.bytebuddy.dynamic.DynamicType$Builder$AbstractBase$UsingTypeWriter.make(DynamicType.java:4055)
	at app//net.bytebuddy.dynamic.DynamicType$Builder$AbstractBase.make(DynamicType.java:3739)
	at app//org.mockito.internal.creation.bytebuddy.SubclassBytecodeGenerator.mockClass(SubclassBytecodeGenerator.java:296)
	at app//org.mockito.internal.creation.bytebuddy.TypeCachingBytecodeGenerator.lambda$mockClass$0(TypeCachingBytecodeGenerator.java:78)
	at app//net.bytebuddy.TypeCache.findOrInsert(TypeCache.java:168)
	at app//net.bytebuddy.TypeCache$WithInlineExpunction.findOrInsert(TypeCache.java:399)
	at app//net.bytebuddy.TypeCache.findOrInsert(TypeCache.java:190)
	at app//net.bytebuddy.TypeCache$WithInlineExpunction.findOrInsert(TypeCache.java:410)
	at app//org.mockito.internal.creation.bytebuddy.TypeCachingBytecodeGenerator.mockClass(TypeCachingBytecodeGenerator.java:75)
	at app//org.mockito.internal.creation.bytebuddy.SubclassByteBuddyMockMaker.createMockType(SubclassByteBuddyMockMaker.java:77)
	at app//org.mockito.internal.creation.bytebuddy.SubclassByteBuddyMockMaker.createMock(SubclassByteBuddyMockMaker.java:43)
	at app//org.mockito.internal.creation.bytebuddy.ByteBuddyMockMaker.createMock(ByteBuddyMockMaker.java:41)
	at app//org.mockito.internal.util.MockUtil.createMock(MockUtil.java:99)
	at app//org.mockito.internal.MockitoCore.mock(MockitoCore.java:88)
	at app//org.mockito.Mockito.mock(Mockito.java:2101)
	at app//org.mockito.Mockito.mock(Mockito.java:2016)
	... 33 more