You are viewing a plain text version of this content. The canonical link for it is here.
Posted to notifications@maven.apache.org by Apache Jenkins Server <je...@builds.apache.org> on 2012/08/22 17:49:43 UTC

Build failed in Jenkins: core-integration-testing-maven-3-windows #146

See <https://builds.apache.org/job/core-integration-testing-maven-3-windows/146/changes>

Changes:

[krosenvold] o Optimized the cache around the hotspot in interpolation somewhat

------------------------------------------
[...truncated 4535 lines...]
mng3846PomInheritanceUrlAdjustment(itOneParent).............OK (2.7 s)
mng3846PomInheritanceUrlAdjustment(itTwoParents)............OK (2.8 s)
mng3845LimitedPomInheritance(itMNG3845).....................OK (1.8 s)
mng3843PomInheritance(itMNG3843)............................OK (8.4 s)
mng3839PomParsingCoalesceText(itMNG3839)....................OK (2.5 s)
mng3838EqualPluginDeps(itMNG3838)...........................OK (1.5 s)
mng3836PluginConfigInheritance(itMNG3836)...................OK (2.5 s)
mng3833PomInterpolationDataFlowChain(itMNG3833).............OK (2.4 s)
mng3831PomInterpolation(itMNG3831)..........................OK (1.8 s)
mng3827PluginConfig(itMNG3827)..............................OK (1.7 s)
mng3822BasedirAlignedInterpolation(itMNG3822)...............OK (1.8 s)
mng3821EqualPluginExecIds(itMNG3821)........................OK (1.5 s)
mng3819PluginDepPlexusUtils(itMNG3819)......................OK (1.9 s)
mng3814BogusProjectCycle(itMNG3814).........................OK (1.6 s)
mng3813PluginClassPathOrdering(itMNG3813)...................OK (3.6 s)
mng3811ReportingPluginConfigurationInheritance(itMNG3811)...OK (1.8 s)
mng3810BadProfileActivation(itMNG3810Property)..............OK (1.5 s)
mng3808ReportInheritenceOrdering(itMNG3808).................OK (1.7 s)
mng3807PluginConfigExpressionEvaluation(it).................OK (1.9 s)
mng3805ExtensionClassPathOrdering(itMNG3805)................OK (3.9 s)
mng3796ClassImportInconsistency(itMNG3796)..................OK (2.6 s)
mng3775ConflictResolutionBacktracking(itABC)................OK (2.8 s)
mng3775ConflictResolutionBacktracking(itACB)................OK (3.2 s)
mng3775ConflictResolutionBacktracking(itBAC)................OK (2.8 s)
mng3775ConflictResolutionBacktracking(itBCA)................OK (2.9 s)
mng3775ConflictResolutionBacktracking(itCAB)................OK (2.7 s)
mng3775ConflictResolutionBacktracking(itCBA)................OK (3.0 s)
mng3769ExclusionRelocatedTransdeps(itMNG3769)...............OK (2.8 s)
mng3766ToolchainsFromExtension(it)..........................OK (4.9 s)
mng3760BaseUriProperty(itMNG3760)...........................OK (3.0 s)
mng3760BaseUriProperty(itMNG3760SystemPropertyOverride).....OK (2.4 s)
mng3748BadSettingsXml(it)...................................OK (3.8 s)
mng3747PrefixedPathExpression(itMNG3747)....................OK (3.4 s)
mng3746POMPropertyOverride(itMNG3746_UsingDefaultSystemProperty)OK (26.7 s)
mng3746POMPropertyOverride(itMNG3746_UsingCLIProperty)......OK (14.1 s)
mng3743ForkWithPluginManagement(itMNG3743)..................OK (32.8 s)
mng3740SelfReferentialReactorProjects(itMNG3740)............OK (22.4 s)
mng3732ActiveProfiles(itMNG3732)............................OK (3.0 s)
mng3729MultiForkAggregators(itMNG3729)......................OK (11.7 s)
mng3724ExecutionProjectSync(itMNG3724)......................OK (13.2 s)
mng3723ConcreteParentProject(itMNG3723).....................OK (11.3 s)
mng3719PomExecutionOrdering(itMNG3719)......................OK (3.1 s)
mng3716AggregatorForking(itMNG3716).........................OK (16.4 s)
mng3714ToolchainsCliOption(itMNG3714).......................OK (3.4 s)
mng3710PollutedClonedPlugins(itMNG3710_POMInheritance)......OK (10.1 s)
mng3710PollutedClonedPlugins(itMNG3710_OriginalModel).......OK (14.1 s)
mng3704LifecycleExecutorWrapper(itMNG3704)..................SKIPPED - Maven version 3.0.5-SNAPSHOT not in range [2.0.9,3.0-alpha-1)
mng3703ExecutionProjectWithRelativePaths(ForkFromMojo)......OK (17.3 s)
mng3703ExecutionProjectWithRelativePaths(ForkFromReport)....OK (21.9 s)
mng3701ImplicitProfileId(itMNG3701).........................OK (2.3 s)
mng3694ReactorProjectsDynamism(itMNG3694)...................OK (13.1 s)
mng3693PomFileBasedirChange(itMNG3693)......................OK (16.1 s)
mng3684BuildPluginParameter(itMNG3684)......................OK (20.8 s)
mng3680InvalidDependencyPOM(itMNG3680)......................OK (4.5 s)
mng3679PluginExecIdInterpolation(itMNG3679).................OK (2.4 s)
mng3671PluginLevelDepInterpolation(itMNG3671)...............OK (4.8 s)
mng3667ResolveDepsWithBadPomVersion(it).....................OK (3.7 s)
mng3652UserAgentHeader(mng3652_UnConfiguredHttp)............OK (15.1 s)
mng3652UserAgentHeader(mng3652_UnConfiguredDAV).............OK (12.4 s)
mng3652UserAgentHeader(mng3652_ConfigurationInSettingsWithoutUserAgent)OK (11.8 s)
mng3652UserAgentHeader(mng3652_UserAgentConfiguredInSettings)OK (10.3 s)
mng3652UserAgentHeader(mng3652_AdditionnalHttpHeaderConfiguredInSettings)OK (11.6 s)
mng3645POMSyntaxError(it)...................................OK (1.8 s)
mng3642DynamicResources(itMNG3642)..........................OK (3.8 s)
mng3641ProfileActivationWarning(itMNG3641)..................OK (24.7 s)
mng3621UNCInheritedPaths(itMNG3621).........................OK (2.5 s)
mng3607ClassLoadersUseValidUrls(it).........................OK (2.6 s)
mng3600DeploymentModeDefaults(itMNG3600NoSettings)..........OK (3.3 s)
mng3600DeploymentModeDefaults(itMNG3600ServerDefaults)......OK (3.1 s)
mng3600DeploymentModeDefaults(itMNG3600ModesSet)............OK (2.8 s)
mng3599useHttpProxyForWebDAV(itUseHttpProxyForHttp).........OK (7.6 s)
mng3599useHttpProxyForWebDAV(itUseHttpProxyForWebDAV).......OK (6.7 s)
mng3586SystemScopePluginDependency(itFromPlugin)............OK (2.7 s)
mng3586SystemScopePluginDependency(itFromProject)...........OK (2.0 s)
mng3581PluginUsesWagonDependency(it)........................OK (4.3 s)
mng3575HexadecimalOctalPluginParameterConfig(it)............OK (2.1 s)
mng3545ProfileDeactivation(BasicBuildWithDefaultProfiles)...OK (2.9 s)
mng3545ProfileDeactivation(DeactivateDefaultProfilesDash)...OK (2.1 s)
mng3545ProfileDeactivation(DeactivateDefaultProfilesExclamation)OK (2.0 s)
mng3545ProfileDeactivation(DeactivateActivatedByProp).......OK (2.5 s)
mng3545ProfileDeactivation(ActivateThenDeactivate)..........OK (2.7 s)
mng3545ProfileDeactivation(DefaultProfileAutoDeactivation)..OK (2.8 s)
mng3536AppendedAbsolutePaths(itMNG3536).....................OK (12.9 s)
mng3535SelfReferentialProperties(itMNG3535_ShouldSucceed)...OK (2.0 s)
mng3535SelfReferentialProperties(itMNG3535_ShouldFail)......OK (2.0 s)
mng3530DynamicPOMInterpolation(itMNG3530_BuildPath).........SKIPPED - Maven version 3.0.5-SNAPSHOT not in range [2.1.0-M1,3.0-alpha-1)
mng3530DynamicPOMInterpolation(itMNG3530_POMProperty).......SKIPPED - Maven version 3.0.5-SNAPSHOT not in range [2.1.0-M1,3.0-alpha-1)
mng3530DynamicPOMInterpolation(itMNG3530_ResourceDirectoryInterpolation)SKIPPED - Maven version 3.0.5-SNAPSHOT not in range [2.1.0-M1,3.0-alpha-1)
mng3529QuotedCliArg(it).....................................OK (2.2 s)
mng3506ArtifactHandlersFromPlugins(ProjectPackagingUsage)...OK (11.5 s)
mng3503Xpp3Shading(itMNG3503NoLinkageErrors)................OK (2.3 s)
mng3503Xpp3Shading(itMNG3503Xpp3Shading)....................OK (2.2 s)
mng3498ForkToOtherMojo(itMNG3498)...........................OK (9.7 s)
mng3485OverrideWagonExtension(itMNG3485)....................OK (5.2 s)
mng3482DependencyPomInterpolation(itMNG3482)................OK (2.7 s)
mng3477DependencyResolutionErrorMessage(it).................OK (4.2 s)
mng3475BaseAlignedDir(itMNG3475)............................OK (1.8 s)
mng3470StrictCheckumVerificationOfDependencyPom(it).........OK (3.7 s)
mng3461MirrorMatching(itExactMatchDominatesWildcard)........OK (2.7 s)
mng3461MirrorMatching(itExternalWildcard)...................OK (3.3 s)
mng3461MirrorMatching(itNonGreedyWildcard)..................OK (3.2 s)
mng3441MetadataUpdatedFromDeploymentRepository(itMNG3441)...OK (5.2 s)
mng3428PluginDescriptorArtifactsIncomplete(itMNG3428).......SKIPPED - Maven version 3.0.5-SNAPSHOT not in range (2.0.8,3.0-alpha-1)
mng3422ActiveComponentCollection(itMNG3422).................OK (1.9 s)
mng3415JunkRepositoryMetadata(itTransferFailed).............OK (5.4 s)
mng3415JunkRepositoryMetadata(ShouldNotRepeatedlyUpdateOnResourceNotFoundException)OK (5.3 s)
mng3401CLIDefaultExecId(itWithoutPluginManagement)..........OK (2.5 s)
mng3401CLIDefaultExecId(itWithPluginManagement).............OK (2.9 s)
mng3396DependencyManagementForOverConstrainedRanges(itMNG3396)OK (19.8 s)
mng3394POMPluginVersionDominance(itMNG3394a)................OK (2.3 s)
mng3394POMPluginVersionDominance(itMNG3394b)................OK (3.1 s)
mng3380ManagedRelocatedTransdeps(itMNG3380).................OK (3.9 s)
mng3379ParallelArtifactDownloads(itMNG3379).................OK (4.2 s)
mng3372DirectInvocationOfPlugins(itMNG3372).................OK (8.9 s)
mng3372DirectInvocationOfPlugins(DependencyTreeInvocation)..OK (5.3 s)
mng3355TranslatedPathInterpolation(itMNG3355)...............OK (1.9 s)
mng3331ModulePathNormalization(itMNG3331a)..................OK (1.9 s)
mng3331ModulePathNormalization(itMNG3331b)..................OK (1.9 s)
mng3314OfflineSnapshots(itMNG3314)..........................OK (5.9 s)
mng3297DependenciesNotLeakedToMojo(it)......................OK (3.1 s)
mng3288SystemScopeDir(itMNG3288)............................OK (1.8 s)
mng3284UsingCachedPlugins(itMNG3284)........................OK (6.2 s)
mng3271DefaultReportsSuppression(itMNG3271).................SKIPPED - Maven version 3.0.5-SNAPSHOT not in range (2.0.9,2.1.0-M1),(2.1.0-M1,3.0-alpha-1)
mng3221InfiniteForking(itMNG3221a)..........................SKIPPED - Maven version 3.0.5-SNAPSHOT not in range (2.0.8,3.0-alpha-1)
mng3221InfiniteForking(itMNG3221b)..........................SKIPPED - Maven version 3.0.5-SNAPSHOT not in range (2.0.8,3.0-alpha-1)
mng3268MultipleDashPCommandLine(MultipleProfileParams)......OK (4.4 s)
mng3259DepsDroppedInMultiModuleBuild(itMNG3259).............OK (15.4 s)
mng3220ImportScope(itMNG3220a)..............................OK (2.5 s)
mng3220ImportScope(itMNG3220b)..............................OK (2.0 s)
mng3217InterPluginDependency(itMNG3217).....................OK (4.0 s)
mng3208ProfileAwareReactorSorting(it).......................OK (3.4 s)
mng3203DefaultLifecycleExecId(itMNG3203)....................OK (4.6 s)
mng3183LoggingToFile(it)....................................OK (2.4 s)
mng3139UseCachedMetadataOfBlacklistedRepo(itMNG3139)........OK (9.9 s)
mng3133UrlNormalizationNotBeforeInterpolation(it)...........OK (2.6 s)
mng3122ActiveProfilesNoDuplicates(itMNG3122)................OK (4.2 s)
mng3118TestClassPathOrder(it)...............................OK (2.7 s)
mng3106ProfileMultipleActivators(ProfilesWithMultipleActivators)OK (2.1 s)
mng3099SettingsProfilesWithNoPom(it)........................OK (2.0 s)
mng3057VersionExprTransformations(itMNG3057)................SKIPPED - Maven version 3.0.5-SNAPSHOT not in range [2.1.0,2.1.1)
mng3052DepRepoAggregation(itMNG3052)........................OK (2.5 s)
mng3043BestEffortReactorResolution(itTestPhase).............OK (2.6 s)
mng3043BestEffortReactorResolution(itPackagePhase)..........OK (2.7 s)
mng3023ReactorDependencyResolution(itMNG3023A)..............OK (1.9 s)
mng3023ReactorDependencyResolution(itMNG3023B)..............OK (2.3 s)
mng3023ReactorDependencyResolution(itMNG3023C)..............OK (4.1 s)
mng3012CoreClassImport(itMNG3012)...........................OK (2.6 s)
mng3004ReactorFailureBehaviorMultithreaded(itFailFastSingleThread)OK (2.0 s)
mng3004ReactorFailureBehaviorMultithreaded(itFailNeverSingleThread)OK (1.9 s)
mng3004ReactorFailureBehaviorMultithreaded(itFailAtEndSingleThread)OK (2.2 s)
mng3004ReactorFailureBehaviorMultithreaded(itFailNeverTwoThreads)OK (2.2 s)
mng3004ReactorFailureBehaviorMultithreaded(itFailAtEndTwoThreads)OK (2.0 s)
mng2994SnapshotRangeRepository(it)..........................OK (2.2 s)
mng2972OverridePluginDependency(itLifecycleInvocation)......OK (2.0 s)
mng2972OverridePluginDependency(itCommandLineInvocation)....OK (1.8 s)
mng2926PluginPrefixOrder(itMNG2926).........................OK (5.4 s)
mng2921ActiveAttachedArtifacts(itMNG2921)...................OK (3.4 s)
mng2892HideCorePlexusUtils(itMNG2892).......................OK (3.1 s)
mng2883LegacyRepoOffline(ParentUnresolvable)................SKIPPED - Maven version 3.0.5-SNAPSHOT not in range (2.0.9,2.1.0-M1),(2.1.0-M1,3.0-alpha-1)
mng2883LegacyRepoOffline(DependencyUnresolvable)............SKIPPED - Maven version 3.0.5-SNAPSHOT not in range (2.0.9,2.1.0-M1),(2.1.0-M1,3.0-alpha-1)
mng2883LegacyRepoOffline(PluginUnresolvable)................SKIPPED - Maven version 3.0.5-SNAPSHOT not in range (2.0.9,2.1.0-M1),(2.1.0-M1,3.0-alpha-1)
mng2878DefaultReportXmlImport(itMNG2878)....................SKIPPED - Maven version 3.0.5-SNAPSHOT not in range (,3.0-alpha-1)
mng2871PrePackageSubartifactResolution(itMNG2871)...........OK (5.5 s)
mng2865MirrorWildcard(itFileRepo)...........................OK (4.1 s)
mng2865MirrorWildcard(itLocalhostRepo)......................OK (3.9 s)
mng2865MirrorWildcard(itExternalRepo).......................OK (4.8 s)
mng2865MirrorWildcard(itCentralRepo)........................OK (3.5 s)
mng2861RelocationsAndRanges(itMNG2861)......................OK (4.4 s)
mng2848ProfileActivationByEnvironmentVariable(it)...........OK (2.6 s)
mng2843PluginConfigPropertiesInjection(itMNG2843)...........OK (2.5 s)
mng2831CustomArtifactHandlerAndCustomLifecycle(itMNG2831)...OK (3.0 s)
mng2820PomComments(it)......................................OK (2.4 s)
mng2790LastUpdatedMetadata(itMNG2790).......................OK (5.4 s)
mng2749ExtensionAvailableToPlugin(itMNG2749)................OK (2.3 s)
mng2744checksumVerification(itMNG2744)......................OK (3.1 s)
mng2741PluginMetadataResolutionErrorMessage(itPrefix).......OK (9.8 s)
mng2741PluginMetadataResolutionErrorMessage(itVersion)......OK (4.4 s)
mng2739RequiredRepositoryElements(itMNG2739_RepositoryId)...OK (2.7 s)
mng2739RequiredRepositoryElements(itMNG2739_RepositoryUrl)..OK (2.2 s)
mng2738ProfileIdCollidesWithCliOption(it)...................OK (4.7 s)
mng2720SiblingClasspathArtifacts(IT)........................OK (5.3 s)
mng2695OfflinePluginSnapshots(itMNG2695)....................OK (6.4 s)
mng2693SitePluginRealm(it)..................................OK (3.1 s)
mng2690MojoLoadingErrors(NoClassDefFromMojoLoad)............OK (3.0 s)
mng2690MojoLoadingErrors(NoClassDefFromMojoConfiguration)...OK (3.1 s)
mng2690MojoLoadingErrors(MojoComponentLookupException)......OK (2.7 s)
mng2690MojoLoadingErrors(MojoRequirementComponentLookupException)OK (1.8 s)
mng2668UsePluginDependenciesForSorting(itMNG2668)...........OK (2.4 s)
mng2605BogusProfileActivation(itMNG2605)....................OK (2.3 s)
mng2591MergeInheritedPluginConfig(itNoProfile)..............OK (2.2 s)
mng2591MergeInheritedPluginConfig(itWithProfile)............OK (1.9 s)
mng2577SettingsXmlInterpolation(itEnvVars)..................OK (2.1 s)
mng2577SettingsXmlInterpolation(itSystemProps)..............OK (2.0 s)
mng2576MakeLikeReactor(itMakeOnlyList)......................OK (2.1 s)
mng2576MakeLikeReactor(itMakeUpstream)......................OK (2.0 s)
mng2576MakeLikeReactor(itMakeDownstream)....................OK (1.8 s)
mng2576MakeLikeReactor(itMakeBoth)..........................OK (1.7 s)
mng2576MakeLikeReactor(itMatchesByBasedir)..................OK (1.8 s)
mng2576MakeLikeReactor(itMatchesById).......................OK (3.7 s)
mng2576MakeLikeReactor(itMatchesByArtifactId)...............OK (2.8 s)
mng2576MakeLikeReactor(itResumeFrom)........................OK (2.3 s)
mng2562Timestamp(itDefaultFormat)...........................OK (1.7 s)
mng2562Timestamp(itCustomFormat)............................OK (1.8 s)
mng2562Timestamp(itSameValueAcrossModules)..................OK (1.8 s)
mng2539PluginDependenciesComeFromPluginRepos(itMNG2539).....SKIPPED - Maven version 3.0.5-SNAPSHOT not in range (2.0.4,3.0-alpha-3)
mng2486TimestampedDependencyVersionInterpolation(it)........OK (9.2 s)
mng2432PluginPrefixOrder(itMNG2432).........................OK (2.6 s)
mng2387InactiveProxy(it)....................................OK (3.7 s)
mng2363BasedirAwareFileActivator(it)........................OK (2.5 s)
mng2362DeployedPomEncoding(it)..............................OK (3.3 s)
mng2339BadProjectInterpolation(itMNG2339a)..................OK (2.2 s)
mng2339BadProjectInterpolation(itMNG2339b)..................OK (5.2 s)
mng2318LocalParentResolution(itMNG2318).....................OK (2.8 s)
FATAL: hudson.remoting.RequestAbortedException: java.net.SocketException: Socket closed
hudson.remoting.RequestAbortedException: hudson.remoting.RequestAbortedException: java.net.SocketException: Socket closed
	at hudson.remoting.Request.call(Request.java:174)
	at hudson.remoting.Channel.call(Channel.java:663)
	at hudson.remoting.RemoteInvocationHandler.invoke(RemoteInvocationHandler.java:158)
	at $Proxy39.join(Unknown Source)
	at hudson.Launcher$RemoteLauncher$ProcImpl.join(Launcher.java:861)
	at hudson.Launcher$ProcStarter.join(Launcher.java:345)
	at hudson.tasks.Maven.perform(Maven.java:263)
	at hudson.tasks.BuildStepMonitor$1.perform(BuildStepMonitor.java:19)
	at hudson.model.AbstractBuild$AbstractBuildExecution.perform(AbstractBuild.java:717)
	at hudson.model.Build$BuildExecution.build(Build.java:199)
	at hudson.model.Build$BuildExecution.doRun(Build.java:160)
	at hudson.model.AbstractBuild$AbstractBuildExecution.run(AbstractBuild.java:499)
	at hudson.model.Run.execute(Run.java:1488)
	at hudson.model.FreeStyleBuild.run(FreeStyleBuild.java:46)
	at hudson.model.ResourceController.execute(ResourceController.java:88)
	at hudson.model.Executor.run(Executor.java:236)
Caused by: hudson.remoting.RequestAbortedException: java.net.SocketException: Socket closed
	at hudson.remoting.Request.abort(Request.java:299)
	at hudson.remoting.Channel.terminate(Channel.java:719)
	at hudson.remoting.SynchronousCommandTransport$ReaderThread.run(SynchronousCommandTransport.java:69)
Caused by: java.net.SocketException: Socket closed
	at java.net.SocketInputStream.socketRead0(Native Method)
	at java.net.SocketInputStream.read(SocketInputStream.java:150)
	at java.net.SocketInputStream.read(SocketInputStream.java:121)
	at java.io.BufferedInputStream.fill(BufferedInputStream.java:235)
	at java.io.BufferedInputStream.read(BufferedInputStream.java:254)
	at java.io.ObjectInputStream$PeekInputStream.peek(ObjectInputStream.java:2266)
	at java.io.ObjectInputStream$BlockDataInputStream.peek(ObjectInputStream.java:2559)
	at java.io.ObjectInputStream$BlockDataInputStream.peekByte(ObjectInputStream.java:2569)
	at java.io.ObjectInputStream.readObject0(ObjectInputStream.java:1315)
	at java.io.ObjectInputStream.readObject(ObjectInputStream.java:369)
	at hudson.remoting.Command.readFrom(Command.java:90)
	at hudson.remoting.ClassicCommandTransport.read(ClassicCommandTransport.java:59)
	at hudson.remoting.SynchronousCommandTransport$ReaderThread.run(SynchronousCommandTransport.java:48)

Jenkins build is back to normal : core-integration-testing-maven-3-windows #148

Posted by Apache Jenkins Server <je...@builds.apache.org>.
See <https://builds.apache.org/job/core-integration-testing-maven-3-windows/148/changes>


Build failed in Jenkins: core-integration-testing-maven-3-windows #147

Posted by Apache Jenkins Server <je...@builds.apache.org>.
See <https://builds.apache.org/job/core-integration-testing-maven-3-windows/147/>

------------------------------------------
[...truncated 548 lines...]
     [java] [INFO] Checking for local modifications: skipped.
     [java] [INFO] Updating project files from SCM: skipped.
     [java] [INFO] Storing buildNumber: 1376204 at timestamp: 1345664499164
     [java] [INFO] Storing buildScmBranch: trunk
     [java] [INFO] 
     [java] [INFO] --- maven-resources-plugin:2.5:resources (default-resources) @ maven-core ---
     [java] [debug] execute contextualize
     [java] [INFO] Using 'UTF-8' encoding to copy filtered resources.
     [java] [INFO] Copying 16 resources
     [java] [INFO] Copying 3 resources
     [java] [INFO] 
     [java] [INFO] --- maven-compiler-plugin:2.5.1:compile (default-compile) @ maven-core ---
     [java] [INFO] Compiling 298 source files to F:\hudson\hudson-slave\workspace\core-integration-testing-maven-3-windows\maven-3-trunk\maven-core\target\classes
     [java] [INFO] 
     [java] [INFO] --- animal-sniffer-maven-plugin:1.6:check (check-java-1.5-compat) @ maven-core ---
     [java] [INFO] Checking unresolved references to org.codehaus.mojo.signature:java15:1.0
     [java] [INFO] 
     [java] [INFO] --- plexus-component-metadata:1.5.5:generate-metadata (default) @ maven-core ---
     [java] [INFO] Discovered 59 component descriptors(s)
     [java] [INFO] 
     [java] [INFO] --- maven-resources-plugin:2.5:testResources (default-testResources) @ maven-core ---
     [java] [debug] execute contextualize
     [java] [INFO] Using 'UTF-8' encoding to copy filtered resources.
     [java] [INFO] Copying 183 resources
     [java] [INFO] Copying 3 resources
     [java] [INFO] 
     [java] [INFO] --- maven-compiler-plugin:2.5.1:testCompile (default-testCompile) @ maven-core ---
     [java] [INFO] Compiling 72 source files to F:\hudson\hudson-slave\workspace\core-integration-testing-maven-3-windows\maven-3-trunk\maven-core\target\test-classes
     [java] [INFO] 
     [java] [INFO] --- plexus-component-metadata:1.5.5:generate-test-metadata (default) @ maven-core ---
     [java] [INFO] Discovered 4 component descriptors(s)
     [java] [INFO] 
     [java] [INFO] --- maven-surefire-plugin:2.12:test (default-test) @ maven-core ---
     [java] [INFO] Tests are skipped.
     [java] [INFO] 
     [java] [INFO] --- maven-jar-plugin:2.4:jar (default-jar) @ maven-core ---
     [java] [INFO] Building jar: F:\hudson\hudson-slave\workspace\core-integration-testing-maven-3-windows\maven-3-trunk\maven-core\target\maven-core-3.0.5-SNAPSHOT.jar
     [java] [INFO] 
     [java] [INFO] --- maven-site-plugin:3.1:attach-descriptor (attach-descriptor) @ maven-core ---
     [java] [INFO] 
     [java] [INFO] --- maven-install-plugin:2.3.1:install (default-install) @ maven-core ---
     [java] [INFO] Installing F:\hudson\hudson-slave\workspace\core-integration-testing-maven-3-windows\maven-3-trunk\maven-core\target\maven-core-3.0.5-SNAPSHOT.jar to C:\Users\hudson\.m2\repository\org\apache\maven\maven-core\3.0.5-SNAPSHOT\maven-core-3.0.5-SNAPSHOT.jar
     [java] [INFO] Installing F:\hudson\hudson-slave\workspace\core-integration-testing-maven-3-windows\maven-3-trunk\maven-core\pom.xml to C:\Users\hudson\.m2\repository\org\apache\maven\maven-core\3.0.5-SNAPSHOT\maven-core-3.0.5-SNAPSHOT.pom
     [java] [INFO]                                                                         
     [java] [INFO] ------------------------------------------------------------------------
     [java] [INFO] Building Maven Compat 3.0.5-SNAPSHOT
     [java] [INFO] ------------------------------------------------------------------------
     [java] [INFO] 
     [java] [INFO] --- maven-clean-plugin:2.5:clean (default-clean) @ maven-compat ---
     [java] [INFO] Deleting F:\hudson\hudson-slave\workspace\core-integration-testing-maven-3-windows\maven-3-trunk\maven-compat\target
     [java] [INFO] 
     [java] [INFO] --- modello-maven-plugin:1.4.1:java (standard) @ maven-compat ---
     [java] [INFO] outputDirectory: F:\hudson\hudson-slave\workspace\core-integration-testing-maven-3-windows\maven-3-trunk\maven-compat\target\generated-sources\modello
     [java] [INFO] Working on model: src/main/mdo/profiles.mdo
     [java] [INFO] Generating current version: 1.0.0
     [java] [INFO] Working on model: src/main/mdo/paramdoc.mdo
     [java] [INFO] Generating current version: 1.0.0
     [java] [INFO] 
     [java] [INFO] --- modello-maven-plugin:1.4.1:xpp3-reader (standard) @ maven-compat ---
     [java] [INFO] outputDirectory: F:\hudson\hudson-slave\workspace\core-integration-testing-maven-3-windows\maven-3-trunk\maven-compat\target\generated-sources\modello
     [java] [INFO] Working on model: src/main/mdo/profiles.mdo
     [java] [INFO] Generating current version: 1.0.0
     [java] [INFO] Working on model: src/main/mdo/paramdoc.mdo
     [java] [INFO] Generating current version: 1.0.0
     [java] [INFO] 
     [java] [INFO] --- modello-maven-plugin:1.4.1:xpp3-writer (standard) @ maven-compat ---
     [java] [INFO] outputDirectory: F:\hudson\hudson-slave\workspace\core-integration-testing-maven-3-windows\maven-3-trunk\maven-compat\target\generated-sources\modello
     [java] [INFO] Working on model: src/main/mdo/profiles.mdo
     [java] [INFO] Generating current version: 1.0.0
     [java] [INFO] Working on model: src/main/mdo/paramdoc.mdo
     [java] [INFO] Generating current version: 1.0.0
     [java] [INFO] 
     [java] [INFO] --- maven-remote-resources-plugin:1.3:process (default) @ maven-compat ---
     [java] [INFO] 
     [java] [INFO] --- maven-resources-plugin:2.5:resources (default-resources) @ maven-compat ---
     [java] [debug] execute contextualize
     [java] [INFO] Using 'UTF-8' encoding to copy filtered resources.
     [java] [INFO] Copying 4 resources
     [java] [INFO] Copying 3 resources
     [java] [INFO] 
     [java] [INFO] --- maven-compiler-plugin:2.5.1:compile (default-compile) @ maven-compat ---
     [java] [INFO] Compiling 146 source files to F:\hudson\hudson-slave\workspace\core-integration-testing-maven-3-windows\maven-3-trunk\maven-compat\target\classes
     [java] [INFO] 
     [java] [INFO] --- animal-sniffer-maven-plugin:1.6:check (check-java-1.5-compat) @ maven-compat ---
     [java] [INFO] Checking unresolved references to org.codehaus.mojo.signature:java15:1.0
     [java] [INFO] 
     [java] [INFO] --- plexus-component-metadata:1.5.5:generate-metadata (default) @ maven-compat ---
     [java] [INFO] Discovered 34 component descriptors(s)
     [java] [INFO] 
     [java] [INFO] --- maven-resources-plugin:2.5:testResources (default-testResources) @ maven-compat ---
     [java] [debug] execute contextualize
     [java] [INFO] Using 'UTF-8' encoding to copy filtered resources.
     [java] [INFO] Copying 156 resources
     [java] [INFO] Copying 3 resources
     [java] [INFO] 
     [java] [INFO] --- maven-compiler-plugin:2.5.1:testCompile (default-testCompile) @ maven-compat ---
     [java] [INFO] Compiling 71 source files to F:\hudson\hudson-slave\workspace\core-integration-testing-maven-3-windows\maven-3-trunk\maven-compat\target\test-classes
     [java] [INFO] 
     [java] [INFO] --- plexus-component-metadata:1.5.5:generate-test-metadata (default) @ maven-compat ---
     [java] [INFO] Discovered 12 component descriptors(s)
     [java] [INFO] 
     [java] [INFO] --- maven-surefire-plugin:2.12:test (default-test) @ maven-compat ---
     [java] [INFO] Tests are skipped.
     [java] [INFO] 
     [java] [INFO] --- maven-jar-plugin:2.4:jar (default-jar) @ maven-compat ---
     [java] [INFO] Building jar: F:\hudson\hudson-slave\workspace\core-integration-testing-maven-3-windows\maven-3-trunk\maven-compat\target\maven-compat-3.0.5-SNAPSHOT.jar
     [java] [INFO] 
     [java] [INFO] --- maven-site-plugin:3.1:attach-descriptor (attach-descriptor) @ maven-compat ---
     [java] [INFO] 
     [java] [INFO] --- maven-install-plugin:2.3.1:install (default-install) @ maven-compat ---
     [java] [INFO] Installing F:\hudson\hudson-slave\workspace\core-integration-testing-maven-3-windows\maven-3-trunk\maven-compat\target\maven-compat-3.0.5-SNAPSHOT.jar to C:\Users\hudson\.m2\repository\org\apache\maven\maven-compat\3.0.5-SNAPSHOT\maven-compat-3.0.5-SNAPSHOT.jar
     [java] [INFO] Installing F:\hudson\hudson-slave\workspace\core-integration-testing-maven-3-windows\maven-3-trunk\maven-compat\pom.xml to C:\Users\hudson\.m2\repository\org\apache\maven\maven-compat\3.0.5-SNAPSHOT\maven-compat-3.0.5-SNAPSHOT.pom
     [java] [INFO]                                                                         
     [java] [INFO] ------------------------------------------------------------------------
     [java] [INFO] Building Maven Embedder 3.0.5-SNAPSHOT
     [java] [INFO] ------------------------------------------------------------------------
     [java] [INFO] 
     [java] [INFO] --- maven-clean-plugin:2.5:clean (default-clean) @ maven-embedder ---
     [java] [INFO] Deleting F:\hudson\hudson-slave\workspace\core-integration-testing-maven-3-windows\maven-3-trunk\maven-embedder\target
     [java] [INFO] 
     [java] [INFO] --- maven-remote-resources-plugin:1.3:process (default) @ maven-embedder ---
     [java] [INFO] 
     [java] [INFO] --- maven-resources-plugin:2.5:resources (default-resources) @ maven-embedder ---
     [java] [debug] execute contextualize
     [java] [INFO] Using 'UTF-8' encoding to copy filtered resources.
     [java] [INFO] Copying 1 resource
     [java] [INFO] Copying 3 resources
     [java] [INFO] 
     [java] [INFO] --- maven-compiler-plugin:2.5.1:compile (default-compile) @ maven-embedder ---
     [java] [INFO] Compiling 11 source files to F:\hudson\hudson-slave\workspace\core-integration-testing-maven-3-windows\maven-3-trunk\maven-embedder\target\classes
     [java] [INFO] 
     [java] [INFO] --- animal-sniffer-maven-plugin:1.6:check (check-java-1.5-compat) @ maven-embedder ---
     [java] [INFO] Checking unresolved references to org.codehaus.mojo.signature:java15:1.0
     [java] [INFO] 
     [java] [INFO] --- plexus-component-metadata:1.5.5:generate-metadata (default) @ maven-embedder ---
     [java] [INFO] 
     [java] [INFO] --- maven-resources-plugin:2.5:testResources (default-testResources) @ maven-embedder ---
     [java] [debug] execute contextualize
     [java] [INFO] Using 'UTF-8' encoding to copy filtered resources.
     [java] [INFO] Copying 7 resources
     [java] [INFO] Copying 3 resources
     [java] [INFO] 
     [java] [INFO] --- maven-compiler-plugin:2.5.1:testCompile (default-testCompile) @ maven-embedder ---
     [java] [INFO] Compiling 1 source file to F:\hudson\hudson-slave\workspace\core-integration-testing-maven-3-windows\maven-3-trunk\maven-embedder\target\test-classes
     [java] [INFO] 
     [java] [INFO] --- plexus-component-metadata:1.5.5:generate-test-metadata (default) @ maven-embedder ---
     [java] [INFO] 
     [java] [INFO] --- maven-surefire-plugin:2.12:test (default-test) @ maven-embedder ---
     [java] [INFO] Tests are skipped.
     [java] [INFO] 
     [java] [INFO] --- maven-jar-plugin:2.4:jar (default-jar) @ maven-embedder ---
     [java] [INFO] Building jar: F:\hudson\hudson-slave\workspace\core-integration-testing-maven-3-windows\maven-3-trunk\maven-embedder\target\maven-embedder-3.0.5-SNAPSHOT.jar
     [java] [INFO] 
     [java] [INFO] --- maven-site-plugin:3.1:attach-descriptor (attach-descriptor) @ maven-embedder ---
     [java] [INFO] 
     [java] [INFO] --- maven-install-plugin:2.3.1:install (default-install) @ maven-embedder ---
     [java] [INFO] Installing F:\hudson\hudson-slave\workspace\core-integration-testing-maven-3-windows\maven-3-trunk\maven-embedder\target\maven-embedder-3.0.5-SNAPSHOT.jar to C:\Users\hudson\.m2\repository\org\apache\maven\maven-embedder\3.0.5-SNAPSHOT\maven-embedder-3.0.5-SNAPSHOT.jar
     [java] [INFO] Installing F:\hudson\hudson-slave\workspace\core-integration-testing-maven-3-windows\maven-3-trunk\maven-embedder\pom.xml to C:\Users\hudson\.m2\repository\org\apache\maven\maven-embedder\3.0.5-SNAPSHOT\maven-embedder-3.0.5-SNAPSHOT.pom
     [java] [INFO]                                                                         
     [java] [INFO] ------------------------------------------------------------------------
     [java] [INFO] Building Maven Distribution 3.0.5-SNAPSHOT
     [java] [INFO] ------------------------------------------------------------------------
     [java] [INFO] 
     [java] [INFO] --- maven-clean-plugin:2.5:clean (default-clean) @ apache-maven ---
     [java] [INFO] Deleting F:\hudson\hudson-slave\workspace\core-integration-testing-maven-3-windows\maven-3-trunk\apache-maven\target
     [java] [INFO] 
     [java] [INFO] --- maven-remote-resources-plugin:1.3:process (default) @ apache-maven ---
     [java] [INFO] 
     [java] [INFO] --- animal-sniffer-maven-plugin:1.6:check (check-java-1.5-compat) @ apache-maven ---
     [java] [INFO] Checking unresolved references to org.codehaus.mojo.signature:java15:1.0
     [java] [INFO] 
     [java] [INFO] --- maven-compiler-plugin:2.5.1:testCompile (test-compile) @ apache-maven ---
     [java] [INFO] Compiling 1 source file to F:\hudson\hudson-slave\workspace\core-integration-testing-maven-3-windows\maven-3-trunk\apache-maven\target\test-classes
     [java] [INFO] 
     [java] [INFO] --- maven-surefire-plugin:2.12:test (test) @ apache-maven ---
     [java] [INFO] Tests are skipped.
     [java] [INFO] 
     [java] [INFO] --- maven-site-plugin:3.1:attach-descriptor (attach-descriptor) @ apache-maven ---
     [java] [INFO] 
     [java] [INFO] --- maven-assembly-plugin:2.2-beta-5:single (create-distro) @ apache-maven ---
     [java] [INFO] Reading assembly descriptor: src/main/assembly/bin.xml
     [java] [WARNING] The following patterns were never triggered in this artifact exclusion filter:
     [java] o  'junit:junit'
     [java] o  'log4j:log4j'
     [java] o  'commons-logging:commons-logging-api'
     [java] 
     [java] [INFO] Building zip: F:\hudson\hudson-slave\workspace\core-integration-testing-maven-3-windows\maven-3-trunk\apache-maven\target\apache-maven-3.0.5-SNAPSHOT-bin.zip
     [java] [WARNING] The following patterns were never triggered in this artifact exclusion filter:
     [java] o  'junit:junit'
     [java] o  'log4j:log4j'
     [java] o  'commons-logging:commons-logging-api'
     [java] 
     [java] [INFO] Building tar : F:\hudson\hudson-slave\workspace\core-integration-testing-maven-3-windows\maven-3-trunk\apache-maven\target\apache-maven-3.0.5-SNAPSHOT-bin.tar.gz
     [java] [INFO] 
     [java] [INFO] --- maven-install-plugin:2.3.1:install (default-install) @ apache-maven ---
     [java] [INFO] Installing F:\hudson\hudson-slave\workspace\core-integration-testing-maven-3-windows\maven-3-trunk\apache-maven\pom.xml to C:\Users\hudson\.m2\repository\org\apache\maven\apache-maven\3.0.5-SNAPSHOT\apache-maven-3.0.5-SNAPSHOT.pom
     [java] [INFO] Installing F:\hudson\hudson-slave\workspace\core-integration-testing-maven-3-windows\maven-3-trunk\apache-maven\target\apache-maven-3.0.5-SNAPSHOT-site.xml to C:\Users\hudson\.m2\repository\org\apache\maven\apache-maven\3.0.5-SNAPSHOT\apache-maven-3.0.5-SNAPSHOT-site.xml
     [java] [INFO] Installing F:\hudson\hudson-slave\workspace\core-integration-testing-maven-3-windows\maven-3-trunk\apache-maven\target\apache-maven-3.0.5-SNAPSHOT-bin.zip to C:\Users\hudson\.m2\repository\org\apache\maven\apache-maven\3.0.5-SNAPSHOT\apache-maven-3.0.5-SNAPSHOT-bin.zip
     [java] [INFO] Installing F:\hudson\hudson-slave\workspace\core-integration-testing-maven-3-windows\maven-3-trunk\apache-maven\target\apache-maven-3.0.5-SNAPSHOT-bin.tar.gz to C:\Users\hudson\.m2\repository\org\apache\maven\apache-maven\3.0.5-SNAPSHOT\apache-maven-3.0.5-SNAPSHOT-bin.tar.gz
     [java] [INFO] ------------------------------------------------------------------------
     [java] [INFO] Reactor Summary:
     [java] [INFO] 
     [java] [INFO] Apache Maven ...................................... SUCCESS [46.692s]
     [java] [INFO] Maven Model ....................................... SUCCESS [12.441s]
     [java] [INFO] Maven Artifact .................................... SUCCESS [3.606s]
     [java] [INFO] Maven Plugin API .................................. SUCCESS [45.176s]
     [java] [INFO] Maven Model Builder ............................... SUCCESS [25.082s]
     [java] [INFO] Maven Settings .................................... SUCCESS [1.557s]
     [java] [INFO] Maven Settings Builder ............................ SUCCESS [3.284s]
     [java] [INFO] Maven Repository Metadata Model ................... SUCCESS [2.041s]
     [java] [INFO] Maven Aether Provider ............................. SUCCESS [1.818s]
     [java] [INFO] Maven Core ........................................ SUCCESS [23.400s]
     [java] [INFO] Maven Compat ...................................... SUCCESS [21.281s]
     [java] [INFO] Maven Embedder .................................... SUCCESS [3.411s]
     [java] [INFO] Maven Distribution ................................ SUCCESS [9.568s]
     [java] [INFO] ------------------------------------------------------------------------
     [java] [INFO] BUILD SUCCESS
     [java] [INFO] ------------------------------------------------------------------------
     [java] [INFO] Total time: 3:20.339s
     [java] [INFO] Finished at: Wed Aug 22 20:42:31 BST 2012
     [java] [INFO] Final Memory: 44M/259M
     [java] [INFO] ------------------------------------------------------------------------

maven-assembly:
     [echo] 
     [echo] The new Maven distribution was created as part of the MAVEN-COMPILE step, above.
     [echo] This goal just validates the presence of that distribution.

extract-assembly:
     [echo] Extracting assembly to <https://builds.apache.org/job/core-integration-testing-maven-3-windows/ws/apache-maven-3.0-SNAPSHOT> ...
   [delete] Deleting directory <https://builds.apache.org/job/core-integration-testing-maven-3-windows/ws/apache-maven-3.0-SNAPSHOT>
    [mkdir] Created dir: <https://builds.apache.org/job/core-integration-testing-maven-3-windows/ws/apache-maven-3.0-SNAPSHOT>
    [unzip] Expanding: <https://builds.apache.org/job/core-integration-testing-maven-3-windows/ws/maven-3-trunk\apache-maven\target\apache-maven-3.0.5-SNAPSHOT-bin.zip> into <https://builds.apache.org/job/core-integration-testing-maven-3-windows/ws/apache-maven-3.0-SNAPSHOT>

all:

BUILD SUCCESSFUL
Total time: 4 minutes 49 seconds
[core-integration-testing-maven-3-windows] $ cmd /c call C:\Users\hudson\AppData\Local\Temp\hudson8468233574552312515.bat

<https://builds.apache.org/job/core-integration-testing-maven-3-windows/ws/>rmdir> $WORKSPACE\core-integration-testing-maven-3-trunk\local-repository 
The system cannot find the path specified.

<https://builds.apache.org/job/core-integration-testing-maven-3-windows/ws/>exit> 0 
[maven-3-trunk] $ \home\hudson\tools\maven\apache-maven-3.0.3\bin\mvn.bat -f <https://builds.apache.org/job/core-integration-testing-maven-3-windows/ws/core-it/pom.xml> -Dmaven.repo.local=f:hudsonhudson-slaveworkspacecore-integration-testing-maven-3-windowscore-integration-testing-maven-3-trunklocal-repository clean install -Prun-its -B -U -V -Dsurefire.useFile=false -Dmaven.home=<https://builds.apache.org/job/core-integration-testing-maven-3-windows/ws/apache-maven-3.0-SNAPSHOT>
Error occurred during initialization of VM
Could not reserve enough space for object heap
Build step 'Invoke top-level Maven targets' marked build as failure
Recording test results