You are viewing a plain text version of this content. The canonical link for it is here.
Posted to dev@kafka.apache.org by Apache Jenkins Server <je...@builds.apache.org> on 2019/01/18 20:36:24 UTC

Build failed in Jenkins: kafka-trunk-jdk8 #3326

See <https://builds.apache.org/job/kafka-trunk-jdk8/3326/display/redirect?page=changes>

Changes:

[wangguoz] [KAFKA-7024] Rocksdb state directory should be created before opening

------------------------------------------
[...truncated 2.26 MB...]

org.apache.kafka.connect.transforms.CastTest > castWholeRecordValueWithSchemaBooleanTrue PASSED

org.apache.kafka.connect.transforms.CastTest > castWholeRecordDefaultValue STARTED

org.apache.kafka.connect.transforms.CastTest > castWholeRecordDefaultValue PASSED

org.apache.kafka.connect.transforms.CastTest > castWholeRecordValueWithSchemaInt8 STARTED

org.apache.kafka.connect.transforms.CastTest > castWholeRecordValueWithSchemaInt8 PASSED

org.apache.kafka.connect.transforms.CastTest > castWholeRecordKeyWithSchema STARTED

org.apache.kafka.connect.transforms.CastTest > castWholeRecordKeyWithSchema PASSED

org.apache.kafka.connect.transforms.CastTest > castWholeRecordValueSchemalessInt8 STARTED

org.apache.kafka.connect.transforms.CastTest > castWholeRecordValueSchemalessInt8 PASSED

org.apache.kafka.connect.transforms.CastTest > castWholeRecordValueSchemalessBooleanFalse STARTED

org.apache.kafka.connect.transforms.CastTest > castWholeRecordValueSchemalessBooleanFalse PASSED

org.apache.kafka.connect.transforms.CastTest > testConfigInvalidSchemaType STARTED

org.apache.kafka.connect.transforms.CastTest > testConfigInvalidSchemaType PASSED

org.apache.kafka.connect.transforms.CastTest > castWholeRecordValueSchemalessString STARTED

org.apache.kafka.connect.transforms.CastTest > castWholeRecordValueSchemalessString PASSED

org.apache.kafka.connect.transforms.CastTest > castFieldsWithSchema STARTED

org.apache.kafka.connect.transforms.CastTest > castFieldsWithSchema PASSED

org.apache.kafka.connect.transforms.ValueToKeyTest > withSchema STARTED

org.apache.kafka.connect.transforms.ValueToKeyTest > withSchema PASSED

org.apache.kafka.connect.transforms.ValueToKeyTest > schemaless STARTED

org.apache.kafka.connect.transforms.ValueToKeyTest > schemaless PASSED

org.apache.kafka.connect.transforms.RegexRouterTest > doesntMatch STARTED

org.apache.kafka.connect.transforms.RegexRouterTest > doesntMatch PASSED

org.apache.kafka.connect.transforms.RegexRouterTest > identity STARTED

org.apache.kafka.connect.transforms.RegexRouterTest > identity PASSED

org.apache.kafka.connect.transforms.RegexRouterTest > addPrefix STARTED

org.apache.kafka.connect.transforms.RegexRouterTest > addPrefix PASSED

org.apache.kafka.connect.transforms.RegexRouterTest > addSuffix STARTED

org.apache.kafka.connect.transforms.RegexRouterTest > addSuffix PASSED

org.apache.kafka.connect.transforms.RegexRouterTest > slice STARTED

org.apache.kafka.connect.transforms.RegexRouterTest > slice PASSED

org.apache.kafka.connect.transforms.RegexRouterTest > staticReplacement STARTED

org.apache.kafka.connect.transforms.RegexRouterTest > staticReplacement PASSED

org.apache.kafka.connect.transforms.HoistFieldTest > withSchema STARTED

org.apache.kafka.connect.transforms.HoistFieldTest > withSchema PASSED

org.apache.kafka.connect.transforms.HoistFieldTest > schemaless STARTED

org.apache.kafka.connect.transforms.HoistFieldTest > schemaless PASSED

org.apache.kafka.connect.transforms.TimestampConverterTest > testSchemalessFieldConversion STARTED

org.apache.kafka.connect.transforms.TimestampConverterTest > testSchemalessFieldConversion PASSED

org.apache.kafka.connect.transforms.TimestampConverterTest > testConfigInvalidTargetType STARTED

org.apache.kafka.connect.transforms.TimestampConverterTest > testConfigInvalidTargetType PASSED

org.apache.kafka.connect.transforms.TimestampConverterTest > testSchemalessStringToTimestamp STARTED

org.apache.kafka.connect.transforms.TimestampConverterTest > testSchemalessStringToTimestamp PASSED

org.apache.kafka.connect.transforms.TimestampConverterTest > testKey STARTED

org.apache.kafka.connect.transforms.TimestampConverterTest > testKey PASSED

org.apache.kafka.connect.transforms.TimestampConverterTest > testSchemalessDateToTimestamp STARTED

org.apache.kafka.connect.transforms.TimestampConverterTest > testSchemalessDateToTimestamp PASSED

org.apache.kafka.connect.transforms.TimestampConverterTest > testSchemalessTimestampToString STARTED

org.apache.kafka.connect.transforms.TimestampConverterTest > testSchemalessTimestampToString PASSED

org.apache.kafka.connect.transforms.TimestampConverterTest > testSchemalessTimeToTimestamp STARTED

org.apache.kafka.connect.transforms.TimestampConverterTest > testSchemalessTimeToTimestamp PASSED

org.apache.kafka.connect.transforms.TimestampConverterTest > testWithSchemaTimestampToDate STARTED

org.apache.kafka.connect.transforms.TimestampConverterTest > testWithSchemaTimestampToDate PASSED

org.apache.kafka.connect.transforms.TimestampConverterTest > testWithSchemaTimestampToTime STARTED

org.apache.kafka.connect.transforms.TimestampConverterTest > testWithSchemaTimestampToTime PASSED

org.apache.kafka.connect.transforms.TimestampConverterTest > testWithSchemaTimestampToUnix STARTED

org.apache.kafka.connect.transforms.TimestampConverterTest > testWithSchemaTimestampToUnix PASSED

org.apache.kafka.connect.transforms.TimestampConverterTest > testWithSchemaUnixToTimestamp STARTED

org.apache.kafka.connect.transforms.TimestampConverterTest > testWithSchemaUnixToTimestamp PASSED

org.apache.kafka.connect.transforms.TimestampConverterTest > testSchemalessIdentity STARTED

org.apache.kafka.connect.transforms.TimestampConverterTest > testSchemalessIdentity PASSED

org.apache.kafka.connect.transforms.TimestampConverterTest > testWithSchemaFieldConversion STARTED

org.apache.kafka.connect.transforms.TimestampConverterTest > testWithSchemaFieldConversion PASSED

org.apache.kafka.connect.transforms.TimestampConverterTest > testWithSchemaDateToTimestamp STARTED

org.apache.kafka.connect.transforms.TimestampConverterTest > testWithSchemaDateToTimestamp PASSED

org.apache.kafka.connect.transforms.TimestampConverterTest > testWithSchemaIdentity STARTED

org.apache.kafka.connect.transforms.TimestampConverterTest > testWithSchemaIdentity PASSED

org.apache.kafka.connect.transforms.TimestampConverterTest > testSchemalessTimestampToDate STARTED

org.apache.kafka.connect.transforms.TimestampConverterTest > testSchemalessTimestampToDate PASSED

org.apache.kafka.connect.transforms.TimestampConverterTest > testSchemalessTimestampToTime STARTED

org.apache.kafka.connect.transforms.TimestampConverterTest > testSchemalessTimestampToTime PASSED

org.apache.kafka.connect.transforms.TimestampConverterTest > testSchemalessTimestampToUnix STARTED

org.apache.kafka.connect.transforms.TimestampConverterTest > testSchemalessTimestampToUnix PASSED

org.apache.kafka.connect.transforms.TimestampConverterTest > testConfigMissingFormat STARTED

org.apache.kafka.connect.transforms.TimestampConverterTest > testConfigMissingFormat PASSED

org.apache.kafka.connect.transforms.TimestampConverterTest > testConfigNoTargetType STARTED

org.apache.kafka.connect.transforms.TimestampConverterTest > testConfigNoTargetType PASSED

org.apache.kafka.connect.transforms.TimestampConverterTest > testWithSchemaStringToTimestamp STARTED

org.apache.kafka.connect.transforms.TimestampConverterTest > testWithSchemaStringToTimestamp PASSED

org.apache.kafka.connect.transforms.TimestampConverterTest > testWithSchemaTimeToTimestamp STARTED

org.apache.kafka.connect.transforms.TimestampConverterTest > testWithSchemaTimeToTimestamp PASSED

org.apache.kafka.connect.transforms.TimestampConverterTest > testSchemalessUnixToTimestamp STARTED

org.apache.kafka.connect.transforms.TimestampConverterTest > testSchemalessUnixToTimestamp PASSED

org.apache.kafka.connect.transforms.TimestampConverterTest > testWithSchemaTimestampToString STARTED

org.apache.kafka.connect.transforms.TimestampConverterTest > testWithSchemaTimestampToString PASSED

org.apache.kafka.connect.transforms.TimestampConverterTest > testConfigInvalidFormat STARTED

org.apache.kafka.connect.transforms.TimestampConverterTest > testConfigInvalidFormat PASSED

org.apache.kafka.connect.transforms.ExtractFieldTest > withSchema STARTED

org.apache.kafka.connect.transforms.ExtractFieldTest > withSchema PASSED

org.apache.kafka.connect.transforms.ExtractFieldTest > testNullWithSchema STARTED

org.apache.kafka.connect.transforms.ExtractFieldTest > testNullWithSchema PASSED

org.apache.kafka.connect.transforms.ExtractFieldTest > schemaless STARTED

org.apache.kafka.connect.transforms.ExtractFieldTest > schemaless PASSED

org.apache.kafka.connect.transforms.ExtractFieldTest > testNullSchemaless STARTED

org.apache.kafka.connect.transforms.ExtractFieldTest > testNullSchemaless PASSED

org.apache.kafka.connect.transforms.MaskFieldTest > withSchema STARTED

org.apache.kafka.connect.transforms.MaskFieldTest > withSchema PASSED

org.apache.kafka.connect.transforms.MaskFieldTest > schemaless STARTED

org.apache.kafka.connect.transforms.MaskFieldTest > schemaless PASSED

FAILURE: Build failed with an exception.

* What went wrong:
Execution failed for task ':connect:runtime:test'.
> There were failing tests. See the report at: file://<https://builds.apache.org/job/kafka-trunk-jdk8/ws/connect/runtime/build/reports/tests/test/index.html>

* Try:
Run with --stacktrace option to get the stack trace. Run with --info or --debug option to get more log output. Run with --scan to get full insights.

* Get more help at https://help.gradle.org

Deprecated Gradle features were used in this build, making it incompatible with Gradle 6.0.
Use '--warning-mode all' to show the individual deprecation warnings.
See https://docs.gradle.org/5.1/userguide/command_line_interface.html#sec:command_line_warnings

BUILD FAILED in 2h 23m 6s
166 actionable tasks: 165 executed, 1 up-to-date
Build step 'Execute shell' marked build as failure
[FINDBUGS] Collecting findbugs analysis files...
Setting GRADLE_4_8_1_HOME=/home/jenkins/tools/gradle/4.8.1
[FINDBUGS] Searching for all files in <https://builds.apache.org/job/kafka-trunk-jdk8/ws/> that match the pattern **/build/reports/*bugs/*.xml
[FINDBUGS] Parsing 16 files in <https://builds.apache.org/job/kafka-trunk-jdk8/ws/>
[FINDBUGS] Successfully parsed file <https://builds.apache.org/job/kafka-trunk-jdk8/ws/clients/build/reports/spotbugs/main.xml> with 0 unique warnings and 0 duplicates.
[FINDBUGS] Successfully parsed file <https://builds.apache.org/job/kafka-trunk-jdk8/ws/connect/api/build/reports/spotbugs/main.xml> with 0 unique warnings and 0 duplicates.
[FINDBUGS] Successfully parsed file <https://builds.apache.org/job/kafka-trunk-jdk8/ws/connect/basic-auth-extension/build/reports/spotbugs/main.xml> with 0 unique warnings and 0 duplicates.
[FINDBUGS] Successfully parsed file <https://builds.apache.org/job/kafka-trunk-jdk8/ws/connect/file/build/reports/spotbugs/main.xml> with 0 unique warnings and 0 duplicates.
[FINDBUGS] Successfully parsed file <https://builds.apache.org/job/kafka-trunk-jdk8/ws/connect/json/build/reports/spotbugs/main.xml> with 0 unique warnings and 0 duplicates.
[FINDBUGS] Successfully parsed file <https://builds.apache.org/job/kafka-trunk-jdk8/ws/connect/runtime/build/reports/spotbugs/main.xml> with 0 unique warnings and 0 duplicates.
[FINDBUGS] Successfully parsed file <https://builds.apache.org/job/kafka-trunk-jdk8/ws/connect/transforms/build/reports/spotbugs/main.xml> with 0 unique warnings and 0 duplicates.
[FINDBUGS] Successfully parsed file <https://builds.apache.org/job/kafka-trunk-jdk8/ws/core/build/reports/spotbugs/main.xml> with 0 unique warnings and 0 duplicates.
[FINDBUGS] Successfully parsed file <https://builds.apache.org/job/kafka-trunk-jdk8/ws/examples/build/reports/spotbugs/main.xml> with 0 unique warnings and 0 duplicates.
[FINDBUGS] Successfully parsed file <https://builds.apache.org/job/kafka-trunk-jdk8/ws/jmh-benchmarks/build/reports/spotbugs/main.xml> with 0 unique warnings and 0 duplicates.
[FINDBUGS] Successfully parsed file <https://builds.apache.org/job/kafka-trunk-jdk8/ws/log4j-appender/build/reports/spotbugs/main.xml> with 0 unique warnings and 0 duplicates.
[FINDBUGS] Successfully parsed file <https://builds.apache.org/job/kafka-trunk-jdk8/ws/streams/build/reports/spotbugs/main.xml> with 0 unique warnings and 0 duplicates.
[FINDBUGS] Successfully parsed file <https://builds.apache.org/job/kafka-trunk-jdk8/ws/streams/examples/build/reports/spotbugs/main.xml> with 0 unique warnings and 0 duplicates.
[FINDBUGS] Successfully parsed file <https://builds.apache.org/job/kafka-trunk-jdk8/ws/streams/streams-scala/build/reports/spotbugs/main.xml> with 0 unique warnings and 0 duplicates.
[FINDBUGS] Successfully parsed file <https://builds.apache.org/job/kafka-trunk-jdk8/ws/streams/test-utils/build/reports/spotbugs/main.xml> with 0 unique warnings and 0 duplicates.
[FINDBUGS] Successfully parsed file <https://builds.apache.org/job/kafka-trunk-jdk8/ws/tools/build/reports/spotbugs/main.xml> with 0 unique warnings and 0 duplicates.
Setting GRADLE_4_8_1_HOME=/home/jenkins/tools/gradle/4.8.1
Setting GRADLE_4_8_1_HOME=/home/jenkins/tools/gradle/4.8.1
<Git Blamer> Using GitBlamer to create author and commit information for all warnings.
<Git Blamer> GIT_COMMIT=78076f9b2a40362e7c7194fb13dbee66d7342dfc, workspace=<https://builds.apache.org/job/kafka-trunk-jdk8/ws/>
[FINDBUGS] Computing warning deltas based on reference build #3313
Recording test results
Setting GRADLE_4_8_1_HOME=/home/jenkins/tools/gradle/4.8.1
Setting GRADLE_4_8_1_HOME=/home/jenkins/tools/gradle/4.8.1
Not sending mail to unregistered user noreply@github.com
Not sending mail to unregistered user vahid.hashemian@gmail.com
Not sending mail to unregistered user wangguoz@gmail.com
Not sending mail to unregistered user manikumar.reddy@gmail.com

Jenkins build is back to normal : kafka-trunk-jdk8 #3336

Posted by Apache Jenkins Server <je...@builds.apache.org>.
See <https://builds.apache.org/job/kafka-trunk-jdk8/3336/display/redirect?page=changes>


Build failed in Jenkins: kafka-trunk-jdk8 #3335

Posted by Apache Jenkins Server <je...@builds.apache.org>.
See <https://builds.apache.org/job/kafka-trunk-jdk8/3335/display/redirect?page=changes>

Changes:

[github] MINOR: increase timeouts for KafkaStreamsTest (#6178)

------------------------------------------
[...truncated 2.27 MB...]
org.apache.kafka.connect.transforms.MaskFieldTest > schemaless PASSED

org.apache.kafka.connect.transforms.ValueToKeyTest > withSchema STARTED

org.apache.kafka.connect.transforms.ValueToKeyTest > withSchema PASSED

org.apache.kafka.connect.transforms.ValueToKeyTest > schemaless STARTED

org.apache.kafka.connect.transforms.ValueToKeyTest > schemaless PASSED

org.apache.kafka.connect.transforms.TimestampRouterTest > defaultConfiguration STARTED

org.apache.kafka.connect.transforms.TimestampRouterTest > defaultConfiguration PASSED

org.apache.kafka.connect.transforms.SetSchemaMetadataTest > schemaNameUpdate STARTED

org.apache.kafka.connect.transforms.SetSchemaMetadataTest > schemaNameUpdate PASSED

org.apache.kafka.connect.transforms.SetSchemaMetadataTest > schemaNameAndVersionUpdateWithStruct STARTED

org.apache.kafka.connect.transforms.SetSchemaMetadataTest > schemaNameAndVersionUpdateWithStruct PASSED

org.apache.kafka.connect.transforms.SetSchemaMetadataTest > updateSchemaOfStruct STARTED

org.apache.kafka.connect.transforms.SetSchemaMetadataTest > updateSchemaOfStruct PASSED

org.apache.kafka.connect.transforms.SetSchemaMetadataTest > schemaNameAndVersionUpdate STARTED

org.apache.kafka.connect.transforms.SetSchemaMetadataTest > schemaNameAndVersionUpdate PASSED

org.apache.kafka.connect.transforms.SetSchemaMetadataTest > updateSchemaOfNull STARTED

org.apache.kafka.connect.transforms.SetSchemaMetadataTest > updateSchemaOfNull PASSED

org.apache.kafka.connect.transforms.SetSchemaMetadataTest > schemaVersionUpdate STARTED

org.apache.kafka.connect.transforms.SetSchemaMetadataTest > schemaVersionUpdate PASSED

org.apache.kafka.connect.transforms.SetSchemaMetadataTest > updateSchemaOfNonStruct STARTED

org.apache.kafka.connect.transforms.SetSchemaMetadataTest > updateSchemaOfNonStruct PASSED

org.apache.kafka.connect.transforms.ExtractFieldTest > withSchema STARTED

org.apache.kafka.connect.transforms.ExtractFieldTest > withSchema PASSED

org.apache.kafka.connect.transforms.ExtractFieldTest > testNullWithSchema STARTED

org.apache.kafka.connect.transforms.ExtractFieldTest > testNullWithSchema PASSED

org.apache.kafka.connect.transforms.ExtractFieldTest > schemaless STARTED

org.apache.kafka.connect.transforms.ExtractFieldTest > schemaless PASSED

org.apache.kafka.connect.transforms.ExtractFieldTest > testNullSchemaless STARTED

org.apache.kafka.connect.transforms.ExtractFieldTest > testNullSchemaless PASSED

org.apache.kafka.connect.transforms.TimestampConverterTest > testSchemalessFieldConversion STARTED

org.apache.kafka.connect.transforms.TimestampConverterTest > testSchemalessFieldConversion PASSED

org.apache.kafka.connect.transforms.TimestampConverterTest > testConfigInvalidTargetType STARTED

org.apache.kafka.connect.transforms.TimestampConverterTest > testConfigInvalidTargetType PASSED

org.apache.kafka.connect.transforms.TimestampConverterTest > testSchemalessStringToTimestamp STARTED

org.apache.kafka.connect.transforms.TimestampConverterTest > testSchemalessStringToTimestamp PASSED

org.apache.kafka.connect.transforms.TimestampConverterTest > testKey STARTED

org.apache.kafka.connect.transforms.TimestampConverterTest > testKey PASSED

org.apache.kafka.connect.transforms.TimestampConverterTest > testSchemalessDateToTimestamp STARTED

org.apache.kafka.connect.transforms.TimestampConverterTest > testSchemalessDateToTimestamp PASSED

org.apache.kafka.connect.transforms.TimestampConverterTest > testSchemalessTimestampToString STARTED

org.apache.kafka.connect.transforms.TimestampConverterTest > testSchemalessTimestampToString PASSED

org.apache.kafka.connect.transforms.TimestampConverterTest > testSchemalessTimeToTimestamp STARTED

org.apache.kafka.connect.transforms.TimestampConverterTest > testSchemalessTimeToTimestamp PASSED

org.apache.kafka.connect.transforms.TimestampConverterTest > testWithSchemaTimestampToDate STARTED

org.apache.kafka.connect.transforms.TimestampConverterTest > testWithSchemaTimestampToDate PASSED

org.apache.kafka.connect.transforms.TimestampConverterTest > testWithSchemaTimestampToTime STARTED

org.apache.kafka.connect.transforms.TimestampConverterTest > testWithSchemaTimestampToTime PASSED

org.apache.kafka.connect.transforms.TimestampConverterTest > testWithSchemaTimestampToUnix STARTED

org.apache.kafka.connect.transforms.TimestampConverterTest > testWithSchemaTimestampToUnix PASSED

org.apache.kafka.connect.transforms.TimestampConverterTest > testWithSchemaUnixToTimestamp STARTED

org.apache.kafka.connect.transforms.TimestampConverterTest > testWithSchemaUnixToTimestamp PASSED

org.apache.kafka.connect.transforms.TimestampConverterTest > testSchemalessIdentity STARTED

org.apache.kafka.connect.transforms.TimestampConverterTest > testSchemalessIdentity PASSED

org.apache.kafka.connect.transforms.TimestampConverterTest > testWithSchemaFieldConversion STARTED

org.apache.kafka.connect.transforms.TimestampConverterTest > testWithSchemaFieldConversion PASSED

org.apache.kafka.connect.transforms.TimestampConverterTest > testWithSchemaDateToTimestamp STARTED

org.apache.kafka.connect.transforms.TimestampConverterTest > testWithSchemaDateToTimestamp PASSED

org.apache.kafka.connect.transforms.TimestampConverterTest > testWithSchemaIdentity STARTED

org.apache.kafka.connect.transforms.TimestampConverterTest > testWithSchemaIdentity PASSED

org.apache.kafka.connect.transforms.TimestampConverterTest > testSchemalessTimestampToDate STARTED

org.apache.kafka.connect.transforms.TimestampConverterTest > testSchemalessTimestampToDate PASSED

org.apache.kafka.connect.transforms.TimestampConverterTest > testSchemalessTimestampToTime STARTED

org.apache.kafka.connect.transforms.TimestampConverterTest > testSchemalessTimestampToTime PASSED

org.apache.kafka.connect.transforms.TimestampConverterTest > testSchemalessTimestampToUnix STARTED

org.apache.kafka.connect.transforms.TimestampConverterTest > testSchemalessTimestampToUnix PASSED

org.apache.kafka.connect.transforms.TimestampConverterTest > testConfigMissingFormat STARTED

org.apache.kafka.connect.transforms.TimestampConverterTest > testConfigMissingFormat PASSED

org.apache.kafka.connect.transforms.TimestampConverterTest > testConfigNoTargetType STARTED

org.apache.kafka.connect.transforms.TimestampConverterTest > testConfigNoTargetType PASSED

org.apache.kafka.connect.transforms.TimestampConverterTest > testWithSchemaStringToTimestamp STARTED

org.apache.kafka.connect.transforms.TimestampConverterTest > testWithSchemaStringToTimestamp PASSED

org.apache.kafka.connect.transforms.TimestampConverterTest > testWithSchemaTimeToTimestamp STARTED

org.apache.kafka.connect.transforms.TimestampConverterTest > testWithSchemaTimeToTimestamp PASSED

org.apache.kafka.connect.transforms.TimestampConverterTest > testSchemalessUnixToTimestamp STARTED

org.apache.kafka.connect.transforms.TimestampConverterTest > testSchemalessUnixToTimestamp PASSED

org.apache.kafka.connect.transforms.TimestampConverterTest > testWithSchemaTimestampToString STARTED

org.apache.kafka.connect.transforms.TimestampConverterTest > testWithSchemaTimestampToString PASSED

org.apache.kafka.connect.transforms.TimestampConverterTest > testConfigInvalidFormat STARTED

org.apache.kafka.connect.transforms.TimestampConverterTest > testConfigInvalidFormat PASSED

org.apache.kafka.connect.transforms.InsertFieldTest > schemalessInsertConfiguredFields STARTED

org.apache.kafka.connect.transforms.InsertFieldTest > schemalessInsertConfiguredFields PASSED

org.apache.kafka.connect.transforms.InsertFieldTest > topLevelStructRequired STARTED

org.apache.kafka.connect.transforms.InsertFieldTest > topLevelStructRequired PASSED

org.apache.kafka.connect.transforms.InsertFieldTest > copySchemaAndInsertConfiguredFields STARTED

org.apache.kafka.connect.transforms.InsertFieldTest > copySchemaAndInsertConfiguredFields PASSED

> Task :streams:upgrade-system-tests-21:testClasses
> Task :streams:upgrade-system-tests-21:checkstyleTest
> Task :streams:upgrade-system-tests-21:spotbugsMain NO-SOURCE
> Task :streams:upgrade-system-tests-21:test

FAILURE: Build completed with 3 failures.

1: Task failed with an exception.
-----------
* What went wrong:
Execution failed for task ':clients:test'.
> There were failing tests. See the report at: file://<https://builds.apache.org/job/kafka-trunk-jdk8/ws/clients/build/reports/tests/test/index.html>

* Try:
Run with --stacktrace option to get the stack trace. Run with --info or --debug option to get more log output. Run with --scan to get full insights.
==============================================================================

2: Task failed with an exception.
-----------
* What went wrong:
Execution failed for task ':core:test'.
> There were failing tests. See the report at: file://<https://builds.apache.org/job/kafka-trunk-jdk8/ws/core/build/reports/tests/test/index.html>

* Try:
Run with --stacktrace option to get the stack trace. Run with --info or --debug option to get more log output. Run with --scan to get full insights.
==============================================================================

3: Task failed with an exception.
-----------
* What went wrong:
Execution failed for task ':streams:test'.
> There were failing tests. See the report at: file://<https://builds.apache.org/job/kafka-trunk-jdk8/ws/streams/build/reports/tests/test/index.html>

* Try:
Run with --stacktrace option to get the stack trace. Run with --info or --debug option to get more log output. Run with --scan to get full insights.
==============================================================================

* Get more help at https://help.gradle.org

Deprecated Gradle features were used in this build, making it incompatible with Gradle 6.0.
Use '--warning-mode all' to show the individual deprecation warnings.
See https://docs.gradle.org/5.1/userguide/command_line_interface.html#sec:command_line_warnings

BUILD FAILED in 1h 46m 4s
166 actionable tasks: 165 executed, 1 up-to-date
Build step 'Execute shell' marked build as failure
[FINDBUGS] Collecting findbugs analysis files...
Setting GRADLE_4_8_1_HOME=/home/jenkins/tools/gradle/4.8.1
[FINDBUGS] Searching for all files in <https://builds.apache.org/job/kafka-trunk-jdk8/ws/> that match the pattern **/build/reports/*bugs/*.xml
[FINDBUGS] Parsing 16 files in <https://builds.apache.org/job/kafka-trunk-jdk8/ws/>
[FINDBUGS] Successfully parsed file <https://builds.apache.org/job/kafka-trunk-jdk8/ws/clients/build/reports/spotbugs/main.xml> with 0 unique warnings and 0 duplicates.
[FINDBUGS] Successfully parsed file <https://builds.apache.org/job/kafka-trunk-jdk8/ws/connect/api/build/reports/spotbugs/main.xml> with 0 unique warnings and 0 duplicates.
[FINDBUGS] Successfully parsed file <https://builds.apache.org/job/kafka-trunk-jdk8/ws/connect/basic-auth-extension/build/reports/spotbugs/main.xml> with 0 unique warnings and 0 duplicates.
[FINDBUGS] Successfully parsed file <https://builds.apache.org/job/kafka-trunk-jdk8/ws/connect/file/build/reports/spotbugs/main.xml> with 0 unique warnings and 0 duplicates.
[FINDBUGS] Successfully parsed file <https://builds.apache.org/job/kafka-trunk-jdk8/ws/connect/json/build/reports/spotbugs/main.xml> with 0 unique warnings and 0 duplicates.
[FINDBUGS] Successfully parsed file <https://builds.apache.org/job/kafka-trunk-jdk8/ws/connect/runtime/build/reports/spotbugs/main.xml> with 0 unique warnings and 0 duplicates.
[FINDBUGS] Successfully parsed file <https://builds.apache.org/job/kafka-trunk-jdk8/ws/connect/transforms/build/reports/spotbugs/main.xml> with 0 unique warnings and 0 duplicates.
[FINDBUGS] Successfully parsed file <https://builds.apache.org/job/kafka-trunk-jdk8/ws/core/build/reports/spotbugs/main.xml> with 0 unique warnings and 0 duplicates.
[FINDBUGS] Successfully parsed file <https://builds.apache.org/job/kafka-trunk-jdk8/ws/examples/build/reports/spotbugs/main.xml> with 0 unique warnings and 0 duplicates.
[FINDBUGS] Successfully parsed file <https://builds.apache.org/job/kafka-trunk-jdk8/ws/jmh-benchmarks/build/reports/spotbugs/main.xml> with 0 unique warnings and 0 duplicates.
[FINDBUGS] Successfully parsed file <https://builds.apache.org/job/kafka-trunk-jdk8/ws/log4j-appender/build/reports/spotbugs/main.xml> with 0 unique warnings and 0 duplicates.
[FINDBUGS] Successfully parsed file <https://builds.apache.org/job/kafka-trunk-jdk8/ws/streams/build/reports/spotbugs/main.xml> with 0 unique warnings and 0 duplicates.
[FINDBUGS] Successfully parsed file <https://builds.apache.org/job/kafka-trunk-jdk8/ws/streams/examples/build/reports/spotbugs/main.xml> with 0 unique warnings and 0 duplicates.
[FINDBUGS] Successfully parsed file <https://builds.apache.org/job/kafka-trunk-jdk8/ws/streams/streams-scala/build/reports/spotbugs/main.xml> with 0 unique warnings and 0 duplicates.
[FINDBUGS] Successfully parsed file <https://builds.apache.org/job/kafka-trunk-jdk8/ws/streams/test-utils/build/reports/spotbugs/main.xml> with 0 unique warnings and 0 duplicates.
[FINDBUGS] Successfully parsed file <https://builds.apache.org/job/kafka-trunk-jdk8/ws/tools/build/reports/spotbugs/main.xml> with 0 unique warnings and 0 duplicates.
Setting GRADLE_4_8_1_HOME=/home/jenkins/tools/gradle/4.8.1
Setting GRADLE_4_8_1_HOME=/home/jenkins/tools/gradle/4.8.1
<Git Blamer> Using GitBlamer to create author and commit information for all warnings.
<Git Blamer> GIT_COMMIT=913e87ac536e7e4f8350243d4d4da7dde265ed31, workspace=<https://builds.apache.org/job/kafka-trunk-jdk8/ws/>
[FINDBUGS] Computing warning deltas based on reference build #3313
Recording test results
Setting GRADLE_4_8_1_HOME=/home/jenkins/tools/gradle/4.8.1
Setting GRADLE_4_8_1_HOME=/home/jenkins/tools/gradle/4.8.1
Not sending mail to unregistered user ismael@juma.me.uk
Not sending mail to unregistered user manikumar.reddy@gmail.com
Not sending mail to unregistered user wangguoz@gmail.com
Not sending mail to unregistered user vahid.hashemian@gmail.com
Not sending mail to unregistered user noreply@github.com

Build failed in Jenkins: kafka-trunk-jdk8 #3334

Posted by Apache Jenkins Server <je...@builds.apache.org>.
See <https://builds.apache.org/job/kafka-trunk-jdk8/3334/display/redirect?page=changes>

Changes:

[manikumar.reddy] MINOR: Rejoin split ssl principal mapping rules (#6099)

------------------------------------------
[...truncated 2.26 MB...]

org.apache.kafka.streams.test.OutputVerifierTest > shouldFailIfKeyIsDifferentForCompareKeyValue STARTED

org.apache.kafka.streams.test.OutputVerifierTest > shouldFailIfKeyIsDifferentForCompareKeyValue PASSED

org.apache.kafka.streams.test.OutputVerifierTest > shouldNotAllowNullProducerRecordWithExpectedRecordForCompareKeyValue STARTED

org.apache.kafka.streams.test.OutputVerifierTest > shouldNotAllowNullProducerRecordWithExpectedRecordForCompareKeyValue PASSED

org.apache.kafka.streams.test.OutputVerifierTest > shouldFailIfKeyIsDifferentWithNullForCompareKeyValueWithProducerRecord STARTED

org.apache.kafka.streams.test.OutputVerifierTest > shouldFailIfKeyIsDifferentWithNullForCompareKeyValueWithProducerRecord PASSED

org.apache.kafka.streams.test.OutputVerifierTest > shouldPassIfKeyAndValueAndTimestampIsEqualForCompareKeyValueTimestampWithProducerRecord STARTED

org.apache.kafka.streams.test.OutputVerifierTest > shouldPassIfKeyAndValueAndTimestampIsEqualForCompareKeyValueTimestampWithProducerRecord PASSED

org.apache.kafka.streams.test.OutputVerifierTest > shouldPassIfValueIsEqualWithNullForCompareValue STARTED

org.apache.kafka.streams.test.OutputVerifierTest > shouldPassIfValueIsEqualWithNullForCompareValue PASSED

org.apache.kafka.streams.test.OutputVerifierTest > shouldPassIfValueAndTimestampIsEqualWithNullForCompareValueTimestamp STARTED

org.apache.kafka.streams.test.OutputVerifierTest > shouldPassIfValueAndTimestampIsEqualWithNullForCompareValueTimestamp PASSED

org.apache.kafka.streams.test.OutputVerifierTest > shouldFailIfValueIsDifferentWithNullForCompareValueTimestampWithProducerRecord STARTED

org.apache.kafka.streams.test.OutputVerifierTest > shouldFailIfValueIsDifferentWithNullForCompareValueTimestampWithProducerRecord PASSED

org.apache.kafka.streams.test.OutputVerifierTest > shouldFailIfValueIsDifferentWithNullForCompareValueWithProducerRecord STARTED

org.apache.kafka.streams.test.OutputVerifierTest > shouldFailIfValueIsDifferentWithNullForCompareValueWithProducerRecord PASSED

org.apache.kafka.streams.test.OutputVerifierTest > shouldFailIfKeyIsDifferentWithNullReversForCompareKeyValueTimestampWithProducerRecord STARTED

org.apache.kafka.streams.test.OutputVerifierTest > shouldFailIfKeyIsDifferentWithNullReversForCompareKeyValueTimestampWithProducerRecord PASSED

org.apache.kafka.streams.test.OutputVerifierTest > shouldFailIfKeyIsDifferentWithNullReversForCompareKeyValue STARTED

org.apache.kafka.streams.test.OutputVerifierTest > shouldFailIfKeyIsDifferentWithNullReversForCompareKeyValue PASSED

org.apache.kafka.streams.test.OutputVerifierTest > shouldPassIfKeyAndValueIsEqualForCompareKeyValueWithProducerRecord STARTED

org.apache.kafka.streams.test.OutputVerifierTest > shouldPassIfKeyAndValueIsEqualForCompareKeyValueWithProducerRecord PASSED

org.apache.kafka.streams.test.OutputVerifierTest > shouldFailIfValueIsDifferentForCompareKeyValueWithProducerRecord STARTED

org.apache.kafka.streams.test.OutputVerifierTest > shouldFailIfValueIsDifferentForCompareKeyValueWithProducerRecord PASSED

org.apache.kafka.streams.test.OutputVerifierTest > shouldFailIfValueIsDifferentForCompareValueTimestamp STARTED

org.apache.kafka.streams.test.OutputVerifierTest > shouldFailIfValueIsDifferentForCompareValueTimestamp PASSED

org.apache.kafka.streams.test.OutputVerifierTest > shouldNotAllowNullProducerRecordForCompareValue STARTED

org.apache.kafka.streams.test.OutputVerifierTest > shouldNotAllowNullProducerRecordForCompareValue PASSED

org.apache.kafka.streams.test.OutputVerifierTest > shouldFailIfValueIsDifferentWithNullForCompareValueTimestamp STARTED

org.apache.kafka.streams.test.OutputVerifierTest > shouldFailIfValueIsDifferentWithNullForCompareValueTimestamp PASSED

org.apache.kafka.streams.test.OutputVerifierTest > shouldFailIfKeyIsDifferentForCompareKeyValueTimestamp STARTED

org.apache.kafka.streams.test.OutputVerifierTest > shouldFailIfKeyIsDifferentForCompareKeyValueTimestamp PASSED

org.apache.kafka.streams.test.OutputVerifierTest > shouldFailIfKeyIsDifferentForCompareKeyValueTimestampWithProducerRecord STARTED

org.apache.kafka.streams.test.OutputVerifierTest > shouldFailIfKeyIsDifferentForCompareKeyValueTimestampWithProducerRecord PASSED

org.apache.kafka.streams.test.OutputVerifierTest > shouldPassIfValueIsEqualWithNullForCompareValueWithProducerRecord STARTED

org.apache.kafka.streams.test.OutputVerifierTest > shouldPassIfValueIsEqualWithNullForCompareValueWithProducerRecord PASSED

org.apache.kafka.streams.test.OutputVerifierTest > shouldFailIfValueIsDifferentWithNullReverseForCompareValueTimestamp STARTED

org.apache.kafka.streams.test.OutputVerifierTest > shouldFailIfValueIsDifferentWithNullReverseForCompareValueTimestamp PASSED

org.apache.kafka.streams.test.OutputVerifierTest > shouldFailIfValueIsDifferentWithNullReverseForCompareValue STARTED

org.apache.kafka.streams.test.OutputVerifierTest > shouldFailIfValueIsDifferentWithNullReverseForCompareValue PASSED

org.apache.kafka.streams.test.OutputVerifierTest > shouldFailIfTimestampIsDifferentForCompareValueTimestamp STARTED

org.apache.kafka.streams.test.OutputVerifierTest > shouldFailIfTimestampIsDifferentForCompareValueTimestamp PASSED

org.apache.kafka.streams.test.OutputVerifierTest > shouldPassIfKeyAndValueAndTimestampIsEqualWithNullForCompareKeyValueTimestampWithProducerRecord STARTED

org.apache.kafka.streams.test.OutputVerifierTest > shouldPassIfKeyAndValueAndTimestampIsEqualWithNullForCompareKeyValueTimestampWithProducerRecord PASSED

org.apache.kafka.streams.test.OutputVerifierTest > shouldFailIfValueIsDifferentWithNullForCompareKeyValueWithProducerRecord STARTED

org.apache.kafka.streams.test.OutputVerifierTest > shouldFailIfValueIsDifferentWithNullForCompareKeyValueWithProducerRecord PASSED

org.apache.kafka.streams.test.OutputVerifierTest > shouldFailIfValueIsDifferentForCompareKeyValueTimestampWithProducerRecord STARTED

org.apache.kafka.streams.test.OutputVerifierTest > shouldFailIfValueIsDifferentForCompareKeyValueTimestampWithProducerRecord PASSED

org.apache.kafka.streams.test.OutputVerifierTest > shouldNotAllowNullProducerRecordWithExpectedRecordForCompareValueTimestamp STARTED

org.apache.kafka.streams.test.OutputVerifierTest > shouldNotAllowNullProducerRecordWithExpectedRecordForCompareValueTimestamp PASSED

org.apache.kafka.streams.test.OutputVerifierTest > shouldNotAllowNullExpectedRecordForCompareValue STARTED

org.apache.kafka.streams.test.OutputVerifierTest > shouldNotAllowNullExpectedRecordForCompareValue PASSED

org.apache.kafka.streams.test.OutputVerifierTest > shouldFailIfValueIsDifferentWithNullReversForCompareKeyValueTimestampWithProducerRecord STARTED

org.apache.kafka.streams.test.OutputVerifierTest > shouldFailIfValueIsDifferentWithNullReversForCompareKeyValueTimestampWithProducerRecord PASSED

org.apache.kafka.streams.test.OutputVerifierTest > shouldNotAllowNullProducerRecordForCompareKeyValue STARTED

org.apache.kafka.streams.test.OutputVerifierTest > shouldNotAllowNullProducerRecordForCompareKeyValue PASSED

org.apache.kafka.streams.test.OutputVerifierTest > shouldFailIfValueIsDifferentWithNullReversForCompareKeyValueWithProducerRecord STARTED

org.apache.kafka.streams.test.OutputVerifierTest > shouldFailIfValueIsDifferentWithNullReversForCompareKeyValueWithProducerRecord PASSED

org.apache.kafka.streams.test.OutputVerifierTest > shouldPassIfKeyAndValueAndTimestampIsEqualForCompareKeyValueTimestamp STARTED

org.apache.kafka.streams.test.OutputVerifierTest > shouldPassIfKeyAndValueAndTimestampIsEqualForCompareKeyValueTimestamp PASSED

org.apache.kafka.streams.test.OutputVerifierTest > shouldFailIfValueIsDifferentWithNullForCompareKeyValueTimestampWithProducerRecord STARTED

org.apache.kafka.streams.test.OutputVerifierTest > shouldFailIfValueIsDifferentWithNullForCompareKeyValueTimestampWithProducerRecord PASSED

org.apache.kafka.streams.test.OutputVerifierTest > shouldFailIfKeyIsDifferentWithNullReversForCompareKeyValueWithProducerRecord STARTED

org.apache.kafka.streams.test.OutputVerifierTest > shouldFailIfKeyIsDifferentWithNullReversForCompareKeyValueWithProducerRecord PASSED

org.apache.kafka.streams.test.OutputVerifierTest > shouldPassIfKeyAndValueIsEqualWithNullForCompareKeyValueWithProducerRecord STARTED

org.apache.kafka.streams.test.OutputVerifierTest > shouldPassIfKeyAndValueIsEqualWithNullForCompareKeyValueWithProducerRecord PASSED

org.apache.kafka.streams.test.OutputVerifierTest > shouldFailIfKeyIsDifferentWithNullForCompareKeyValueTimestampWithProducerRecord STARTED

org.apache.kafka.streams.test.OutputVerifierTest > shouldFailIfKeyIsDifferentWithNullForCompareKeyValueTimestampWithProducerRecord PASSED

org.apache.kafka.streams.test.OutputVerifierTest > shouldFailIfValueIsDifferentForCompareKeyValueTimestamp STARTED

org.apache.kafka.streams.test.OutputVerifierTest > shouldFailIfValueIsDifferentForCompareKeyValueTimestamp PASSED

org.apache.kafka.streams.test.OutputVerifierTest > shouldPassIfValueAndTimestampIsEqualForCompareValueTimestampWithProducerRecord STARTED

org.apache.kafka.streams.test.OutputVerifierTest > shouldPassIfValueAndTimestampIsEqualForCompareValueTimestampWithProducerRecord PASSED

org.apache.kafka.streams.test.OutputVerifierTest > shouldFailIfValueIsDifferentWithNullReversForCompareKeyValueTimestamp STARTED

org.apache.kafka.streams.test.OutputVerifierTest > shouldFailIfValueIsDifferentWithNullReversForCompareKeyValueTimestamp PASSED

org.apache.kafka.streams.test.OutputVerifierTest > shouldFailIfValueIsDifferentWithNullReverseForCompareValueTimestampWithProducerRecord STARTED

org.apache.kafka.streams.test.OutputVerifierTest > shouldFailIfValueIsDifferentWithNullReverseForCompareValueTimestampWithProducerRecord PASSED

> Task :streams:upgrade-system-tests-0110:testClasses
> Task :streams:upgrade-system-tests-0110:checkstyleTest
> Task :streams:upgrade-system-tests-0110:spotbugsMain NO-SOURCE
> Task :streams:upgrade-system-tests-0110:test
> Task :streams:upgrade-system-tests-10:compileJava NO-SOURCE
> Task :streams:upgrade-system-tests-10:processResources NO-SOURCE
> Task :streams:upgrade-system-tests-10:classes UP-TO-DATE
> Task :streams:upgrade-system-tests-10:checkstyleMain NO-SOURCE
> Task :streams:upgrade-system-tests-10:compileTestJava
> Task :streams:upgrade-system-tests-10:processTestResources NO-SOURCE
> Task :streams:upgrade-system-tests-10:testClasses
> Task :streams:upgrade-system-tests-10:checkstyleTest
> Task :streams:upgrade-system-tests-10:spotbugsMain NO-SOURCE
> Task :streams:upgrade-system-tests-10:test
> Task :streams:upgrade-system-tests-11:compileJava NO-SOURCE
> Task :streams:upgrade-system-tests-11:processResources NO-SOURCE
> Task :streams:upgrade-system-tests-11:classes UP-TO-DATE
> Task :streams:upgrade-system-tests-11:checkstyleMain NO-SOURCE
> Task :streams:upgrade-system-tests-11:compileTestJava
> Task :streams:upgrade-system-tests-11:processTestResources NO-SOURCE
> Task :streams:upgrade-system-tests-11:testClasses
> Task :streams:upgrade-system-tests-11:checkstyleTest
> Task :streams:upgrade-system-tests-11:spotbugsMain NO-SOURCE
> Task :streams:upgrade-system-tests-11:test
> Task :streams:upgrade-system-tests-20:compileJava NO-SOURCE
> Task :streams:upgrade-system-tests-20:processResources NO-SOURCE
> Task :streams:upgrade-system-tests-20:classes UP-TO-DATE
> Task :streams:upgrade-system-tests-20:checkstyleMain NO-SOURCE
> Task :streams:upgrade-system-tests-20:compileTestJava
> Task :streams:upgrade-system-tests-20:processTestResources NO-SOURCE
> Task :streams:upgrade-system-tests-20:testClasses
> Task :streams:upgrade-system-tests-20:checkstyleTest
> Task :streams:upgrade-system-tests-20:spotbugsMain NO-SOURCE
> Task :streams:upgrade-system-tests-20:test
> Task :streams:upgrade-system-tests-21:compileJava NO-SOURCE
> Task :streams:upgrade-system-tests-21:processResources NO-SOURCE
> Task :streams:upgrade-system-tests-21:classes UP-TO-DATE
> Task :streams:upgrade-system-tests-21:checkstyleMain NO-SOURCE
> Task :streams:upgrade-system-tests-21:compileTestJava
> Task :streams:upgrade-system-tests-21:processTestResources NO-SOURCE
> Task :streams:upgrade-system-tests-21:testClasses
> Task :streams:upgrade-system-tests-21:checkstyleTest
> Task :streams:upgrade-system-tests-21:spotbugsMain NO-SOURCE
> Task :streams:upgrade-system-tests-21:test

FAILURE: Build failed with an exception.

* What went wrong:
Execution failed for task ':core:test'.
> There were failing tests. See the report at: file://<https://builds.apache.org/job/kafka-trunk-jdk8/ws/core/build/reports/tests/test/index.html>

* Try:
Run with --stacktrace option to get the stack trace. Run with --info or --debug option to get more log output. Run with --scan to get full insights.

* Get more help at https://help.gradle.org

Deprecated Gradle features were used in this build, making it incompatible with Gradle 6.0.
Use '--warning-mode all' to show the individual deprecation warnings.
See https://docs.gradle.org/5.1/userguide/command_line_interface.html#sec:command_line_warnings

BUILD FAILED in 1h 42m 27s
166 actionable tasks: 165 executed, 1 up-to-date
Build step 'Execute shell' marked build as failure
[FINDBUGS] Collecting findbugs analysis files...
Setting GRADLE_4_8_1_HOME=/home/jenkins/tools/gradle/4.8.1
[FINDBUGS] Searching for all files in <https://builds.apache.org/job/kafka-trunk-jdk8/ws/> that match the pattern **/build/reports/*bugs/*.xml
[FINDBUGS] Parsing 16 files in <https://builds.apache.org/job/kafka-trunk-jdk8/ws/>
[FINDBUGS] Successfully parsed file <https://builds.apache.org/job/kafka-trunk-jdk8/ws/clients/build/reports/spotbugs/main.xml> with 0 unique warnings and 0 duplicates.
[FINDBUGS] Successfully parsed file <https://builds.apache.org/job/kafka-trunk-jdk8/ws/connect/api/build/reports/spotbugs/main.xml> with 0 unique warnings and 0 duplicates.
[FINDBUGS] Successfully parsed file <https://builds.apache.org/job/kafka-trunk-jdk8/ws/connect/basic-auth-extension/build/reports/spotbugs/main.xml> with 0 unique warnings and 0 duplicates.
[FINDBUGS] Successfully parsed file <https://builds.apache.org/job/kafka-trunk-jdk8/ws/connect/file/build/reports/spotbugs/main.xml> with 0 unique warnings and 0 duplicates.
[FINDBUGS] Successfully parsed file <https://builds.apache.org/job/kafka-trunk-jdk8/ws/connect/json/build/reports/spotbugs/main.xml> with 0 unique warnings and 0 duplicates.
[FINDBUGS] Successfully parsed file <https://builds.apache.org/job/kafka-trunk-jdk8/ws/connect/runtime/build/reports/spotbugs/main.xml> with 0 unique warnings and 0 duplicates.
[FINDBUGS] Successfully parsed file <https://builds.apache.org/job/kafka-trunk-jdk8/ws/connect/transforms/build/reports/spotbugs/main.xml> with 0 unique warnings and 0 duplicates.
[FINDBUGS] Successfully parsed file <https://builds.apache.org/job/kafka-trunk-jdk8/ws/core/build/reports/spotbugs/main.xml> with 0 unique warnings and 0 duplicates.
[FINDBUGS] Successfully parsed file <https://builds.apache.org/job/kafka-trunk-jdk8/ws/examples/build/reports/spotbugs/main.xml> with 0 unique warnings and 0 duplicates.
[FINDBUGS] Successfully parsed file <https://builds.apache.org/job/kafka-trunk-jdk8/ws/jmh-benchmarks/build/reports/spotbugs/main.xml> with 0 unique warnings and 0 duplicates.
[FINDBUGS] Successfully parsed file <https://builds.apache.org/job/kafka-trunk-jdk8/ws/log4j-appender/build/reports/spotbugs/main.xml> with 0 unique warnings and 0 duplicates.
[FINDBUGS] Successfully parsed file <https://builds.apache.org/job/kafka-trunk-jdk8/ws/streams/build/reports/spotbugs/main.xml> with 0 unique warnings and 0 duplicates.
[FINDBUGS] Successfully parsed file <https://builds.apache.org/job/kafka-trunk-jdk8/ws/streams/examples/build/reports/spotbugs/main.xml> with 0 unique warnings and 0 duplicates.
[FINDBUGS] Successfully parsed file <https://builds.apache.org/job/kafka-trunk-jdk8/ws/streams/streams-scala/build/reports/spotbugs/main.xml> with 0 unique warnings and 0 duplicates.
[FINDBUGS] Successfully parsed file <https://builds.apache.org/job/kafka-trunk-jdk8/ws/streams/test-utils/build/reports/spotbugs/main.xml> with 0 unique warnings and 0 duplicates.
[FINDBUGS] Successfully parsed file <https://builds.apache.org/job/kafka-trunk-jdk8/ws/tools/build/reports/spotbugs/main.xml> with 0 unique warnings and 0 duplicates.
Setting GRADLE_4_8_1_HOME=/home/jenkins/tools/gradle/4.8.1
Setting GRADLE_4_8_1_HOME=/home/jenkins/tools/gradle/4.8.1
<Git Blamer> Using GitBlamer to create author and commit information for all warnings.
<Git Blamer> GIT_COMMIT=e75e4732c9ad67a5bf7a267346f0774c2a41b4e9, workspace=<https://builds.apache.org/job/kafka-trunk-jdk8/ws/>
[FINDBUGS] Computing warning deltas based on reference build #3313
Recording test results
Setting GRADLE_4_8_1_HOME=/home/jenkins/tools/gradle/4.8.1
Setting GRADLE_4_8_1_HOME=/home/jenkins/tools/gradle/4.8.1
Not sending mail to unregistered user ismael@juma.me.uk
Not sending mail to unregistered user manikumar.reddy@gmail.com
Not sending mail to unregistered user wangguoz@gmail.com
Not sending mail to unregistered user vahid.hashemian@gmail.com
Not sending mail to unregistered user noreply@github.com

Build failed in Jenkins: kafka-trunk-jdk8 #3333

Posted by Apache Jenkins Server <je...@builds.apache.org>.
See <https://builds.apache.org/job/kafka-trunk-jdk8/3333/display/redirect?page=changes>

Changes:

[mjsax] MINOR: Handle case where connector status endpoints returns 404 (#6176)

------------------------------------------
[...truncated 4.53 MB...]
org.apache.kafka.streams.test.OutputVerifierTest > shouldNotAllowNullProducerRecordForCompareKeyValue STARTED

org.apache.kafka.streams.test.OutputVerifierTest > shouldNotAllowNullProducerRecordForCompareKeyValue PASSED

org.apache.kafka.streams.test.OutputVerifierTest > shouldFailIfValueIsDifferentWithNullReversForCompareKeyValueWithProducerRecord STARTED

org.apache.kafka.streams.test.OutputVerifierTest > shouldFailIfValueIsDifferentWithNullReversForCompareKeyValueWithProducerRecord PASSED

org.apache.kafka.streams.test.OutputVerifierTest > shouldPassIfKeyAndValueAndTimestampIsEqualForCompareKeyValueTimestamp STARTED

org.apache.kafka.streams.test.OutputVerifierTest > shouldPassIfKeyAndValueAndTimestampIsEqualForCompareKeyValueTimestamp PASSED

org.apache.kafka.streams.test.OutputVerifierTest > shouldFailIfValueIsDifferentWithNullForCompareKeyValueTimestampWithProducerRecord STARTED

org.apache.kafka.streams.test.OutputVerifierTest > shouldFailIfValueIsDifferentWithNullForCompareKeyValueTimestampWithProducerRecord PASSED

org.apache.kafka.streams.test.OutputVerifierTest > shouldFailIfKeyIsDifferentWithNullReversForCompareKeyValueWithProducerRecord STARTED

org.apache.kafka.streams.test.OutputVerifierTest > shouldFailIfKeyIsDifferentWithNullReversForCompareKeyValueWithProducerRecord PASSED

org.apache.kafka.streams.test.OutputVerifierTest > shouldPassIfKeyAndValueIsEqualWithNullForCompareKeyValueWithProducerRecord STARTED

org.apache.kafka.streams.test.OutputVerifierTest > shouldPassIfKeyAndValueIsEqualWithNullForCompareKeyValueWithProducerRecord PASSED

org.apache.kafka.streams.test.OutputVerifierTest > shouldFailIfKeyIsDifferentWithNullForCompareKeyValueTimestampWithProducerRecord STARTED

org.apache.kafka.streams.test.OutputVerifierTest > shouldFailIfKeyIsDifferentWithNullForCompareKeyValueTimestampWithProducerRecord PASSED

org.apache.kafka.streams.test.OutputVerifierTest > shouldFailIfValueIsDifferentForCompareKeyValueTimestamp STARTED

org.apache.kafka.streams.test.OutputVerifierTest > shouldFailIfValueIsDifferentForCompareKeyValueTimestamp PASSED

org.apache.kafka.streams.test.OutputVerifierTest > shouldPassIfValueAndTimestampIsEqualForCompareValueTimestampWithProducerRecord STARTED

org.apache.kafka.streams.test.OutputVerifierTest > shouldPassIfValueAndTimestampIsEqualForCompareValueTimestampWithProducerRecord PASSED

org.apache.kafka.streams.test.OutputVerifierTest > shouldFailIfValueIsDifferentWithNullReversForCompareKeyValueTimestamp STARTED

org.apache.kafka.streams.test.OutputVerifierTest > shouldFailIfValueIsDifferentWithNullReversForCompareKeyValueTimestamp PASSED

org.apache.kafka.streams.test.OutputVerifierTest > shouldFailIfValueIsDifferentWithNullReverseForCompareValueTimestampWithProducerRecord STARTED

org.apache.kafka.streams.test.OutputVerifierTest > shouldFailIfValueIsDifferentWithNullReverseForCompareValueTimestampWithProducerRecord PASSED

> Task :streams:upgrade-system-tests-21:compileJava NO-SOURCE
> Task :streams:upgrade-system-tests-21:processResources NO-SOURCE
> Task :streams:upgrade-system-tests-21:classes UP-TO-DATE
> Task :streams:upgrade-system-tests-21:checkstyleMain NO-SOURCE
> Task :streams:upgrade-system-tests-21:compileTestJava
> Task :streams:upgrade-system-tests-21:processTestResources NO-SOURCE
> Task :streams:upgrade-system-tests-21:testClasses
> Task :streams:upgrade-system-tests-21:checkstyleTest
> Task :streams:upgrade-system-tests-21:spotbugsMain NO-SOURCE
> Task :streams:upgrade-system-tests-21:test
> Task :streams:streams-scala:spotbugsMain

> Task :streams:streams-scala:test

org.apache.kafka.streams.scala.StreamToTableJoinScalaIntegrationTestImplicitSerdes > testShouldCountClicksPerRegionWithNamedRepartitionTopic STARTED

org.apache.kafka.streams.scala.StreamToTableJoinScalaIntegrationTestImplicitSerdes > testShouldCountClicksPerRegionWithNamedRepartitionTopic PASSED

org.apache.kafka.streams.scala.StreamToTableJoinScalaIntegrationTestImplicitSerdes > testShouldCountClicksPerRegionJava STARTED

org.apache.kafka.streams.scala.StreamToTableJoinScalaIntegrationTestImplicitSerdes > testShouldCountClicksPerRegionJava PASSED

org.apache.kafka.streams.scala.StreamToTableJoinScalaIntegrationTestImplicitSerdes > testShouldCountClicksPerRegion STARTED

org.apache.kafka.streams.scala.StreamToTableJoinScalaIntegrationTestImplicitSerdes > testShouldCountClicksPerRegion PASSED

org.apache.kafka.streams.scala.TopologyTest > shouldBuildIdenticalTopologyInJavaNScalaJoin STARTED

org.apache.kafka.streams.scala.TopologyTest > shouldBuildIdenticalTopologyInJavaNScalaJoin PASSED

org.apache.kafka.streams.scala.TopologyTest > shouldBuildIdenticalTopologyInJavaNScalaSimple STARTED

org.apache.kafka.streams.scala.TopologyTest > shouldBuildIdenticalTopologyInJavaNScalaSimple PASSED

org.apache.kafka.streams.scala.TopologyTest > shouldBuildIdenticalTopologyInJavaNScalaAggregate STARTED

org.apache.kafka.streams.scala.TopologyTest > shouldBuildIdenticalTopologyInJavaNScalaAggregate PASSED

org.apache.kafka.streams.scala.TopologyTest > shouldBuildIdenticalTopologyInJavaNScalaTransform STARTED

org.apache.kafka.streams.scala.TopologyTest > shouldBuildIdenticalTopologyInJavaNScalaTransform PASSED

org.apache.kafka.streams.scala.WordCountTest > testShouldCountWordsMaterialized STARTED

org.apache.kafka.streams.scala.WordCountTest > testShouldCountWordsMaterialized PASSED

org.apache.kafka.streams.scala.WordCountTest > testShouldCountWordsJava STARTED

org.apache.kafka.streams.scala.WordCountTest > testShouldCountWordsJava PASSED

org.apache.kafka.streams.scala.WordCountTest > testShouldCountWords STARTED

org.apache.kafka.streams.scala.WordCountTest > testShouldCountWords PASSED

org.apache.kafka.streams.scala.kstream.MaterializedTest > Create a Materialized should create a Materialized with Serdes STARTED

org.apache.kafka.streams.scala.kstream.MaterializedTest > Create a Materialized should create a Materialized with Serdes PASSED

org.apache.kafka.streams.scala.kstream.MaterializedTest > Create a Materialize with a store name should create a Materialized with Serdes and a store name STARTED

org.apache.kafka.streams.scala.kstream.MaterializedTest > Create a Materialize with a store name should create a Materialized with Serdes and a store name PASSED

org.apache.kafka.streams.scala.kstream.MaterializedTest > Create a Materialize with a window store supplier should create a Materialized with Serdes and a store supplier STARTED

org.apache.kafka.streams.scala.kstream.MaterializedTest > Create a Materialize with a window store supplier should create a Materialized with Serdes and a store supplier PASSED

org.apache.kafka.streams.scala.kstream.MaterializedTest > Create a Materialize with a key value store supplier should create a Materialized with Serdes and a store supplier STARTED

org.apache.kafka.streams.scala.kstream.MaterializedTest > Create a Materialize with a key value store supplier should create a Materialized with Serdes and a store supplier PASSED

org.apache.kafka.streams.scala.kstream.MaterializedTest > Create a Materialize with a session store supplier should create a Materialized with Serdes and a store supplier STARTED

org.apache.kafka.streams.scala.kstream.MaterializedTest > Create a Materialize with a session store supplier should create a Materialized with Serdes and a store supplier PASSED

org.apache.kafka.streams.scala.kstream.KTableTest > filter a KTable should filter records satisfying the predicate STARTED

org.apache.kafka.streams.scala.kstream.KTableTest > filter a KTable should filter records satisfying the predicate PASSED

org.apache.kafka.streams.scala.kstream.KTableTest > filterNot a KTable should filter records not satisfying the predicate STARTED

org.apache.kafka.streams.scala.kstream.KTableTest > filterNot a KTable should filter records not satisfying the predicate PASSED

org.apache.kafka.streams.scala.kstream.KTableTest > join 2 KTables should join correctly records STARTED

org.apache.kafka.streams.scala.kstream.KTableTest > join 2 KTables should join correctly records PASSED

org.apache.kafka.streams.scala.kstream.KTableTest > join 2 KTables with a Materialized should join correctly records and state store STARTED

org.apache.kafka.streams.scala.kstream.KTableTest > join 2 KTables with a Materialized should join correctly records and state store PASSED

org.apache.kafka.streams.scala.kstream.GroupedTest > Create a Grouped should create a Grouped with Serdes STARTED

org.apache.kafka.streams.scala.kstream.GroupedTest > Create a Grouped should create a Grouped with Serdes PASSED

org.apache.kafka.streams.scala.kstream.GroupedTest > Create a Grouped with repartition topic name should create a Grouped with Serdes, and repartition topic name STARTED

org.apache.kafka.streams.scala.kstream.GroupedTest > Create a Grouped with repartition topic name should create a Grouped with Serdes, and repartition topic name PASSED

org.apache.kafka.streams.scala.kstream.ProducedTest > Create a Produced should create a Produced with Serdes STARTED

org.apache.kafka.streams.scala.kstream.ProducedTest > Create a Produced should create a Produced with Serdes PASSED

org.apache.kafka.streams.scala.kstream.ProducedTest > Create a Produced with timestampExtractor and resetPolicy should create a Consumed with Serdes, timestampExtractor and resetPolicy STARTED

org.apache.kafka.streams.scala.kstream.ProducedTest > Create a Produced with timestampExtractor and resetPolicy should create a Consumed with Serdes, timestampExtractor and resetPolicy PASSED

org.apache.kafka.streams.scala.kstream.KStreamTest > filter a KStream should filter records satisfying the predicate STARTED

org.apache.kafka.streams.scala.kstream.KStreamTest > filter a KStream should filter records satisfying the predicate PASSED

org.apache.kafka.streams.scala.kstream.KStreamTest > filterNot a KStream should filter records not satisfying the predicate STARTED

org.apache.kafka.streams.scala.kstream.KStreamTest > filterNot a KStream should filter records not satisfying the predicate PASSED

org.apache.kafka.streams.scala.kstream.KStreamTest > foreach a KStream should run foreach actions on records STARTED

org.apache.kafka.streams.scala.kstream.KStreamTest > foreach a KStream should run foreach actions on records PASSED

org.apache.kafka.streams.scala.kstream.KStreamTest > peek a KStream should run peek actions on records STARTED

org.apache.kafka.streams.scala.kstream.KStreamTest > peek a KStream should run peek actions on records PASSED

org.apache.kafka.streams.scala.kstream.KStreamTest > selectKey a KStream should select a new key STARTED

org.apache.kafka.streams.scala.kstream.KStreamTest > selectKey a KStream should select a new key PASSED

org.apache.kafka.streams.scala.kstream.KStreamTest > join 2 KStreams should join correctly records STARTED

org.apache.kafka.streams.scala.kstream.KStreamTest > join 2 KStreams should join correctly records PASSED

org.apache.kafka.streams.scala.kstream.ConsumedTest > Create a Consumed should create a Consumed with Serdes STARTED

org.apache.kafka.streams.scala.kstream.ConsumedTest > Create a Consumed should create a Consumed with Serdes PASSED

org.apache.kafka.streams.scala.kstream.ConsumedTest > Create a Consumed with timestampExtractor and resetPolicy should create a Consumed with Serdes, timestampExtractor and resetPolicy STARTED

org.apache.kafka.streams.scala.kstream.ConsumedTest > Create a Consumed with timestampExtractor and resetPolicy should create a Consumed with Serdes, timestampExtractor and resetPolicy PASSED

org.apache.kafka.streams.scala.kstream.ConsumedTest > Create a Consumed with timestampExtractor should create a Consumed with Serdes and timestampExtractor STARTED

org.apache.kafka.streams.scala.kstream.ConsumedTest > Create a Consumed with timestampExtractor should create a Consumed with Serdes and timestampExtractor PASSED

org.apache.kafka.streams.scala.kstream.ConsumedTest > Create a Consumed with resetPolicy should create a Consumed with Serdes and resetPolicy STARTED

org.apache.kafka.streams.scala.kstream.ConsumedTest > Create a Consumed with resetPolicy should create a Consumed with Serdes and resetPolicy PASSED

org.apache.kafka.streams.scala.kstream.JoinedTest > Create a Joined should create a Joined with Serdes STARTED

org.apache.kafka.streams.scala.kstream.JoinedTest > Create a Joined should create a Joined with Serdes PASSED

org.apache.kafka.streams.scala.kstream.JoinedTest > Create a Joined should create a Joined with Serdes and repartition topic name STARTED

org.apache.kafka.streams.scala.kstream.JoinedTest > Create a Joined should create a Joined with Serdes and repartition topic name PASSED

FAILURE: Build failed with an exception.

* What went wrong:
Execution failed for task ':core:test'.
> There were failing tests. See the report at: file://<https://builds.apache.org/job/kafka-trunk-jdk8/ws/core/build/reports/tests/test/index.html>

* Try:
Run with --stacktrace option to get the stack trace. Run with --info or --debug option to get more log output. Run with --scan to get full insights.

* Get more help at https://help.gradle.org

Deprecated Gradle features were used in this build, making it incompatible with Gradle 6.0.
Use '--warning-mode all' to show the individual deprecation warnings.
See https://docs.gradle.org/5.1/userguide/command_line_interface.html#sec:command_line_warnings

BUILD FAILED in 1h 43m 33s
166 actionable tasks: 163 executed, 3 up-to-date
Build step 'Execute shell' marked build as failure
[FINDBUGS] Collecting findbugs analysis files...
Setting GRADLE_4_8_1_HOME=/home/jenkins/tools/gradle/4.8.1
[FINDBUGS] Searching for all files in <https://builds.apache.org/job/kafka-trunk-jdk8/ws/> that match the pattern **/build/reports/*bugs/*.xml
[FINDBUGS] Parsing 16 files in <https://builds.apache.org/job/kafka-trunk-jdk8/ws/>
[FINDBUGS] Successfully parsed file <https://builds.apache.org/job/kafka-trunk-jdk8/ws/clients/build/reports/spotbugs/main.xml> with 0 unique warnings and 0 duplicates.
[FINDBUGS] Successfully parsed file <https://builds.apache.org/job/kafka-trunk-jdk8/ws/connect/api/build/reports/spotbugs/main.xml> with 0 unique warnings and 0 duplicates.
[FINDBUGS] Successfully parsed file <https://builds.apache.org/job/kafka-trunk-jdk8/ws/connect/basic-auth-extension/build/reports/spotbugs/main.xml> with 0 unique warnings and 0 duplicates.
[FINDBUGS] Successfully parsed file <https://builds.apache.org/job/kafka-trunk-jdk8/ws/connect/file/build/reports/spotbugs/main.xml> with 0 unique warnings and 0 duplicates.
[FINDBUGS] Successfully parsed file <https://builds.apache.org/job/kafka-trunk-jdk8/ws/connect/json/build/reports/spotbugs/main.xml> with 0 unique warnings and 0 duplicates.
[FINDBUGS] Successfully parsed file <https://builds.apache.org/job/kafka-trunk-jdk8/ws/connect/runtime/build/reports/spotbugs/main.xml> with 0 unique warnings and 0 duplicates.
[FINDBUGS] Successfully parsed file <https://builds.apache.org/job/kafka-trunk-jdk8/ws/connect/transforms/build/reports/spotbugs/main.xml> with 0 unique warnings and 0 duplicates.
[FINDBUGS] Successfully parsed file <https://builds.apache.org/job/kafka-trunk-jdk8/ws/core/build/reports/spotbugs/main.xml> with 0 unique warnings and 0 duplicates.
[FINDBUGS] Successfully parsed file <https://builds.apache.org/job/kafka-trunk-jdk8/ws/examples/build/reports/spotbugs/main.xml> with 0 unique warnings and 0 duplicates.
[FINDBUGS] Successfully parsed file <https://builds.apache.org/job/kafka-trunk-jdk8/ws/jmh-benchmarks/build/reports/spotbugs/main.xml> with 0 unique warnings and 0 duplicates.
[FINDBUGS] Successfully parsed file <https://builds.apache.org/job/kafka-trunk-jdk8/ws/log4j-appender/build/reports/spotbugs/main.xml> with 0 unique warnings and 0 duplicates.
[FINDBUGS] Successfully parsed file <https://builds.apache.org/job/kafka-trunk-jdk8/ws/streams/build/reports/spotbugs/main.xml> with 0 unique warnings and 0 duplicates.
[FINDBUGS] Successfully parsed file <https://builds.apache.org/job/kafka-trunk-jdk8/ws/streams/examples/build/reports/spotbugs/main.xml> with 0 unique warnings and 0 duplicates.
[FINDBUGS] Successfully parsed file <https://builds.apache.org/job/kafka-trunk-jdk8/ws/streams/streams-scala/build/reports/spotbugs/main.xml> with 0 unique warnings and 0 duplicates.
[FINDBUGS] Successfully parsed file <https://builds.apache.org/job/kafka-trunk-jdk8/ws/streams/test-utils/build/reports/spotbugs/main.xml> with 0 unique warnings and 0 duplicates.
[FINDBUGS] Successfully parsed file <https://builds.apache.org/job/kafka-trunk-jdk8/ws/tools/build/reports/spotbugs/main.xml> with 0 unique warnings and 0 duplicates.
Setting GRADLE_4_8_1_HOME=/home/jenkins/tools/gradle/4.8.1
Setting GRADLE_4_8_1_HOME=/home/jenkins/tools/gradle/4.8.1
<Git Blamer> Using GitBlamer to create author and commit information for all warnings.
<Git Blamer> GIT_COMMIT=dc935c4beb49a83497536902f96c19fb7f472d41, workspace=<https://builds.apache.org/job/kafka-trunk-jdk8/ws/>
[FINDBUGS] Computing warning deltas based on reference build #3313
Recording test results
Setting GRADLE_4_8_1_HOME=/home/jenkins/tools/gradle/4.8.1
Setting GRADLE_4_8_1_HOME=/home/jenkins/tools/gradle/4.8.1
Not sending mail to unregistered user ismael@juma.me.uk
Not sending mail to unregistered user manikumar.reddy@gmail.com
Not sending mail to unregistered user wangguoz@gmail.com
Not sending mail to unregistered user vahid.hashemian@gmail.com
Not sending mail to unregistered user noreply@github.com

Build failed in Jenkins: kafka-trunk-jdk8 #3332

Posted by Apache Jenkins Server <je...@builds.apache.org>.
See <https://builds.apache.org/job/kafka-trunk-jdk8/3332/display/redirect?page=changes>

Changes:

[vahid.hashemian] MINOR: Remove unused imports, exceptions, and values (#6117)

------------------------------------------
[...truncated 4.21 MB...]
org.apache.kafka.streams.test.OutputVerifierTest > shouldFailIfValueIsDifferentForCompareKeyValueWithProducerRecord STARTED

org.apache.kafka.streams.test.OutputVerifierTest > shouldFailIfValueIsDifferentForCompareKeyValueWithProducerRecord PASSED

org.apache.kafka.streams.test.OutputVerifierTest > shouldFailIfValueIsDifferentForCompareValueTimestamp STARTED

org.apache.kafka.streams.test.OutputVerifierTest > shouldFailIfValueIsDifferentForCompareValueTimestamp PASSED

org.apache.kafka.streams.test.OutputVerifierTest > shouldNotAllowNullProducerRecordForCompareValue STARTED

org.apache.kafka.streams.test.OutputVerifierTest > shouldNotAllowNullProducerRecordForCompareValue PASSED

org.apache.kafka.streams.test.OutputVerifierTest > shouldFailIfValueIsDifferentWithNullForCompareValueTimestamp STARTED

org.apache.kafka.streams.test.OutputVerifierTest > shouldFailIfValueIsDifferentWithNullForCompareValueTimestamp PASSED

org.apache.kafka.streams.test.OutputVerifierTest > shouldFailIfKeyIsDifferentForCompareKeyValueTimestamp STARTED

org.apache.kafka.streams.test.OutputVerifierTest > shouldFailIfKeyIsDifferentForCompareKeyValueTimestamp PASSED

org.apache.kafka.streams.test.OutputVerifierTest > shouldFailIfKeyIsDifferentForCompareKeyValueTimestampWithProducerRecord STARTED

org.apache.kafka.streams.test.OutputVerifierTest > shouldFailIfKeyIsDifferentForCompareKeyValueTimestampWithProducerRecord PASSED

org.apache.kafka.streams.test.OutputVerifierTest > shouldPassIfValueIsEqualWithNullForCompareValueWithProducerRecord STARTED

org.apache.kafka.streams.test.OutputVerifierTest > shouldPassIfValueIsEqualWithNullForCompareValueWithProducerRecord PASSED

org.apache.kafka.streams.test.OutputVerifierTest > shouldFailIfValueIsDifferentWithNullReverseForCompareValueTimestamp STARTED

org.apache.kafka.streams.test.OutputVerifierTest > shouldFailIfValueIsDifferentWithNullReverseForCompareValueTimestamp PASSED

org.apache.kafka.streams.test.OutputVerifierTest > shouldFailIfValueIsDifferentWithNullReverseForCompareValue STARTED

org.apache.kafka.streams.test.OutputVerifierTest > shouldFailIfValueIsDifferentWithNullReverseForCompareValue PASSED

org.apache.kafka.streams.test.OutputVerifierTest > shouldFailIfTimestampIsDifferentForCompareValueTimestamp STARTED

org.apache.kafka.streams.test.OutputVerifierTest > shouldFailIfTimestampIsDifferentForCompareValueTimestamp PASSED

org.apache.kafka.streams.test.OutputVerifierTest > shouldPassIfKeyAndValueAndTimestampIsEqualWithNullForCompareKeyValueTimestampWithProducerRecord STARTED

org.apache.kafka.streams.test.OutputVerifierTest > shouldPassIfKeyAndValueAndTimestampIsEqualWithNullForCompareKeyValueTimestampWithProducerRecord PASSED

org.apache.kafka.streams.test.OutputVerifierTest > shouldFailIfValueIsDifferentWithNullForCompareKeyValueWithProducerRecord STARTED

org.apache.kafka.streams.test.OutputVerifierTest > shouldFailIfValueIsDifferentWithNullForCompareKeyValueWithProducerRecord PASSED

org.apache.kafka.streams.test.OutputVerifierTest > shouldFailIfValueIsDifferentForCompareKeyValueTimestampWithProducerRecord STARTED

org.apache.kafka.streams.test.OutputVerifierTest > shouldFailIfValueIsDifferentForCompareKeyValueTimestampWithProducerRecord PASSED

org.apache.kafka.streams.test.OutputVerifierTest > shouldNotAllowNullProducerRecordWithExpectedRecordForCompareValueTimestamp STARTED

org.apache.kafka.streams.test.OutputVerifierTest > shouldNotAllowNullProducerRecordWithExpectedRecordForCompareValueTimestamp PASSED

org.apache.kafka.streams.test.OutputVerifierTest > shouldNotAllowNullExpectedRecordForCompareValue STARTED

org.apache.kafka.streams.test.OutputVerifierTest > shouldNotAllowNullExpectedRecordForCompareValue PASSED

org.apache.kafka.streams.test.OutputVerifierTest > shouldFailIfValueIsDifferentWithNullReversForCompareKeyValueTimestampWithProducerRecord STARTED

org.apache.kafka.streams.test.OutputVerifierTest > shouldFailIfValueIsDifferentWithNullReversForCompareKeyValueTimestampWithProducerRecord PASSED

org.apache.kafka.streams.test.OutputVerifierTest > shouldNotAllowNullProducerRecordForCompareKeyValue STARTED

org.apache.kafka.streams.test.OutputVerifierTest > shouldNotAllowNullProducerRecordForCompareKeyValue PASSED

org.apache.kafka.streams.test.OutputVerifierTest > shouldFailIfValueIsDifferentWithNullReversForCompareKeyValueWithProducerRecord STARTED

org.apache.kafka.streams.test.OutputVerifierTest > shouldFailIfValueIsDifferentWithNullReversForCompareKeyValueWithProducerRecord PASSED

org.apache.kafka.streams.test.OutputVerifierTest > shouldPassIfKeyAndValueAndTimestampIsEqualForCompareKeyValueTimestamp STARTED

org.apache.kafka.streams.test.OutputVerifierTest > shouldPassIfKeyAndValueAndTimestampIsEqualForCompareKeyValueTimestamp PASSED

org.apache.kafka.streams.test.OutputVerifierTest > shouldFailIfValueIsDifferentWithNullForCompareKeyValueTimestampWithProducerRecord STARTED

org.apache.kafka.streams.test.OutputVerifierTest > shouldFailIfValueIsDifferentWithNullForCompareKeyValueTimestampWithProducerRecord PASSED

org.apache.kafka.streams.test.OutputVerifierTest > shouldFailIfKeyIsDifferentWithNullReversForCompareKeyValueWithProducerRecord STARTED

org.apache.kafka.streams.test.OutputVerifierTest > shouldFailIfKeyIsDifferentWithNullReversForCompareKeyValueWithProducerRecord PASSED

org.apache.kafka.streams.test.OutputVerifierTest > shouldPassIfKeyAndValueIsEqualWithNullForCompareKeyValueWithProducerRecord STARTED

org.apache.kafka.streams.test.OutputVerifierTest > shouldPassIfKeyAndValueIsEqualWithNullForCompareKeyValueWithProducerRecord PASSED

org.apache.kafka.streams.test.OutputVerifierTest > shouldFailIfKeyIsDifferentWithNullForCompareKeyValueTimestampWithProducerRecord STARTED

org.apache.kafka.streams.test.OutputVerifierTest > shouldFailIfKeyIsDifferentWithNullForCompareKeyValueTimestampWithProducerRecord PASSED

org.apache.kafka.streams.test.OutputVerifierTest > shouldFailIfValueIsDifferentForCompareKeyValueTimestamp STARTED

org.apache.kafka.streams.test.OutputVerifierTest > shouldFailIfValueIsDifferentForCompareKeyValueTimestamp PASSED

org.apache.kafka.streams.test.OutputVerifierTest > shouldPassIfValueAndTimestampIsEqualForCompareValueTimestampWithProducerRecord STARTED

org.apache.kafka.streams.test.OutputVerifierTest > shouldPassIfValueAndTimestampIsEqualForCompareValueTimestampWithProducerRecord PASSED

org.apache.kafka.streams.test.OutputVerifierTest > shouldFailIfValueIsDifferentWithNullReversForCompareKeyValueTimestamp STARTED

org.apache.kafka.streams.test.OutputVerifierTest > shouldFailIfValueIsDifferentWithNullReversForCompareKeyValueTimestamp PASSED

org.apache.kafka.streams.test.OutputVerifierTest > shouldFailIfValueIsDifferentWithNullReverseForCompareValueTimestampWithProducerRecord STARTED

org.apache.kafka.streams.test.OutputVerifierTest > shouldFailIfValueIsDifferentWithNullReverseForCompareValueTimestampWithProducerRecord PASSED

> Task :streams:upgrade-system-tests-0101:testClasses
> Task :streams:upgrade-system-tests-0101:checkstyleTest
> Task :streams:upgrade-system-tests-0101:spotbugsMain NO-SOURCE
> Task :streams:upgrade-system-tests-0101:test
> Task :streams:upgrade-system-tests-0102:compileJava NO-SOURCE
> Task :streams:upgrade-system-tests-0102:processResources NO-SOURCE
> Task :streams:upgrade-system-tests-0102:classes UP-TO-DATE
> Task :streams:upgrade-system-tests-0102:checkstyleMain NO-SOURCE
> Task :streams:upgrade-system-tests-0102:compileTestJava
> Task :streams:upgrade-system-tests-0102:processTestResources NO-SOURCE
> Task :streams:upgrade-system-tests-0102:testClasses
> Task :streams:upgrade-system-tests-0102:checkstyleTest
> Task :streams:upgrade-system-tests-0102:spotbugsMain NO-SOURCE
> Task :streams:upgrade-system-tests-0102:test
> Task :streams:upgrade-system-tests-0110:compileJava NO-SOURCE
> Task :streams:upgrade-system-tests-0110:processResources NO-SOURCE
> Task :streams:upgrade-system-tests-0110:classes UP-TO-DATE
> Task :streams:upgrade-system-tests-0110:checkstyleMain NO-SOURCE
> Task :streams:upgrade-system-tests-0110:compileTestJava
> Task :streams:upgrade-system-tests-0110:processTestResources NO-SOURCE
> Task :streams:upgrade-system-tests-0110:testClasses
> Task :streams:upgrade-system-tests-0110:checkstyleTest
> Task :streams:upgrade-system-tests-0110:spotbugsMain NO-SOURCE
> Task :streams:upgrade-system-tests-0110:test
> Task :streams:upgrade-system-tests-10:compileJava NO-SOURCE
> Task :streams:upgrade-system-tests-10:processResources NO-SOURCE
> Task :streams:upgrade-system-tests-10:classes UP-TO-DATE
> Task :streams:upgrade-system-tests-10:checkstyleMain NO-SOURCE
> Task :streams:upgrade-system-tests-10:compileTestJava
> Task :streams:upgrade-system-tests-10:processTestResources NO-SOURCE
> Task :streams:upgrade-system-tests-10:testClasses
> Task :streams:upgrade-system-tests-10:checkstyleTest
> Task :streams:upgrade-system-tests-10:spotbugsMain NO-SOURCE
> Task :streams:upgrade-system-tests-10:test
> Task :streams:upgrade-system-tests-11:compileJava NO-SOURCE
> Task :streams:upgrade-system-tests-11:processResources NO-SOURCE
> Task :streams:upgrade-system-tests-11:classes UP-TO-DATE
> Task :streams:upgrade-system-tests-11:checkstyleMain NO-SOURCE
> Task :streams:upgrade-system-tests-11:compileTestJava
> Task :streams:upgrade-system-tests-11:processTestResources NO-SOURCE
> Task :streams:upgrade-system-tests-11:testClasses
> Task :streams:upgrade-system-tests-11:checkstyleTest
> Task :streams:upgrade-system-tests-11:spotbugsMain NO-SOURCE
> Task :streams:upgrade-system-tests-11:test
> Task :streams:upgrade-system-tests-20:compileJava NO-SOURCE
> Task :streams:upgrade-system-tests-20:processResources NO-SOURCE
> Task :streams:upgrade-system-tests-20:classes UP-TO-DATE
> Task :streams:upgrade-system-tests-20:checkstyleMain NO-SOURCE
> Task :streams:upgrade-system-tests-20:compileTestJava
> Task :streams:upgrade-system-tests-20:processTestResources NO-SOURCE
> Task :streams:upgrade-system-tests-20:testClasses
> Task :streams:upgrade-system-tests-20:checkstyleTest
> Task :streams:upgrade-system-tests-20:spotbugsMain NO-SOURCE
> Task :streams:upgrade-system-tests-20:test
> Task :streams:upgrade-system-tests-21:compileJava NO-SOURCE
> Task :streams:upgrade-system-tests-21:processResources NO-SOURCE
> Task :streams:upgrade-system-tests-21:classes UP-TO-DATE
> Task :streams:upgrade-system-tests-21:checkstyleMain NO-SOURCE
> Task :streams:upgrade-system-tests-21:compileTestJava
> Task :streams:upgrade-system-tests-21:processTestResources NO-SOURCE
> Task :streams:upgrade-system-tests-21:testClasses
> Task :streams:upgrade-system-tests-21:checkstyleTest
> Task :streams:upgrade-system-tests-21:spotbugsMain NO-SOURCE
> Task :streams:upgrade-system-tests-21:test

FAILURE: Build completed with 3 failures.

1: Task failed with an exception.
-----------
* What went wrong:
Execution failed for task ':core:test'.
> Process 'Gradle Test Executor 4' finished with non-zero exit value 1
  This problem might be caused by incorrect test process configuration.
  Please refer to the test execution section in the user guide at https://docs.gradle.org/5.1/userguide/java_testing.html#sec:test_execution

* Try:
Run with --stacktrace option to get the stack trace. Run with --info or --debug option to get more log output. Run with --scan to get full insights.
==============================================================================

2: Task failed with an exception.
-----------
* What went wrong:
Execution failed for task ':streams:test'.
> There were failing tests. See the report at: file://<https://builds.apache.org/job/kafka-trunk-jdk8/ws/streams/build/reports/tests/test/index.html>

* Try:
Run with --stacktrace option to get the stack trace. Run with --info or --debug option to get more log output. Run with --scan to get full insights.
==============================================================================

3: Task failed with an exception.
-----------
* What went wrong:
Execution failed for task ':connect:runtime:test'.
> There were failing tests. See the report at: file://<https://builds.apache.org/job/kafka-trunk-jdk8/ws/connect/runtime/build/reports/tests/test/index.html>

* Try:
Run with --stacktrace option to get the stack trace. Run with --info or --debug option to get more log output. Run with --scan to get full insights.
==============================================================================

* Get more help at https://help.gradle.org

Deprecated Gradle features were used in this build, making it incompatible with Gradle 6.0.
Use '--warning-mode all' to show the individual deprecation warnings.
See https://docs.gradle.org/5.1/userguide/command_line_interface.html#sec:command_line_warnings

BUILD FAILED in 29m 33s
166 actionable tasks: 163 executed, 3 up-to-date
Build step 'Execute shell' marked build as failure
[FINDBUGS] Collecting findbugs analysis files...
Setting GRADLE_4_8_1_HOME=/home/jenkins/tools/gradle/4.8.1
[FINDBUGS] Searching for all files in <https://builds.apache.org/job/kafka-trunk-jdk8/ws/> that match the pattern **/build/reports/*bugs/*.xml
[FINDBUGS] Parsing 16 files in <https://builds.apache.org/job/kafka-trunk-jdk8/ws/>
[FINDBUGS] Successfully parsed file <https://builds.apache.org/job/kafka-trunk-jdk8/ws/clients/build/reports/spotbugs/main.xml> with 0 unique warnings and 0 duplicates.
[FINDBUGS] Successfully parsed file <https://builds.apache.org/job/kafka-trunk-jdk8/ws/connect/api/build/reports/spotbugs/main.xml> with 0 unique warnings and 0 duplicates.
[FINDBUGS] Successfully parsed file <https://builds.apache.org/job/kafka-trunk-jdk8/ws/connect/basic-auth-extension/build/reports/spotbugs/main.xml> with 0 unique warnings and 0 duplicates.
[FINDBUGS] Successfully parsed file <https://builds.apache.org/job/kafka-trunk-jdk8/ws/connect/file/build/reports/spotbugs/main.xml> with 0 unique warnings and 0 duplicates.
[FINDBUGS] Successfully parsed file <https://builds.apache.org/job/kafka-trunk-jdk8/ws/connect/json/build/reports/spotbugs/main.xml> with 0 unique warnings and 0 duplicates.
[FINDBUGS] Successfully parsed file <https://builds.apache.org/job/kafka-trunk-jdk8/ws/connect/runtime/build/reports/spotbugs/main.xml> with 0 unique warnings and 0 duplicates.
[FINDBUGS] Successfully parsed file <https://builds.apache.org/job/kafka-trunk-jdk8/ws/connect/transforms/build/reports/spotbugs/main.xml> with 0 unique warnings and 0 duplicates.
[FINDBUGS] Successfully parsed file <https://builds.apache.org/job/kafka-trunk-jdk8/ws/core/build/reports/spotbugs/main.xml> with 0 unique warnings and 0 duplicates.
[FINDBUGS] Successfully parsed file <https://builds.apache.org/job/kafka-trunk-jdk8/ws/examples/build/reports/spotbugs/main.xml> with 0 unique warnings and 0 duplicates.
[FINDBUGS] Successfully parsed file <https://builds.apache.org/job/kafka-trunk-jdk8/ws/jmh-benchmarks/build/reports/spotbugs/main.xml> with 0 unique warnings and 0 duplicates.
[FINDBUGS] Successfully parsed file <https://builds.apache.org/job/kafka-trunk-jdk8/ws/log4j-appender/build/reports/spotbugs/main.xml> with 0 unique warnings and 0 duplicates.
[FINDBUGS] Successfully parsed file <https://builds.apache.org/job/kafka-trunk-jdk8/ws/streams/build/reports/spotbugs/main.xml> with 0 unique warnings and 0 duplicates.
[FINDBUGS] Successfully parsed file <https://builds.apache.org/job/kafka-trunk-jdk8/ws/streams/examples/build/reports/spotbugs/main.xml> with 0 unique warnings and 0 duplicates.
[FINDBUGS] Successfully parsed file <https://builds.apache.org/job/kafka-trunk-jdk8/ws/streams/streams-scala/build/reports/spotbugs/main.xml> with 0 unique warnings and 0 duplicates.
[FINDBUGS] Successfully parsed file <https://builds.apache.org/job/kafka-trunk-jdk8/ws/streams/test-utils/build/reports/spotbugs/main.xml> with 0 unique warnings and 0 duplicates.
[FINDBUGS] Successfully parsed file <https://builds.apache.org/job/kafka-trunk-jdk8/ws/tools/build/reports/spotbugs/main.xml> with 0 unique warnings and 0 duplicates.
Setting GRADLE_4_8_1_HOME=/home/jenkins/tools/gradle/4.8.1
Setting GRADLE_4_8_1_HOME=/home/jenkins/tools/gradle/4.8.1
<Git Blamer> Using GitBlamer to create author and commit information for all warnings.
<Git Blamer> GIT_COMMIT=e87e3f2cb286add0c315069b3b2a13c31d65043e, workspace=<https://builds.apache.org/job/kafka-trunk-jdk8/ws/>
[FINDBUGS] Computing warning deltas based on reference build #3313
Recording test results
Setting GRADLE_4_8_1_HOME=/home/jenkins/tools/gradle/4.8.1
Setting GRADLE_4_8_1_HOME=/home/jenkins/tools/gradle/4.8.1
Not sending mail to unregistered user ismael@juma.me.uk
Not sending mail to unregistered user manikumar.reddy@gmail.com
Not sending mail to unregistered user wangguoz@gmail.com
Not sending mail to unregistered user vahid.hashemian@gmail.com
Not sending mail to unregistered user noreply@github.com

Build failed in Jenkins: kafka-trunk-jdk8 #3331

Posted by Apache Jenkins Server <je...@builds.apache.org>.
See <https://builds.apache.org/job/kafka-trunk-jdk8/3331/display/redirect?page=changes>

Changes:

[github] KAFKA-3522: Add internal RecordConverter interface (#6150)

------------------------------------------
[...truncated 2.27 MB...]
org.apache.kafka.streams.test.OutputVerifierTest > shouldFailIfValueIsDifferentForCompareValueWithProducerRecord PASSED

org.apache.kafka.streams.test.OutputVerifierTest > shouldPassIfValueIsEqualForCompareValue STARTED

org.apache.kafka.streams.test.OutputVerifierTest > shouldPassIfValueIsEqualForCompareValue PASSED

org.apache.kafka.streams.test.OutputVerifierTest > shouldNotAllowNullProducerRecordWithExpectedRecordForCompareKeyValueTimestamp STARTED

org.apache.kafka.streams.test.OutputVerifierTest > shouldNotAllowNullProducerRecordWithExpectedRecordForCompareKeyValueTimestamp PASSED

org.apache.kafka.streams.test.OutputVerifierTest > shouldFailIfKeyIsDifferentForCompareKeyValue STARTED

org.apache.kafka.streams.test.OutputVerifierTest > shouldFailIfKeyIsDifferentForCompareKeyValue PASSED

org.apache.kafka.streams.test.OutputVerifierTest > shouldNotAllowNullProducerRecordWithExpectedRecordForCompareKeyValue STARTED

org.apache.kafka.streams.test.OutputVerifierTest > shouldNotAllowNullProducerRecordWithExpectedRecordForCompareKeyValue PASSED

org.apache.kafka.streams.test.OutputVerifierTest > shouldFailIfKeyIsDifferentWithNullForCompareKeyValueWithProducerRecord STARTED

org.apache.kafka.streams.test.OutputVerifierTest > shouldFailIfKeyIsDifferentWithNullForCompareKeyValueWithProducerRecord PASSED

org.apache.kafka.streams.test.OutputVerifierTest > shouldPassIfKeyAndValueAndTimestampIsEqualForCompareKeyValueTimestampWithProducerRecord STARTED

org.apache.kafka.streams.test.OutputVerifierTest > shouldPassIfKeyAndValueAndTimestampIsEqualForCompareKeyValueTimestampWithProducerRecord PASSED

org.apache.kafka.streams.test.OutputVerifierTest > shouldPassIfValueIsEqualWithNullForCompareValue STARTED

org.apache.kafka.streams.test.OutputVerifierTest > shouldPassIfValueIsEqualWithNullForCompareValue PASSED

org.apache.kafka.streams.test.OutputVerifierTest > shouldPassIfValueAndTimestampIsEqualWithNullForCompareValueTimestamp STARTED

org.apache.kafka.streams.test.OutputVerifierTest > shouldPassIfValueAndTimestampIsEqualWithNullForCompareValueTimestamp PASSED

org.apache.kafka.streams.test.OutputVerifierTest > shouldFailIfValueIsDifferentWithNullForCompareValueTimestampWithProducerRecord STARTED

org.apache.kafka.streams.test.OutputVerifierTest > shouldFailIfValueIsDifferentWithNullForCompareValueTimestampWithProducerRecord PASSED

org.apache.kafka.streams.test.OutputVerifierTest > shouldFailIfValueIsDifferentWithNullForCompareValueWithProducerRecord STARTED

org.apache.kafka.streams.test.OutputVerifierTest > shouldFailIfValueIsDifferentWithNullForCompareValueWithProducerRecord PASSED

org.apache.kafka.streams.test.OutputVerifierTest > shouldFailIfKeyIsDifferentWithNullReversForCompareKeyValueTimestampWithProducerRecord STARTED

org.apache.kafka.streams.test.OutputVerifierTest > shouldFailIfKeyIsDifferentWithNullReversForCompareKeyValueTimestampWithProducerRecord PASSED

org.apache.kafka.streams.test.OutputVerifierTest > shouldFailIfKeyIsDifferentWithNullReversForCompareKeyValue STARTED

org.apache.kafka.streams.test.OutputVerifierTest > shouldFailIfKeyIsDifferentWithNullReversForCompareKeyValue PASSED

org.apache.kafka.streams.test.OutputVerifierTest > shouldPassIfKeyAndValueIsEqualForCompareKeyValueWithProducerRecord STARTED

org.apache.kafka.streams.test.OutputVerifierTest > shouldPassIfKeyAndValueIsEqualForCompareKeyValueWithProducerRecord PASSED

org.apache.kafka.streams.test.OutputVerifierTest > shouldFailIfValueIsDifferentForCompareKeyValueWithProducerRecord STARTED

org.apache.kafka.streams.test.OutputVerifierTest > shouldFailIfValueIsDifferentForCompareKeyValueWithProducerRecord PASSED

org.apache.kafka.streams.test.OutputVerifierTest > shouldFailIfValueIsDifferentForCompareValueTimestamp STARTED

org.apache.kafka.streams.test.OutputVerifierTest > shouldFailIfValueIsDifferentForCompareValueTimestamp PASSED

org.apache.kafka.streams.test.OutputVerifierTest > shouldNotAllowNullProducerRecordForCompareValue STARTED

org.apache.kafka.streams.test.OutputVerifierTest > shouldNotAllowNullProducerRecordForCompareValue PASSED

org.apache.kafka.streams.test.OutputVerifierTest > shouldFailIfValueIsDifferentWithNullForCompareValueTimestamp STARTED

org.apache.kafka.streams.test.OutputVerifierTest > shouldFailIfValueIsDifferentWithNullForCompareValueTimestamp PASSED

org.apache.kafka.streams.test.OutputVerifierTest > shouldFailIfKeyIsDifferentForCompareKeyValueTimestamp STARTED

org.apache.kafka.streams.test.OutputVerifierTest > shouldFailIfKeyIsDifferentForCompareKeyValueTimestamp PASSED

org.apache.kafka.streams.test.OutputVerifierTest > shouldFailIfKeyIsDifferentForCompareKeyValueTimestampWithProducerRecord STARTED

org.apache.kafka.streams.test.OutputVerifierTest > shouldFailIfKeyIsDifferentForCompareKeyValueTimestampWithProducerRecord PASSED

org.apache.kafka.streams.test.OutputVerifierTest > shouldPassIfValueIsEqualWithNullForCompareValueWithProducerRecord STARTED

org.apache.kafka.streams.test.OutputVerifierTest > shouldPassIfValueIsEqualWithNullForCompareValueWithProducerRecord PASSED

org.apache.kafka.streams.test.OutputVerifierTest > shouldFailIfValueIsDifferentWithNullReverseForCompareValueTimestamp STARTED

org.apache.kafka.streams.test.OutputVerifierTest > shouldFailIfValueIsDifferentWithNullReverseForCompareValueTimestamp PASSED

org.apache.kafka.streams.test.OutputVerifierTest > shouldFailIfValueIsDifferentWithNullReverseForCompareValue STARTED

org.apache.kafka.streams.test.OutputVerifierTest > shouldFailIfValueIsDifferentWithNullReverseForCompareValue PASSED

org.apache.kafka.streams.test.OutputVerifierTest > shouldFailIfTimestampIsDifferentForCompareValueTimestamp STARTED

org.apache.kafka.streams.test.OutputVerifierTest > shouldFailIfTimestampIsDifferentForCompareValueTimestamp PASSED

org.apache.kafka.streams.test.OutputVerifierTest > shouldPassIfKeyAndValueAndTimestampIsEqualWithNullForCompareKeyValueTimestampWithProducerRecord STARTED

org.apache.kafka.streams.test.OutputVerifierTest > shouldPassIfKeyAndValueAndTimestampIsEqualWithNullForCompareKeyValueTimestampWithProducerRecord PASSED

org.apache.kafka.streams.test.OutputVerifierTest > shouldFailIfValueIsDifferentWithNullForCompareKeyValueWithProducerRecord STARTED

org.apache.kafka.streams.test.OutputVerifierTest > shouldFailIfValueIsDifferentWithNullForCompareKeyValueWithProducerRecord PASSED

org.apache.kafka.streams.test.OutputVerifierTest > shouldFailIfValueIsDifferentForCompareKeyValueTimestampWithProducerRecord STARTED

org.apache.kafka.streams.test.OutputVerifierTest > shouldFailIfValueIsDifferentForCompareKeyValueTimestampWithProducerRecord PASSED

org.apache.kafka.streams.test.OutputVerifierTest > shouldNotAllowNullProducerRecordWithExpectedRecordForCompareValueTimestamp STARTED

org.apache.kafka.streams.test.OutputVerifierTest > shouldNotAllowNullProducerRecordWithExpectedRecordForCompareValueTimestamp PASSED

org.apache.kafka.streams.test.OutputVerifierTest > shouldNotAllowNullExpectedRecordForCompareValue STARTED

org.apache.kafka.streams.test.OutputVerifierTest > shouldNotAllowNullExpectedRecordForCompareValue PASSED

org.apache.kafka.streams.test.OutputVerifierTest > shouldFailIfValueIsDifferentWithNullReversForCompareKeyValueTimestampWithProducerRecord STARTED

org.apache.kafka.streams.test.OutputVerifierTest > shouldFailIfValueIsDifferentWithNullReversForCompareKeyValueTimestampWithProducerRecord PASSED

org.apache.kafka.streams.test.OutputVerifierTest > shouldNotAllowNullProducerRecordForCompareKeyValue STARTED

org.apache.kafka.streams.test.OutputVerifierTest > shouldNotAllowNullProducerRecordForCompareKeyValue PASSED

org.apache.kafka.streams.test.OutputVerifierTest > shouldFailIfValueIsDifferentWithNullReversForCompareKeyValueWithProducerRecord STARTED

org.apache.kafka.streams.test.OutputVerifierTest > shouldFailIfValueIsDifferentWithNullReversForCompareKeyValueWithProducerRecord PASSED

org.apache.kafka.streams.test.OutputVerifierTest > shouldPassIfKeyAndValueAndTimestampIsEqualForCompareKeyValueTimestamp STARTED

org.apache.kafka.streams.test.OutputVerifierTest > shouldPassIfKeyAndValueAndTimestampIsEqualForCompareKeyValueTimestamp PASSED

org.apache.kafka.streams.test.OutputVerifierTest > shouldFailIfValueIsDifferentWithNullForCompareKeyValueTimestampWithProducerRecord STARTED

org.apache.kafka.streams.test.OutputVerifierTest > shouldFailIfValueIsDifferentWithNullForCompareKeyValueTimestampWithProducerRecord PASSED

org.apache.kafka.streams.test.OutputVerifierTest > shouldFailIfKeyIsDifferentWithNullReversForCompareKeyValueWithProducerRecord STARTED

org.apache.kafka.streams.test.OutputVerifierTest > shouldFailIfKeyIsDifferentWithNullReversForCompareKeyValueWithProducerRecord PASSED

org.apache.kafka.streams.test.OutputVerifierTest > shouldPassIfKeyAndValueIsEqualWithNullForCompareKeyValueWithProducerRecord STARTED

org.apache.kafka.streams.test.OutputVerifierTest > shouldPassIfKeyAndValueIsEqualWithNullForCompareKeyValueWithProducerRecord PASSED

org.apache.kafka.streams.test.OutputVerifierTest > shouldFailIfKeyIsDifferentWithNullForCompareKeyValueTimestampWithProducerRecord STARTED

org.apache.kafka.streams.test.OutputVerifierTest > shouldFailIfKeyIsDifferentWithNullForCompareKeyValueTimestampWithProducerRecord PASSED

org.apache.kafka.streams.test.OutputVerifierTest > shouldFailIfValueIsDifferentForCompareKeyValueTimestamp STARTED

org.apache.kafka.streams.test.OutputVerifierTest > shouldFailIfValueIsDifferentForCompareKeyValueTimestamp PASSED

org.apache.kafka.streams.test.OutputVerifierTest > shouldPassIfValueAndTimestampIsEqualForCompareValueTimestampWithProducerRecord STARTED

org.apache.kafka.streams.test.OutputVerifierTest > shouldPassIfValueAndTimestampIsEqualForCompareValueTimestampWithProducerRecord PASSED

org.apache.kafka.streams.test.OutputVerifierTest > shouldFailIfValueIsDifferentWithNullReversForCompareKeyValueTimestamp STARTED

org.apache.kafka.streams.test.OutputVerifierTest > shouldFailIfValueIsDifferentWithNullReversForCompareKeyValueTimestamp PASSED

org.apache.kafka.streams.test.OutputVerifierTest > shouldFailIfValueIsDifferentWithNullReverseForCompareValueTimestampWithProducerRecord STARTED

org.apache.kafka.streams.test.OutputVerifierTest > shouldFailIfValueIsDifferentWithNullReverseForCompareValueTimestampWithProducerRecord PASSED

> Task :streams:upgrade-system-tests-10:processTestResources NO-SOURCE
> Task :streams:upgrade-system-tests-10:testClasses
> Task :streams:upgrade-system-tests-10:checkstyleTest
> Task :streams:upgrade-system-tests-10:spotbugsMain NO-SOURCE
> Task :streams:upgrade-system-tests-10:test
> Task :streams:upgrade-system-tests-11:compileJava NO-SOURCE
> Task :streams:upgrade-system-tests-11:processResources NO-SOURCE
> Task :streams:upgrade-system-tests-11:classes UP-TO-DATE
> Task :streams:upgrade-system-tests-11:checkstyleMain NO-SOURCE
> Task :streams:upgrade-system-tests-11:compileTestJava
> Task :streams:upgrade-system-tests-11:processTestResources NO-SOURCE
> Task :streams:upgrade-system-tests-11:testClasses
> Task :streams:upgrade-system-tests-11:checkstyleTest
> Task :streams:upgrade-system-tests-11:spotbugsMain NO-SOURCE
> Task :streams:upgrade-system-tests-11:test
> Task :streams:upgrade-system-tests-20:compileJava NO-SOURCE
> Task :streams:upgrade-system-tests-20:processResources NO-SOURCE
> Task :streams:upgrade-system-tests-20:classes UP-TO-DATE
> Task :streams:upgrade-system-tests-20:checkstyleMain NO-SOURCE
> Task :streams:upgrade-system-tests-20:compileTestJava
> Task :streams:upgrade-system-tests-20:processTestResources NO-SOURCE
> Task :streams:upgrade-system-tests-20:testClasses
> Task :streams:upgrade-system-tests-20:checkstyleTest
> Task :streams:upgrade-system-tests-20:spotbugsMain NO-SOURCE
> Task :streams:upgrade-system-tests-20:test
> Task :streams:upgrade-system-tests-21:compileJava NO-SOURCE
> Task :streams:upgrade-system-tests-21:processResources NO-SOURCE
> Task :streams:upgrade-system-tests-21:classes UP-TO-DATE
> Task :streams:upgrade-system-tests-21:checkstyleMain NO-SOURCE
> Task :streams:upgrade-system-tests-21:compileTestJava
> Task :streams:upgrade-system-tests-21:processTestResources NO-SOURCE
> Task :streams:upgrade-system-tests-21:testClasses
> Task :streams:upgrade-system-tests-21:checkstyleTest
> Task :streams:upgrade-system-tests-21:spotbugsMain NO-SOURCE
> Task :streams:upgrade-system-tests-21:test

FAILURE: Build failed with an exception.

* What went wrong:
Execution failed for task ':connect:runtime:test'.
> There were failing tests. See the report at: file://<https://builds.apache.org/job/kafka-trunk-jdk8/ws/connect/runtime/build/reports/tests/test/index.html>

* Try:
Run with --stacktrace option to get the stack trace. Run with --info or --debug option to get more log output. Run with --scan to get full insights.

* Get more help at https://help.gradle.org

Deprecated Gradle features were used in this build, making it incompatible with Gradle 6.0.
Use '--warning-mode all' to show the individual deprecation warnings.
See https://docs.gradle.org/5.1/userguide/command_line_interface.html#sec:command_line_warnings

BUILD FAILED in 1h 44m 49s
166 actionable tasks: 165 executed, 1 up-to-date
Build step 'Execute shell' marked build as failure
[FINDBUGS] Collecting findbugs analysis files...
Setting GRADLE_4_8_1_HOME=/home/jenkins/tools/gradle/4.8.1
[FINDBUGS] Searching for all files in <https://builds.apache.org/job/kafka-trunk-jdk8/ws/> that match the pattern **/build/reports/*bugs/*.xml
[FINDBUGS] Parsing 16 files in <https://builds.apache.org/job/kafka-trunk-jdk8/ws/>
[FINDBUGS] Successfully parsed file <https://builds.apache.org/job/kafka-trunk-jdk8/ws/clients/build/reports/spotbugs/main.xml> with 0 unique warnings and 0 duplicates.
[FINDBUGS] Successfully parsed file <https://builds.apache.org/job/kafka-trunk-jdk8/ws/connect/api/build/reports/spotbugs/main.xml> with 0 unique warnings and 0 duplicates.
[FINDBUGS] Successfully parsed file <https://builds.apache.org/job/kafka-trunk-jdk8/ws/connect/basic-auth-extension/build/reports/spotbugs/main.xml> with 0 unique warnings and 0 duplicates.
[FINDBUGS] Successfully parsed file <https://builds.apache.org/job/kafka-trunk-jdk8/ws/connect/file/build/reports/spotbugs/main.xml> with 0 unique warnings and 0 duplicates.
[FINDBUGS] Successfully parsed file <https://builds.apache.org/job/kafka-trunk-jdk8/ws/connect/json/build/reports/spotbugs/main.xml> with 0 unique warnings and 0 duplicates.
[FINDBUGS] Successfully parsed file <https://builds.apache.org/job/kafka-trunk-jdk8/ws/connect/runtime/build/reports/spotbugs/main.xml> with 0 unique warnings and 0 duplicates.
[FINDBUGS] Successfully parsed file <https://builds.apache.org/job/kafka-trunk-jdk8/ws/connect/transforms/build/reports/spotbugs/main.xml> with 0 unique warnings and 0 duplicates.
[FINDBUGS] Successfully parsed file <https://builds.apache.org/job/kafka-trunk-jdk8/ws/core/build/reports/spotbugs/main.xml> with 0 unique warnings and 0 duplicates.
[FINDBUGS] Successfully parsed file <https://builds.apache.org/job/kafka-trunk-jdk8/ws/examples/build/reports/spotbugs/main.xml> with 0 unique warnings and 0 duplicates.
[FINDBUGS] Successfully parsed file <https://builds.apache.org/job/kafka-trunk-jdk8/ws/jmh-benchmarks/build/reports/spotbugs/main.xml> with 0 unique warnings and 0 duplicates.
[FINDBUGS] Successfully parsed file <https://builds.apache.org/job/kafka-trunk-jdk8/ws/log4j-appender/build/reports/spotbugs/main.xml> with 0 unique warnings and 0 duplicates.
[FINDBUGS] Successfully parsed file <https://builds.apache.org/job/kafka-trunk-jdk8/ws/streams/build/reports/spotbugs/main.xml> with 0 unique warnings and 0 duplicates.
[FINDBUGS] Successfully parsed file <https://builds.apache.org/job/kafka-trunk-jdk8/ws/streams/examples/build/reports/spotbugs/main.xml> with 0 unique warnings and 0 duplicates.
[FINDBUGS] Successfully parsed file <https://builds.apache.org/job/kafka-trunk-jdk8/ws/streams/streams-scala/build/reports/spotbugs/main.xml> with 0 unique warnings and 0 duplicates.
[FINDBUGS] Successfully parsed file <https://builds.apache.org/job/kafka-trunk-jdk8/ws/streams/test-utils/build/reports/spotbugs/main.xml> with 0 unique warnings and 0 duplicates.
[FINDBUGS] Successfully parsed file <https://builds.apache.org/job/kafka-trunk-jdk8/ws/tools/build/reports/spotbugs/main.xml> with 0 unique warnings and 0 duplicates.
Setting GRADLE_4_8_1_HOME=/home/jenkins/tools/gradle/4.8.1
Setting GRADLE_4_8_1_HOME=/home/jenkins/tools/gradle/4.8.1
<Git Blamer> Using GitBlamer to create author and commit information for all warnings.
<Git Blamer> GIT_COMMIT=ed7b67dd1135e213ed7eda8ee2d733de7c965519, workspace=<https://builds.apache.org/job/kafka-trunk-jdk8/ws/>
[FINDBUGS] Computing warning deltas based on reference build #3313
Recording test results
Setting GRADLE_4_8_1_HOME=/home/jenkins/tools/gradle/4.8.1
Setting GRADLE_4_8_1_HOME=/home/jenkins/tools/gradle/4.8.1
Not sending mail to unregistered user ismael@juma.me.uk
Not sending mail to unregistered user manikumar.reddy@gmail.com
Not sending mail to unregistered user wangguoz@gmail.com
Not sending mail to unregistered user vahid.hashemian@gmail.com
Not sending mail to unregistered user noreply@github.com

Build failed in Jenkins: kafka-trunk-jdk8 #3330

Posted by Apache Jenkins Server <je...@builds.apache.org>.
See <https://builds.apache.org/job/kafka-trunk-jdk8/3330/display/redirect?page=changes>

Changes:

[vahid.hashemian] Fix Javadoc of KafkaConsumer (#6155)

------------------------------------------
[...truncated 2.27 MB...]
org.apache.kafka.streams.test.OutputVerifierTest > shouldFailIfValueIsDifferentForCompareValueWithProducerRecord STARTED

org.apache.kafka.streams.test.OutputVerifierTest > shouldFailIfValueIsDifferentForCompareValueWithProducerRecord PASSED

org.apache.kafka.streams.test.OutputVerifierTest > shouldPassIfValueIsEqualForCompareValue STARTED

org.apache.kafka.streams.test.OutputVerifierTest > shouldPassIfValueIsEqualForCompareValue PASSED

org.apache.kafka.streams.test.OutputVerifierTest > shouldNotAllowNullProducerRecordWithExpectedRecordForCompareKeyValueTimestamp STARTED

org.apache.kafka.streams.test.OutputVerifierTest > shouldNotAllowNullProducerRecordWithExpectedRecordForCompareKeyValueTimestamp PASSED

org.apache.kafka.streams.test.OutputVerifierTest > shouldFailIfKeyIsDifferentForCompareKeyValue STARTED

org.apache.kafka.streams.test.OutputVerifierTest > shouldFailIfKeyIsDifferentForCompareKeyValue PASSED

org.apache.kafka.streams.test.OutputVerifierTest > shouldNotAllowNullProducerRecordWithExpectedRecordForCompareKeyValue STARTED

org.apache.kafka.streams.test.OutputVerifierTest > shouldNotAllowNullProducerRecordWithExpectedRecordForCompareKeyValue PASSED

org.apache.kafka.streams.test.OutputVerifierTest > shouldFailIfKeyIsDifferentWithNullForCompareKeyValueWithProducerRecord STARTED

org.apache.kafka.streams.test.OutputVerifierTest > shouldFailIfKeyIsDifferentWithNullForCompareKeyValueWithProducerRecord PASSED

org.apache.kafka.streams.test.OutputVerifierTest > shouldPassIfKeyAndValueAndTimestampIsEqualForCompareKeyValueTimestampWithProducerRecord STARTED

org.apache.kafka.streams.test.OutputVerifierTest > shouldPassIfKeyAndValueAndTimestampIsEqualForCompareKeyValueTimestampWithProducerRecord PASSED

org.apache.kafka.streams.test.OutputVerifierTest > shouldPassIfValueIsEqualWithNullForCompareValue STARTED

org.apache.kafka.streams.test.OutputVerifierTest > shouldPassIfValueIsEqualWithNullForCompareValue PASSED

org.apache.kafka.streams.test.OutputVerifierTest > shouldPassIfValueAndTimestampIsEqualWithNullForCompareValueTimestamp STARTED

org.apache.kafka.streams.test.OutputVerifierTest > shouldPassIfValueAndTimestampIsEqualWithNullForCompareValueTimestamp PASSED

org.apache.kafka.streams.test.OutputVerifierTest > shouldFailIfValueIsDifferentWithNullForCompareValueTimestampWithProducerRecord STARTED

org.apache.kafka.streams.test.OutputVerifierTest > shouldFailIfValueIsDifferentWithNullForCompareValueTimestampWithProducerRecord PASSED

org.apache.kafka.streams.test.OutputVerifierTest > shouldFailIfValueIsDifferentWithNullForCompareValueWithProducerRecord STARTED

org.apache.kafka.streams.test.OutputVerifierTest > shouldFailIfValueIsDifferentWithNullForCompareValueWithProducerRecord PASSED

org.apache.kafka.streams.test.OutputVerifierTest > shouldFailIfKeyIsDifferentWithNullReversForCompareKeyValueTimestampWithProducerRecord STARTED

org.apache.kafka.streams.test.OutputVerifierTest > shouldFailIfKeyIsDifferentWithNullReversForCompareKeyValueTimestampWithProducerRecord PASSED

org.apache.kafka.streams.test.OutputVerifierTest > shouldFailIfKeyIsDifferentWithNullReversForCompareKeyValue STARTED

org.apache.kafka.streams.test.OutputVerifierTest > shouldFailIfKeyIsDifferentWithNullReversForCompareKeyValue PASSED

org.apache.kafka.streams.test.OutputVerifierTest > shouldPassIfKeyAndValueIsEqualForCompareKeyValueWithProducerRecord STARTED

org.apache.kafka.streams.test.OutputVerifierTest > shouldPassIfKeyAndValueIsEqualForCompareKeyValueWithProducerRecord PASSED

org.apache.kafka.streams.test.OutputVerifierTest > shouldFailIfValueIsDifferentForCompareKeyValueWithProducerRecord STARTED

org.apache.kafka.streams.test.OutputVerifierTest > shouldFailIfValueIsDifferentForCompareKeyValueWithProducerRecord PASSED

org.apache.kafka.streams.test.OutputVerifierTest > shouldFailIfValueIsDifferentForCompareValueTimestamp STARTED

org.apache.kafka.streams.test.OutputVerifierTest > shouldFailIfValueIsDifferentForCompareValueTimestamp PASSED

org.apache.kafka.streams.test.OutputVerifierTest > shouldNotAllowNullProducerRecordForCompareValue STARTED

org.apache.kafka.streams.test.OutputVerifierTest > shouldNotAllowNullProducerRecordForCompareValue PASSED

org.apache.kafka.streams.test.OutputVerifierTest > shouldFailIfValueIsDifferentWithNullForCompareValueTimestamp STARTED

org.apache.kafka.streams.test.OutputVerifierTest > shouldFailIfValueIsDifferentWithNullForCompareValueTimestamp PASSED

org.apache.kafka.streams.test.OutputVerifierTest > shouldFailIfKeyIsDifferentForCompareKeyValueTimestamp STARTED

org.apache.kafka.streams.test.OutputVerifierTest > shouldFailIfKeyIsDifferentForCompareKeyValueTimestamp PASSED

org.apache.kafka.streams.test.OutputVerifierTest > shouldFailIfKeyIsDifferentForCompareKeyValueTimestampWithProducerRecord STARTED

org.apache.kafka.streams.test.OutputVerifierTest > shouldFailIfKeyIsDifferentForCompareKeyValueTimestampWithProducerRecord PASSED

org.apache.kafka.streams.test.OutputVerifierTest > shouldPassIfValueIsEqualWithNullForCompareValueWithProducerRecord STARTED

org.apache.kafka.streams.test.OutputVerifierTest > shouldPassIfValueIsEqualWithNullForCompareValueWithProducerRecord PASSED

org.apache.kafka.streams.test.OutputVerifierTest > shouldFailIfValueIsDifferentWithNullReverseForCompareValueTimestamp STARTED

org.apache.kafka.streams.test.OutputVerifierTest > shouldFailIfValueIsDifferentWithNullReverseForCompareValueTimestamp PASSED

org.apache.kafka.streams.test.OutputVerifierTest > shouldFailIfValueIsDifferentWithNullReverseForCompareValue STARTED

org.apache.kafka.streams.test.OutputVerifierTest > shouldFailIfValueIsDifferentWithNullReverseForCompareValue PASSED

org.apache.kafka.streams.test.OutputVerifierTest > shouldFailIfTimestampIsDifferentForCompareValueTimestamp STARTED

org.apache.kafka.streams.test.OutputVerifierTest > shouldFailIfTimestampIsDifferentForCompareValueTimestamp PASSED

org.apache.kafka.streams.test.OutputVerifierTest > shouldPassIfKeyAndValueAndTimestampIsEqualWithNullForCompareKeyValueTimestampWithProducerRecord STARTED

org.apache.kafka.streams.test.OutputVerifierTest > shouldPassIfKeyAndValueAndTimestampIsEqualWithNullForCompareKeyValueTimestampWithProducerRecord PASSED

org.apache.kafka.streams.test.OutputVerifierTest > shouldFailIfValueIsDifferentWithNullForCompareKeyValueWithProducerRecord STARTED

org.apache.kafka.streams.test.OutputVerifierTest > shouldFailIfValueIsDifferentWithNullForCompareKeyValueWithProducerRecord PASSED

org.apache.kafka.streams.test.OutputVerifierTest > shouldFailIfValueIsDifferentForCompareKeyValueTimestampWithProducerRecord STARTED

org.apache.kafka.streams.test.OutputVerifierTest > shouldFailIfValueIsDifferentForCompareKeyValueTimestampWithProducerRecord PASSED

org.apache.kafka.streams.test.OutputVerifierTest > shouldNotAllowNullProducerRecordWithExpectedRecordForCompareValueTimestamp STARTED

org.apache.kafka.streams.test.OutputVerifierTest > shouldNotAllowNullProducerRecordWithExpectedRecordForCompareValueTimestamp PASSED

org.apache.kafka.streams.test.OutputVerifierTest > shouldNotAllowNullExpectedRecordForCompareValue STARTED

org.apache.kafka.streams.test.OutputVerifierTest > shouldNotAllowNullExpectedRecordForCompareValue PASSED

org.apache.kafka.streams.test.OutputVerifierTest > shouldFailIfValueIsDifferentWithNullReversForCompareKeyValueTimestampWithProducerRecord STARTED

org.apache.kafka.streams.test.OutputVerifierTest > shouldFailIfValueIsDifferentWithNullReversForCompareKeyValueTimestampWithProducerRecord PASSED

org.apache.kafka.streams.test.OutputVerifierTest > shouldNotAllowNullProducerRecordForCompareKeyValue STARTED

org.apache.kafka.streams.test.OutputVerifierTest > shouldNotAllowNullProducerRecordForCompareKeyValue PASSED

org.apache.kafka.streams.test.OutputVerifierTest > shouldFailIfValueIsDifferentWithNullReversForCompareKeyValueWithProducerRecord STARTED

org.apache.kafka.streams.test.OutputVerifierTest > shouldFailIfValueIsDifferentWithNullReversForCompareKeyValueWithProducerRecord PASSED

org.apache.kafka.streams.test.OutputVerifierTest > shouldPassIfKeyAndValueAndTimestampIsEqualForCompareKeyValueTimestamp STARTED

org.apache.kafka.streams.test.OutputVerifierTest > shouldPassIfKeyAndValueAndTimestampIsEqualForCompareKeyValueTimestamp PASSED

org.apache.kafka.streams.test.OutputVerifierTest > shouldFailIfValueIsDifferentWithNullForCompareKeyValueTimestampWithProducerRecord STARTED

org.apache.kafka.streams.test.OutputVerifierTest > shouldFailIfValueIsDifferentWithNullForCompareKeyValueTimestampWithProducerRecord PASSED

org.apache.kafka.streams.test.OutputVerifierTest > shouldFailIfKeyIsDifferentWithNullReversForCompareKeyValueWithProducerRecord STARTED

org.apache.kafka.streams.test.OutputVerifierTest > shouldFailIfKeyIsDifferentWithNullReversForCompareKeyValueWithProducerRecord PASSED

org.apache.kafka.streams.test.OutputVerifierTest > shouldPassIfKeyAndValueIsEqualWithNullForCompareKeyValueWithProducerRecord STARTED

org.apache.kafka.streams.test.OutputVerifierTest > shouldPassIfKeyAndValueIsEqualWithNullForCompareKeyValueWithProducerRecord PASSED

org.apache.kafka.streams.test.OutputVerifierTest > shouldFailIfKeyIsDifferentWithNullForCompareKeyValueTimestampWithProducerRecord STARTED

org.apache.kafka.streams.test.OutputVerifierTest > shouldFailIfKeyIsDifferentWithNullForCompareKeyValueTimestampWithProducerRecord PASSED

org.apache.kafka.streams.test.OutputVerifierTest > shouldFailIfValueIsDifferentForCompareKeyValueTimestamp STARTED

org.apache.kafka.streams.test.OutputVerifierTest > shouldFailIfValueIsDifferentForCompareKeyValueTimestamp PASSED

org.apache.kafka.streams.test.OutputVerifierTest > shouldPassIfValueAndTimestampIsEqualForCompareValueTimestampWithProducerRecord STARTED

org.apache.kafka.streams.test.OutputVerifierTest > shouldPassIfValueAndTimestampIsEqualForCompareValueTimestampWithProducerRecord PASSED

org.apache.kafka.streams.test.OutputVerifierTest > shouldFailIfValueIsDifferentWithNullReversForCompareKeyValueTimestamp STARTED

org.apache.kafka.streams.test.OutputVerifierTest > shouldFailIfValueIsDifferentWithNullReversForCompareKeyValueTimestamp PASSED

org.apache.kafka.streams.test.OutputVerifierTest > shouldFailIfValueIsDifferentWithNullReverseForCompareValueTimestampWithProducerRecord STARTED

org.apache.kafka.streams.test.OutputVerifierTest > shouldFailIfValueIsDifferentWithNullReverseForCompareValueTimestampWithProducerRecord PASSED

> Task :streams:upgrade-system-tests-20:compileJava NO-SOURCE
> Task :streams:upgrade-system-tests-20:processResources NO-SOURCE
> Task :streams:upgrade-system-tests-20:classes UP-TO-DATE
> Task :streams:upgrade-system-tests-20:checkstyleMain NO-SOURCE
> Task :streams:upgrade-system-tests-20:compileTestJava
> Task :streams:upgrade-system-tests-20:processTestResources NO-SOURCE
> Task :streams:upgrade-system-tests-20:testClasses
> Task :streams:upgrade-system-tests-20:checkstyleTest
> Task :streams:upgrade-system-tests-20:spotbugsMain NO-SOURCE
> Task :streams:upgrade-system-tests-20:test
> Task :streams:upgrade-system-tests-21:compileJava NO-SOURCE
> Task :streams:upgrade-system-tests-21:processResources NO-SOURCE
> Task :streams:upgrade-system-tests-21:classes UP-TO-DATE
> Task :streams:upgrade-system-tests-21:checkstyleMain NO-SOURCE
> Task :streams:upgrade-system-tests-21:compileTestJava
> Task :streams:upgrade-system-tests-21:processTestResources NO-SOURCE
> Task :streams:upgrade-system-tests-21:testClasses
> Task :streams:upgrade-system-tests-21:checkstyleTest
> Task :streams:upgrade-system-tests-21:spotbugsMain NO-SOURCE
> Task :streams:upgrade-system-tests-21:test

FAILURE: Build completed with 2 failures.

1: Task failed with an exception.
-----------
* What went wrong:
Execution failed for task ':streams:test'.
> There were failing tests. See the report at: file://<https://builds.apache.org/job/kafka-trunk-jdk8/ws/streams/build/reports/tests/test/index.html>

* Try:
Run with --stacktrace option to get the stack trace. Run with --info or --debug option to get more log output. Run with --scan to get full insights.
==============================================================================

2: Task failed with an exception.
-----------
* What went wrong:
Execution failed for task ':connect:runtime:test'.
> There were failing tests. See the report at: file://<https://builds.apache.org/job/kafka-trunk-jdk8/ws/connect/runtime/build/reports/tests/test/index.html>

* Try:
Run with --stacktrace option to get the stack trace. Run with --info or --debug option to get more log output. Run with --scan to get full insights.
==============================================================================

* Get more help at https://help.gradle.org

Deprecated Gradle features were used in this build, making it incompatible with Gradle 6.0.
Use '--warning-mode all' to show the individual deprecation warnings.
See https://docs.gradle.org/5.1/userguide/command_line_interface.html#sec:command_line_warnings

BUILD FAILED in 1h 41m 46s
166 actionable tasks: 165 executed, 1 up-to-date
Build step 'Execute shell' marked build as failure
[FINDBUGS] Collecting findbugs analysis files...
Setting GRADLE_4_8_1_HOME=/home/jenkins/tools/gradle/4.8.1
[FINDBUGS] Searching for all files in <https://builds.apache.org/job/kafka-trunk-jdk8/ws/> that match the pattern **/build/reports/*bugs/*.xml
[FINDBUGS] Parsing 16 files in <https://builds.apache.org/job/kafka-trunk-jdk8/ws/>
[FINDBUGS] Successfully parsed file <https://builds.apache.org/job/kafka-trunk-jdk8/ws/clients/build/reports/spotbugs/main.xml> with 0 unique warnings and 0 duplicates.
[FINDBUGS] Successfully parsed file <https://builds.apache.org/job/kafka-trunk-jdk8/ws/connect/api/build/reports/spotbugs/main.xml> with 0 unique warnings and 0 duplicates.
[FINDBUGS] Successfully parsed file <https://builds.apache.org/job/kafka-trunk-jdk8/ws/connect/basic-auth-extension/build/reports/spotbugs/main.xml> with 0 unique warnings and 0 duplicates.
[FINDBUGS] Successfully parsed file <https://builds.apache.org/job/kafka-trunk-jdk8/ws/connect/file/build/reports/spotbugs/main.xml> with 0 unique warnings and 0 duplicates.
[FINDBUGS] Successfully parsed file <https://builds.apache.org/job/kafka-trunk-jdk8/ws/connect/json/build/reports/spotbugs/main.xml> with 0 unique warnings and 0 duplicates.
[FINDBUGS] Successfully parsed file <https://builds.apache.org/job/kafka-trunk-jdk8/ws/connect/runtime/build/reports/spotbugs/main.xml> with 0 unique warnings and 0 duplicates.
[FINDBUGS] Successfully parsed file <https://builds.apache.org/job/kafka-trunk-jdk8/ws/connect/transforms/build/reports/spotbugs/main.xml> with 0 unique warnings and 0 duplicates.
[FINDBUGS] Successfully parsed file <https://builds.apache.org/job/kafka-trunk-jdk8/ws/core/build/reports/spotbugs/main.xml> with 0 unique warnings and 0 duplicates.
[FINDBUGS] Successfully parsed file <https://builds.apache.org/job/kafka-trunk-jdk8/ws/examples/build/reports/spotbugs/main.xml> with 0 unique warnings and 0 duplicates.
[FINDBUGS] Successfully parsed file <https://builds.apache.org/job/kafka-trunk-jdk8/ws/jmh-benchmarks/build/reports/spotbugs/main.xml> with 0 unique warnings and 0 duplicates.
[FINDBUGS] Successfully parsed file <https://builds.apache.org/job/kafka-trunk-jdk8/ws/log4j-appender/build/reports/spotbugs/main.xml> with 0 unique warnings and 0 duplicates.
[FINDBUGS] Successfully parsed file <https://builds.apache.org/job/kafka-trunk-jdk8/ws/streams/build/reports/spotbugs/main.xml> with 0 unique warnings and 0 duplicates.
[FINDBUGS] Successfully parsed file <https://builds.apache.org/job/kafka-trunk-jdk8/ws/streams/examples/build/reports/spotbugs/main.xml> with 0 unique warnings and 0 duplicates.
[FINDBUGS] Successfully parsed file <https://builds.apache.org/job/kafka-trunk-jdk8/ws/streams/streams-scala/build/reports/spotbugs/main.xml> with 0 unique warnings and 0 duplicates.
[FINDBUGS] Successfully parsed file <https://builds.apache.org/job/kafka-trunk-jdk8/ws/streams/test-utils/build/reports/spotbugs/main.xml> with 0 unique warnings and 0 duplicates.
[FINDBUGS] Successfully parsed file <https://builds.apache.org/job/kafka-trunk-jdk8/ws/tools/build/reports/spotbugs/main.xml> with 0 unique warnings and 0 duplicates.
Setting GRADLE_4_8_1_HOME=/home/jenkins/tools/gradle/4.8.1
Setting GRADLE_4_8_1_HOME=/home/jenkins/tools/gradle/4.8.1
<Git Blamer> Using GitBlamer to create author and commit information for all warnings.
<Git Blamer> GIT_COMMIT=6cae2577bad5895a922dee96fdcd69182ebb7d0c, workspace=<https://builds.apache.org/job/kafka-trunk-jdk8/ws/>
[FINDBUGS] Computing warning deltas based on reference build #3313
Recording test results
Setting GRADLE_4_8_1_HOME=/home/jenkins/tools/gradle/4.8.1
Setting GRADLE_4_8_1_HOME=/home/jenkins/tools/gradle/4.8.1
Not sending mail to unregistered user ismael@juma.me.uk
Not sending mail to unregistered user manikumar.reddy@gmail.com
Not sending mail to unregistered user wangguoz@gmail.com
Not sending mail to unregistered user vahid.hashemian@gmail.com
Not sending mail to unregistered user noreply@github.com

Build failed in Jenkins: kafka-trunk-jdk8 #3329

Posted by Apache Jenkins Server <je...@builds.apache.org>.
See <https://builds.apache.org/job/kafka-trunk-jdk8/3329/display/redirect?page=changes>

Changes:

[github] KAFKA-6455: Extend CacheFlushListener to forward timestamp (#6147)

------------------------------------------
[...truncated 2.27 MB...]

org.apache.kafka.connect.converters.ByteArrayConverterTest > testToConnect PASSED

org.apache.kafka.connect.converters.ByteArrayConverterTest > testFromConnect STARTED

org.apache.kafka.connect.converters.ByteArrayConverterTest > testFromConnect PASSED

org.apache.kafka.connect.converters.ByteArrayConverterTest > testFromConnectInvalidValue STARTED

org.apache.kafka.connect.converters.ByteArrayConverterTest > testFromConnectInvalidValue PASSED

org.apache.kafka.connect.converters.LongConverterTest > testBytesNullToNumber STARTED

org.apache.kafka.connect.converters.LongConverterTest > testBytesNullToNumber PASSED

org.apache.kafka.connect.converters.LongConverterTest > testSerializingIncorrectType STARTED

org.apache.kafka.connect.converters.LongConverterTest > testSerializingIncorrectType PASSED

org.apache.kafka.connect.converters.LongConverterTest > testDeserializingHeaderWithTooManyBytes STARTED

org.apache.kafka.connect.converters.LongConverterTest > testDeserializingHeaderWithTooManyBytes PASSED

org.apache.kafka.connect.converters.LongConverterTest > testNullToBytes STARTED

org.apache.kafka.connect.converters.LongConverterTest > testNullToBytes PASSED

org.apache.kafka.connect.converters.LongConverterTest > testSerializingIncorrectHeader STARTED

org.apache.kafka.connect.converters.LongConverterTest > testSerializingIncorrectHeader PASSED

org.apache.kafka.connect.converters.LongConverterTest > testDeserializingDataWithTooManyBytes STARTED

org.apache.kafka.connect.converters.LongConverterTest > testDeserializingDataWithTooManyBytes PASSED

org.apache.kafka.connect.converters.LongConverterTest > testConvertingSamplesToAndFromBytes STARTED

org.apache.kafka.connect.converters.LongConverterTest > testConvertingSamplesToAndFromBytes PASSED

org.apache.kafka.connect.converters.IntegerConverterTest > testBytesNullToNumber STARTED

org.apache.kafka.connect.converters.IntegerConverterTest > testBytesNullToNumber PASSED

org.apache.kafka.connect.converters.IntegerConverterTest > testSerializingIncorrectType STARTED

org.apache.kafka.connect.converters.IntegerConverterTest > testSerializingIncorrectType PASSED

org.apache.kafka.connect.converters.IntegerConverterTest > testDeserializingHeaderWithTooManyBytes STARTED

org.apache.kafka.connect.converters.IntegerConverterTest > testDeserializingHeaderWithTooManyBytes PASSED

org.apache.kafka.connect.converters.IntegerConverterTest > testNullToBytes STARTED

org.apache.kafka.connect.converters.IntegerConverterTest > testNullToBytes PASSED

org.apache.kafka.connect.converters.IntegerConverterTest > testSerializingIncorrectHeader STARTED

org.apache.kafka.connect.converters.IntegerConverterTest > testSerializingIncorrectHeader PASSED

org.apache.kafka.connect.converters.IntegerConverterTest > testDeserializingDataWithTooManyBytes STARTED

org.apache.kafka.connect.converters.IntegerConverterTest > testDeserializingDataWithTooManyBytes PASSED

org.apache.kafka.connect.converters.IntegerConverterTest > testConvertingSamplesToAndFromBytes STARTED

org.apache.kafka.connect.converters.IntegerConverterTest > testConvertingSamplesToAndFromBytes PASSED

org.apache.kafka.connect.converters.DoubleConverterTest > testBytesNullToNumber STARTED

org.apache.kafka.connect.converters.DoubleConverterTest > testBytesNullToNumber PASSED

org.apache.kafka.connect.converters.DoubleConverterTest > testSerializingIncorrectType STARTED

org.apache.kafka.connect.converters.DoubleConverterTest > testSerializingIncorrectType PASSED

org.apache.kafka.connect.converters.DoubleConverterTest > testDeserializingHeaderWithTooManyBytes STARTED

org.apache.kafka.connect.converters.DoubleConverterTest > testDeserializingHeaderWithTooManyBytes PASSED

org.apache.kafka.connect.converters.DoubleConverterTest > testNullToBytes STARTED

org.apache.kafka.connect.converters.DoubleConverterTest > testNullToBytes PASSED

org.apache.kafka.connect.converters.DoubleConverterTest > testSerializingIncorrectHeader STARTED

org.apache.kafka.connect.converters.DoubleConverterTest > testSerializingIncorrectHeader PASSED

org.apache.kafka.connect.converters.DoubleConverterTest > testDeserializingDataWithTooManyBytes STARTED

org.apache.kafka.connect.converters.DoubleConverterTest > testDeserializingDataWithTooManyBytes PASSED

org.apache.kafka.connect.converters.DoubleConverterTest > testConvertingSamplesToAndFromBytes STARTED

org.apache.kafka.connect.converters.DoubleConverterTest > testConvertingSamplesToAndFromBytes PASSED

org.apache.kafka.connect.integration.ExampleConnectIntegrationTest > testProduceConsumeConnector STARTED

org.apache.kafka.connect.integration.ExampleConnectIntegrationTest > testProduceConsumeConnector PASSED

org.apache.kafka.connect.integration.ErrorHandlingIntegrationTest > testSkipRetryAndDLQWithHeaders STARTED

org.apache.kafka.connect.integration.ErrorHandlingIntegrationTest > testSkipRetryAndDLQWithHeaders FAILED
    org.apache.kafka.connect.errors.ConnectException: Could not read connector state
        at org.apache.kafka.connect.util.clusters.EmbeddedConnectCluster.connectorStatus(EmbeddedConnectCluster.java:179)
        at org.apache.kafka.connect.integration.ErrorHandlingIntegrationTest.lambda$testSkipRetryAndDLQWithHeaders$0(ErrorHandlingIntegrationTest.java:135)
        at org.apache.kafka.test.TestUtils.waitForCondition(TestUtils.java:355)
        at org.apache.kafka.test.TestUtils.waitForCondition(TestUtils.java:342)
        at org.apache.kafka.connect.integration.ErrorHandlingIntegrationTest.testSkipRetryAndDLQWithHeaders(ErrorHandlingIntegrationTest.java:135)

        Caused by:
        java.io.FileNotFoundException: http://localhost:35904/connectors/error-conn/status
            at sun.net.www.protocol.http.HttpURLConnection.getInputStream0(HttpURLConnection.java:1890)
            at sun.net.www.protocol.http.HttpURLConnection.getInputStream(HttpURLConnection.java:1492)
            at org.apache.kafka.connect.util.clusters.EmbeddedConnectCluster.executeGet(EmbeddedConnectCluster.java:223)
            at org.apache.kafka.connect.util.clusters.EmbeddedConnectCluster.connectorStatus(EmbeddedConnectCluster.java:176)
            ... 4 more

384 tests completed, 1 failed

> Task :connect:runtime:test FAILED
> Task :streams:upgrade-system-tests-0102:testClasses
> Task :streams:upgrade-system-tests-0102:checkstyleTest
> Task :streams:upgrade-system-tests-0102:spotbugsMain NO-SOURCE
> Task :streams:upgrade-system-tests-0102:test
> Task :streams:upgrade-system-tests-0110:compileJava NO-SOURCE
> Task :streams:upgrade-system-tests-0110:processResources NO-SOURCE
> Task :streams:upgrade-system-tests-0110:classes UP-TO-DATE
> Task :streams:upgrade-system-tests-0110:checkstyleMain NO-SOURCE
> Task :streams:upgrade-system-tests-0110:compileTestJava
> Task :streams:upgrade-system-tests-0110:processTestResources NO-SOURCE
> Task :streams:upgrade-system-tests-0110:testClasses
> Task :streams:upgrade-system-tests-0110:checkstyleTest
> Task :streams:upgrade-system-tests-0110:spotbugsMain NO-SOURCE
> Task :streams:upgrade-system-tests-0110:test
> Task :streams:upgrade-system-tests-10:compileJava NO-SOURCE
> Task :streams:upgrade-system-tests-10:processResources NO-SOURCE
> Task :streams:upgrade-system-tests-10:classes UP-TO-DATE
> Task :streams:upgrade-system-tests-10:checkstyleMain NO-SOURCE
> Task :streams:upgrade-system-tests-10:compileTestJava
> Task :streams:upgrade-system-tests-10:processTestResources NO-SOURCE
> Task :streams:upgrade-system-tests-10:testClasses
> Task :streams:upgrade-system-tests-10:checkstyleTest
> Task :streams:upgrade-system-tests-10:spotbugsMain NO-SOURCE
> Task :streams:upgrade-system-tests-10:test
> Task :streams:upgrade-system-tests-11:compileJava NO-SOURCE
> Task :streams:upgrade-system-tests-11:processResources NO-SOURCE
> Task :streams:upgrade-system-tests-11:classes UP-TO-DATE
> Task :streams:upgrade-system-tests-11:checkstyleMain NO-SOURCE
> Task :streams:upgrade-system-tests-11:compileTestJava
> Task :streams:upgrade-system-tests-11:processTestResources NO-SOURCE
> Task :streams:upgrade-system-tests-11:testClasses
> Task :streams:upgrade-system-tests-11:checkstyleTest
> Task :streams:upgrade-system-tests-11:spotbugsMain NO-SOURCE
> Task :streams:upgrade-system-tests-11:test
> Task :streams:upgrade-system-tests-20:compileJava NO-SOURCE
> Task :streams:upgrade-system-tests-20:processResources NO-SOURCE
> Task :streams:upgrade-system-tests-20:classes UP-TO-DATE
> Task :streams:upgrade-system-tests-20:checkstyleMain NO-SOURCE
> Task :streams:upgrade-system-tests-20:compileTestJava
> Task :streams:upgrade-system-tests-20:processTestResources NO-SOURCE
> Task :streams:upgrade-system-tests-20:testClasses
> Task :streams:upgrade-system-tests-20:checkstyleTest
> Task :streams:upgrade-system-tests-20:spotbugsMain NO-SOURCE
> Task :streams:upgrade-system-tests-20:test
> Task :streams:upgrade-system-tests-21:compileJava NO-SOURCE
> Task :streams:upgrade-system-tests-21:processResources NO-SOURCE
> Task :streams:upgrade-system-tests-21:classes UP-TO-DATE
> Task :streams:upgrade-system-tests-21:checkstyleMain NO-SOURCE
> Task :streams:upgrade-system-tests-21:compileTestJava
> Task :streams:upgrade-system-tests-21:processTestResources NO-SOURCE
> Task :streams:upgrade-system-tests-21:testClasses
> Task :streams:upgrade-system-tests-21:checkstyleTest
> Task :streams:upgrade-system-tests-21:spotbugsMain NO-SOURCE
> Task :streams:upgrade-system-tests-21:test

FAILURE: Build completed with 3 failures.

1: Task failed with an exception.
-----------
* What went wrong:
Execution failed for task ':core:test'.
> There were failing tests. See the report at: file://<https://builds.apache.org/job/kafka-trunk-jdk8/ws/core/build/reports/tests/test/index.html>

* Try:
Run with --stacktrace option to get the stack trace. Run with --info or --debug option to get more log output. Run with --scan to get full insights.
==============================================================================

2: Task failed with an exception.
-----------
* What went wrong:
Execution failed for task ':streams:test'.
> There were failing tests. See the report at: file://<https://builds.apache.org/job/kafka-trunk-jdk8/ws/streams/build/reports/tests/test/index.html>

* Try:
Run with --stacktrace option to get the stack trace. Run with --info or --debug option to get more log output. Run with --scan to get full insights.
==============================================================================

3: Task failed with an exception.
-----------
* What went wrong:
Execution failed for task ':connect:runtime:test'.
> There were failing tests. See the report at: file://<https://builds.apache.org/job/kafka-trunk-jdk8/ws/connect/runtime/build/reports/tests/test/index.html>

* Try:
Run with --stacktrace option to get the stack trace. Run with --info or --debug option to get more log output. Run with --scan to get full insights.
==============================================================================

* Get more help at https://help.gradle.org

Deprecated Gradle features were used in this build, making it incompatible with Gradle 6.0.
Use '--warning-mode all' to show the individual deprecation warnings.
See https://docs.gradle.org/5.1/userguide/command_line_interface.html#sec:command_line_warnings

BUILD FAILED in 1h 41m 14s
166 actionable tasks: 165 executed, 1 up-to-date
Build step 'Execute shell' marked build as failure
[FINDBUGS] Collecting findbugs analysis files...
Setting GRADLE_4_8_1_HOME=/home/jenkins/tools/gradle/4.8.1
[FINDBUGS] Searching for all files in <https://builds.apache.org/job/kafka-trunk-jdk8/ws/> that match the pattern **/build/reports/*bugs/*.xml
[FINDBUGS] Parsing 16 files in <https://builds.apache.org/job/kafka-trunk-jdk8/ws/>
[FINDBUGS] Successfully parsed file <https://builds.apache.org/job/kafka-trunk-jdk8/ws/clients/build/reports/spotbugs/main.xml> with 0 unique warnings and 0 duplicates.
[FINDBUGS] Successfully parsed file <https://builds.apache.org/job/kafka-trunk-jdk8/ws/connect/api/build/reports/spotbugs/main.xml> with 0 unique warnings and 0 duplicates.
[FINDBUGS] Successfully parsed file <https://builds.apache.org/job/kafka-trunk-jdk8/ws/connect/basic-auth-extension/build/reports/spotbugs/main.xml> with 0 unique warnings and 0 duplicates.
[FINDBUGS] Successfully parsed file <https://builds.apache.org/job/kafka-trunk-jdk8/ws/connect/file/build/reports/spotbugs/main.xml> with 0 unique warnings and 0 duplicates.
[FINDBUGS] Successfully parsed file <https://builds.apache.org/job/kafka-trunk-jdk8/ws/connect/json/build/reports/spotbugs/main.xml> with 0 unique warnings and 0 duplicates.
[FINDBUGS] Successfully parsed file <https://builds.apache.org/job/kafka-trunk-jdk8/ws/connect/runtime/build/reports/spotbugs/main.xml> with 0 unique warnings and 0 duplicates.
[FINDBUGS] Successfully parsed file <https://builds.apache.org/job/kafka-trunk-jdk8/ws/connect/transforms/build/reports/spotbugs/main.xml> with 0 unique warnings and 0 duplicates.
[FINDBUGS] Successfully parsed file <https://builds.apache.org/job/kafka-trunk-jdk8/ws/core/build/reports/spotbugs/main.xml> with 0 unique warnings and 0 duplicates.
[FINDBUGS] Successfully parsed file <https://builds.apache.org/job/kafka-trunk-jdk8/ws/examples/build/reports/spotbugs/main.xml> with 0 unique warnings and 0 duplicates.
[FINDBUGS] Successfully parsed file <https://builds.apache.org/job/kafka-trunk-jdk8/ws/jmh-benchmarks/build/reports/spotbugs/main.xml> with 0 unique warnings and 0 duplicates.
[FINDBUGS] Successfully parsed file <https://builds.apache.org/job/kafka-trunk-jdk8/ws/log4j-appender/build/reports/spotbugs/main.xml> with 0 unique warnings and 0 duplicates.
[FINDBUGS] Successfully parsed file <https://builds.apache.org/job/kafka-trunk-jdk8/ws/streams/build/reports/spotbugs/main.xml> with 0 unique warnings and 0 duplicates.
[FINDBUGS] Successfully parsed file <https://builds.apache.org/job/kafka-trunk-jdk8/ws/streams/examples/build/reports/spotbugs/main.xml> with 0 unique warnings and 0 duplicates.
[FINDBUGS] Successfully parsed file <https://builds.apache.org/job/kafka-trunk-jdk8/ws/streams/streams-scala/build/reports/spotbugs/main.xml> with 0 unique warnings and 0 duplicates.
[FINDBUGS] Successfully parsed file <https://builds.apache.org/job/kafka-trunk-jdk8/ws/streams/test-utils/build/reports/spotbugs/main.xml> with 0 unique warnings and 0 duplicates.
[FINDBUGS] Successfully parsed file <https://builds.apache.org/job/kafka-trunk-jdk8/ws/tools/build/reports/spotbugs/main.xml> with 0 unique warnings and 0 duplicates.
Setting GRADLE_4_8_1_HOME=/home/jenkins/tools/gradle/4.8.1
Setting GRADLE_4_8_1_HOME=/home/jenkins/tools/gradle/4.8.1
<Git Blamer> Using GitBlamer to create author and commit information for all warnings.
<Git Blamer> GIT_COMMIT=e19eb3e290cb7b7d2dc434b02648fe5c5726bdc2, workspace=<https://builds.apache.org/job/kafka-trunk-jdk8/ws/>
[FINDBUGS] Computing warning deltas based on reference build #3313
Recording test results
Setting GRADLE_4_8_1_HOME=/home/jenkins/tools/gradle/4.8.1
Setting GRADLE_4_8_1_HOME=/home/jenkins/tools/gradle/4.8.1
Not sending mail to unregistered user noreply@github.com
Not sending mail to unregistered user vahid.hashemian@gmail.com
Not sending mail to unregistered user ismael@juma.me.uk
Not sending mail to unregistered user wangguoz@gmail.com
Not sending mail to unregistered user manikumar.reddy@gmail.com

Build failed in Jenkins: kafka-trunk-jdk8 #3328

Posted by Apache Jenkins Server <je...@builds.apache.org>.
See <https://builds.apache.org/job/kafka-trunk-jdk8/3328/display/redirect?page=changes>

Changes:

[ismael] MINOR: Log partition info when creating new request batch in controller

------------------------------------------
[...truncated 2.26 MB...]
org.apache.kafka.streams.test.OutputVerifierTest > shouldFailIfKeyIsDifferentWithNullForCompareKeyValueWithProducerRecord PASSED

org.apache.kafka.streams.test.OutputVerifierTest > shouldPassIfKeyAndValueAndTimestampIsEqualForCompareKeyValueTimestampWithProducerRecord STARTED

org.apache.kafka.streams.test.OutputVerifierTest > shouldPassIfKeyAndValueAndTimestampIsEqualForCompareKeyValueTimestampWithProducerRecord PASSED

org.apache.kafka.streams.test.OutputVerifierTest > shouldPassIfValueIsEqualWithNullForCompareValue STARTED

org.apache.kafka.streams.test.OutputVerifierTest > shouldPassIfValueIsEqualWithNullForCompareValue PASSED

org.apache.kafka.streams.test.OutputVerifierTest > shouldPassIfValueAndTimestampIsEqualWithNullForCompareValueTimestamp STARTED

org.apache.kafka.streams.test.OutputVerifierTest > shouldPassIfValueAndTimestampIsEqualWithNullForCompareValueTimestamp PASSED

org.apache.kafka.streams.test.OutputVerifierTest > shouldFailIfValueIsDifferentWithNullForCompareValueTimestampWithProducerRecord STARTED

org.apache.kafka.streams.test.OutputVerifierTest > shouldFailIfValueIsDifferentWithNullForCompareValueTimestampWithProducerRecord PASSED

org.apache.kafka.streams.test.OutputVerifierTest > shouldFailIfValueIsDifferentWithNullForCompareValueWithProducerRecord STARTED

org.apache.kafka.streams.test.OutputVerifierTest > shouldFailIfValueIsDifferentWithNullForCompareValueWithProducerRecord PASSED

org.apache.kafka.streams.test.OutputVerifierTest > shouldFailIfKeyIsDifferentWithNullReversForCompareKeyValueTimestampWithProducerRecord STARTED

org.apache.kafka.streams.test.OutputVerifierTest > shouldFailIfKeyIsDifferentWithNullReversForCompareKeyValueTimestampWithProducerRecord PASSED

org.apache.kafka.streams.test.OutputVerifierTest > shouldFailIfKeyIsDifferentWithNullReversForCompareKeyValue STARTED

org.apache.kafka.streams.test.OutputVerifierTest > shouldFailIfKeyIsDifferentWithNullReversForCompareKeyValue PASSED

org.apache.kafka.streams.test.OutputVerifierTest > shouldPassIfKeyAndValueIsEqualForCompareKeyValueWithProducerRecord STARTED

org.apache.kafka.streams.test.OutputVerifierTest > shouldPassIfKeyAndValueIsEqualForCompareKeyValueWithProducerRecord PASSED

org.apache.kafka.streams.test.OutputVerifierTest > shouldFailIfValueIsDifferentForCompareKeyValueWithProducerRecord STARTED

org.apache.kafka.streams.test.OutputVerifierTest > shouldFailIfValueIsDifferentForCompareKeyValueWithProducerRecord PASSED

org.apache.kafka.streams.test.OutputVerifierTest > shouldFailIfValueIsDifferentForCompareValueTimestamp STARTED

org.apache.kafka.streams.test.OutputVerifierTest > shouldFailIfValueIsDifferentForCompareValueTimestamp PASSED

org.apache.kafka.streams.test.OutputVerifierTest > shouldNotAllowNullProducerRecordForCompareValue STARTED

org.apache.kafka.streams.test.OutputVerifierTest > shouldNotAllowNullProducerRecordForCompareValue PASSED

org.apache.kafka.streams.test.OutputVerifierTest > shouldFailIfValueIsDifferentWithNullForCompareValueTimestamp STARTED

org.apache.kafka.streams.test.OutputVerifierTest > shouldFailIfValueIsDifferentWithNullForCompareValueTimestamp PASSED

org.apache.kafka.streams.test.OutputVerifierTest > shouldFailIfKeyIsDifferentForCompareKeyValueTimestamp STARTED

org.apache.kafka.streams.test.OutputVerifierTest > shouldFailIfKeyIsDifferentForCompareKeyValueTimestamp PASSED

org.apache.kafka.streams.test.OutputVerifierTest > shouldFailIfKeyIsDifferentForCompareKeyValueTimestampWithProducerRecord STARTED

org.apache.kafka.streams.test.OutputVerifierTest > shouldFailIfKeyIsDifferentForCompareKeyValueTimestampWithProducerRecord PASSED

org.apache.kafka.streams.test.OutputVerifierTest > shouldPassIfValueIsEqualWithNullForCompareValueWithProducerRecord STARTED

org.apache.kafka.streams.test.OutputVerifierTest > shouldPassIfValueIsEqualWithNullForCompareValueWithProducerRecord PASSED

org.apache.kafka.streams.test.OutputVerifierTest > shouldFailIfValueIsDifferentWithNullReverseForCompareValueTimestamp STARTED

org.apache.kafka.streams.test.OutputVerifierTest > shouldFailIfValueIsDifferentWithNullReverseForCompareValueTimestamp PASSED

org.apache.kafka.streams.test.OutputVerifierTest > shouldFailIfValueIsDifferentWithNullReverseForCompareValue STARTED

org.apache.kafka.streams.test.OutputVerifierTest > shouldFailIfValueIsDifferentWithNullReverseForCompareValue PASSED

org.apache.kafka.streams.test.OutputVerifierTest > shouldFailIfTimestampIsDifferentForCompareValueTimestamp STARTED

org.apache.kafka.streams.test.OutputVerifierTest > shouldFailIfTimestampIsDifferentForCompareValueTimestamp PASSED

org.apache.kafka.streams.test.OutputVerifierTest > shouldPassIfKeyAndValueAndTimestampIsEqualWithNullForCompareKeyValueTimestampWithProducerRecord STARTED

org.apache.kafka.streams.test.OutputVerifierTest > shouldPassIfKeyAndValueAndTimestampIsEqualWithNullForCompareKeyValueTimestampWithProducerRecord PASSED

org.apache.kafka.streams.test.OutputVerifierTest > shouldFailIfValueIsDifferentWithNullForCompareKeyValueWithProducerRecord STARTED

org.apache.kafka.streams.test.OutputVerifierTest > shouldFailIfValueIsDifferentWithNullForCompareKeyValueWithProducerRecord PASSED

org.apache.kafka.streams.test.OutputVerifierTest > shouldFailIfValueIsDifferentForCompareKeyValueTimestampWithProducerRecord STARTED

org.apache.kafka.streams.test.OutputVerifierTest > shouldFailIfValueIsDifferentForCompareKeyValueTimestampWithProducerRecord PASSED

org.apache.kafka.streams.test.OutputVerifierTest > shouldNotAllowNullProducerRecordWithExpectedRecordForCompareValueTimestamp STARTED

org.apache.kafka.streams.test.OutputVerifierTest > shouldNotAllowNullProducerRecordWithExpectedRecordForCompareValueTimestamp PASSED

org.apache.kafka.streams.test.OutputVerifierTest > shouldNotAllowNullExpectedRecordForCompareValue STARTED

org.apache.kafka.streams.test.OutputVerifierTest > shouldNotAllowNullExpectedRecordForCompareValue PASSED

org.apache.kafka.streams.test.OutputVerifierTest > shouldFailIfValueIsDifferentWithNullReversForCompareKeyValueTimestampWithProducerRecord STARTED

org.apache.kafka.streams.test.OutputVerifierTest > shouldFailIfValueIsDifferentWithNullReversForCompareKeyValueTimestampWithProducerRecord PASSED

org.apache.kafka.streams.test.OutputVerifierTest > shouldNotAllowNullProducerRecordForCompareKeyValue STARTED

org.apache.kafka.streams.test.OutputVerifierTest > shouldNotAllowNullProducerRecordForCompareKeyValue PASSED

org.apache.kafka.streams.test.OutputVerifierTest > shouldFailIfValueIsDifferentWithNullReversForCompareKeyValueWithProducerRecord STARTED

org.apache.kafka.streams.test.OutputVerifierTest > shouldFailIfValueIsDifferentWithNullReversForCompareKeyValueWithProducerRecord PASSED

org.apache.kafka.streams.test.OutputVerifierTest > shouldPassIfKeyAndValueAndTimestampIsEqualForCompareKeyValueTimestamp STARTED

org.apache.kafka.streams.test.OutputVerifierTest > shouldPassIfKeyAndValueAndTimestampIsEqualForCompareKeyValueTimestamp PASSED

org.apache.kafka.streams.test.OutputVerifierTest > shouldFailIfValueIsDifferentWithNullForCompareKeyValueTimestampWithProducerRecord STARTED

org.apache.kafka.streams.test.OutputVerifierTest > shouldFailIfValueIsDifferentWithNullForCompareKeyValueTimestampWithProducerRecord PASSED

org.apache.kafka.streams.test.OutputVerifierTest > shouldFailIfKeyIsDifferentWithNullReversForCompareKeyValueWithProducerRecord STARTED

org.apache.kafka.streams.test.OutputVerifierTest > shouldFailIfKeyIsDifferentWithNullReversForCompareKeyValueWithProducerRecord PASSED

org.apache.kafka.streams.test.OutputVerifierTest > shouldPassIfKeyAndValueIsEqualWithNullForCompareKeyValueWithProducerRecord STARTED

org.apache.kafka.streams.test.OutputVerifierTest > shouldPassIfKeyAndValueIsEqualWithNullForCompareKeyValueWithProducerRecord PASSED

org.apache.kafka.streams.test.OutputVerifierTest > shouldFailIfKeyIsDifferentWithNullForCompareKeyValueTimestampWithProducerRecord STARTED

org.apache.kafka.streams.test.OutputVerifierTest > shouldFailIfKeyIsDifferentWithNullForCompareKeyValueTimestampWithProducerRecord PASSED

org.apache.kafka.streams.test.OutputVerifierTest > shouldFailIfValueIsDifferentForCompareKeyValueTimestamp STARTED

org.apache.kafka.streams.test.OutputVerifierTest > shouldFailIfValueIsDifferentForCompareKeyValueTimestamp PASSED

org.apache.kafka.streams.test.OutputVerifierTest > shouldPassIfValueAndTimestampIsEqualForCompareValueTimestampWithProducerRecord STARTED

org.apache.kafka.streams.test.OutputVerifierTest > shouldPassIfValueAndTimestampIsEqualForCompareValueTimestampWithProducerRecord PASSED

org.apache.kafka.streams.test.OutputVerifierTest > shouldFailIfValueIsDifferentWithNullReversForCompareKeyValueTimestamp STARTED

org.apache.kafka.streams.test.OutputVerifierTest > shouldFailIfValueIsDifferentWithNullReversForCompareKeyValueTimestamp PASSED

org.apache.kafka.streams.test.OutputVerifierTest > shouldFailIfValueIsDifferentWithNullReverseForCompareValueTimestampWithProducerRecord STARTED

org.apache.kafka.streams.test.OutputVerifierTest > shouldFailIfValueIsDifferentWithNullReverseForCompareValueTimestampWithProducerRecord PASSED

> Task :streams:upgrade-system-tests-0102:processTestResources NO-SOURCE
> Task :streams:upgrade-system-tests-0102:testClasses
> Task :streams:upgrade-system-tests-0102:checkstyleTest
> Task :streams:upgrade-system-tests-0102:spotbugsMain NO-SOURCE
> Task :streams:upgrade-system-tests-0102:test
> Task :streams:upgrade-system-tests-0110:compileJava NO-SOURCE
> Task :streams:upgrade-system-tests-0110:processResources NO-SOURCE
> Task :streams:upgrade-system-tests-0110:classes UP-TO-DATE
> Task :streams:upgrade-system-tests-0110:checkstyleMain NO-SOURCE
> Task :streams:upgrade-system-tests-0110:compileTestJava
> Task :streams:upgrade-system-tests-0110:processTestResources NO-SOURCE
> Task :streams:upgrade-system-tests-0110:testClasses
> Task :streams:upgrade-system-tests-0110:checkstyleTest
> Task :streams:upgrade-system-tests-0110:spotbugsMain NO-SOURCE
> Task :streams:upgrade-system-tests-0110:test
> Task :streams:upgrade-system-tests-10:compileJava NO-SOURCE
> Task :streams:upgrade-system-tests-10:processResources NO-SOURCE
> Task :streams:upgrade-system-tests-10:classes UP-TO-DATE
> Task :streams:upgrade-system-tests-10:checkstyleMain NO-SOURCE
> Task :streams:upgrade-system-tests-10:compileTestJava
> Task :streams:upgrade-system-tests-10:processTestResources NO-SOURCE
> Task :streams:upgrade-system-tests-10:testClasses
> Task :streams:upgrade-system-tests-10:checkstyleTest
> Task :streams:upgrade-system-tests-10:spotbugsMain NO-SOURCE
> Task :streams:upgrade-system-tests-10:test
> Task :streams:upgrade-system-tests-11:compileJava NO-SOURCE
> Task :streams:upgrade-system-tests-11:processResources NO-SOURCE
> Task :streams:upgrade-system-tests-11:classes UP-TO-DATE
> Task :streams:upgrade-system-tests-11:checkstyleMain NO-SOURCE
> Task :streams:upgrade-system-tests-11:compileTestJava
> Task :streams:upgrade-system-tests-11:processTestResources NO-SOURCE
> Task :streams:upgrade-system-tests-11:testClasses
> Task :streams:upgrade-system-tests-11:checkstyleTest
> Task :streams:upgrade-system-tests-11:spotbugsMain NO-SOURCE
> Task :streams:upgrade-system-tests-11:test
> Task :streams:upgrade-system-tests-20:compileJava NO-SOURCE
> Task :streams:upgrade-system-tests-20:processResources NO-SOURCE
> Task :streams:upgrade-system-tests-20:classes UP-TO-DATE
> Task :streams:upgrade-system-tests-20:checkstyleMain NO-SOURCE
> Task :streams:upgrade-system-tests-20:compileTestJava
> Task :streams:upgrade-system-tests-20:processTestResources NO-SOURCE
> Task :streams:upgrade-system-tests-20:testClasses
> Task :streams:upgrade-system-tests-20:checkstyleTest
> Task :streams:upgrade-system-tests-20:spotbugsMain NO-SOURCE
> Task :streams:upgrade-system-tests-20:test
> Task :streams:upgrade-system-tests-21:compileJava NO-SOURCE
> Task :streams:upgrade-system-tests-21:processResources NO-SOURCE
> Task :streams:upgrade-system-tests-21:classes UP-TO-DATE
> Task :streams:upgrade-system-tests-21:checkstyleMain NO-SOURCE
> Task :streams:upgrade-system-tests-21:compileTestJava
> Task :streams:upgrade-system-tests-21:processTestResources NO-SOURCE
> Task :streams:upgrade-system-tests-21:testClasses
> Task :streams:upgrade-system-tests-21:checkstyleTest
> Task :streams:upgrade-system-tests-21:spotbugsMain NO-SOURCE
> Task :streams:upgrade-system-tests-21:test

FAILURE: Build failed with an exception.

* What went wrong:
Execution failed for task ':connect:runtime:test'.
> There were failing tests. See the report at: file://<https://builds.apache.org/job/kafka-trunk-jdk8/ws/connect/runtime/build/reports/tests/test/index.html>

* Try:
Run with --stacktrace option to get the stack trace. Run with --info or --debug option to get more log output. Run with --scan to get full insights.

* Get more help at https://help.gradle.org

Deprecated Gradle features were used in this build, making it incompatible with Gradle 6.0.
Use '--warning-mode all' to show the individual deprecation warnings.
See https://docs.gradle.org/5.1/userguide/command_line_interface.html#sec:command_line_warnings

BUILD FAILED in 1h 41m 30s
166 actionable tasks: 165 executed, 1 up-to-date
Build step 'Execute shell' marked build as failure
[FINDBUGS] Collecting findbugs analysis files...
Setting GRADLE_4_8_1_HOME=/home/jenkins/tools/gradle/4.8.1
[FINDBUGS] Searching for all files in <https://builds.apache.org/job/kafka-trunk-jdk8/ws/> that match the pattern **/build/reports/*bugs/*.xml
[FINDBUGS] Parsing 16 files in <https://builds.apache.org/job/kafka-trunk-jdk8/ws/>
[FINDBUGS] Successfully parsed file <https://builds.apache.org/job/kafka-trunk-jdk8/ws/clients/build/reports/spotbugs/main.xml> with 0 unique warnings and 0 duplicates.
[FINDBUGS] Successfully parsed file <https://builds.apache.org/job/kafka-trunk-jdk8/ws/connect/api/build/reports/spotbugs/main.xml> with 0 unique warnings and 0 duplicates.
[FINDBUGS] Successfully parsed file <https://builds.apache.org/job/kafka-trunk-jdk8/ws/connect/basic-auth-extension/build/reports/spotbugs/main.xml> with 0 unique warnings and 0 duplicates.
[FINDBUGS] Successfully parsed file <https://builds.apache.org/job/kafka-trunk-jdk8/ws/connect/file/build/reports/spotbugs/main.xml> with 0 unique warnings and 0 duplicates.
[FINDBUGS] Successfully parsed file <https://builds.apache.org/job/kafka-trunk-jdk8/ws/connect/json/build/reports/spotbugs/main.xml> with 0 unique warnings and 0 duplicates.
[FINDBUGS] Successfully parsed file <https://builds.apache.org/job/kafka-trunk-jdk8/ws/connect/runtime/build/reports/spotbugs/main.xml> with 0 unique warnings and 0 duplicates.
[FINDBUGS] Successfully parsed file <https://builds.apache.org/job/kafka-trunk-jdk8/ws/connect/transforms/build/reports/spotbugs/main.xml> with 0 unique warnings and 0 duplicates.
[FINDBUGS] Successfully parsed file <https://builds.apache.org/job/kafka-trunk-jdk8/ws/core/build/reports/spotbugs/main.xml> with 0 unique warnings and 0 duplicates.
[FINDBUGS] Successfully parsed file <https://builds.apache.org/job/kafka-trunk-jdk8/ws/examples/build/reports/spotbugs/main.xml> with 0 unique warnings and 0 duplicates.
[FINDBUGS] Successfully parsed file <https://builds.apache.org/job/kafka-trunk-jdk8/ws/jmh-benchmarks/build/reports/spotbugs/main.xml> with 0 unique warnings and 0 duplicates.
[FINDBUGS] Successfully parsed file <https://builds.apache.org/job/kafka-trunk-jdk8/ws/log4j-appender/build/reports/spotbugs/main.xml> with 0 unique warnings and 0 duplicates.
[FINDBUGS] Successfully parsed file <https://builds.apache.org/job/kafka-trunk-jdk8/ws/streams/build/reports/spotbugs/main.xml> with 0 unique warnings and 0 duplicates.
[FINDBUGS] Successfully parsed file <https://builds.apache.org/job/kafka-trunk-jdk8/ws/streams/examples/build/reports/spotbugs/main.xml> with 0 unique warnings and 0 duplicates.
[FINDBUGS] Successfully parsed file <https://builds.apache.org/job/kafka-trunk-jdk8/ws/streams/streams-scala/build/reports/spotbugs/main.xml> with 0 unique warnings and 0 duplicates.
[FINDBUGS] Successfully parsed file <https://builds.apache.org/job/kafka-trunk-jdk8/ws/streams/test-utils/build/reports/spotbugs/main.xml> with 0 unique warnings and 0 duplicates.
[FINDBUGS] Successfully parsed file <https://builds.apache.org/job/kafka-trunk-jdk8/ws/tools/build/reports/spotbugs/main.xml> with 0 unique warnings and 0 duplicates.
Setting GRADLE_4_8_1_HOME=/home/jenkins/tools/gradle/4.8.1
Setting GRADLE_4_8_1_HOME=/home/jenkins/tools/gradle/4.8.1
<Git Blamer> Using GitBlamer to create author and commit information for all warnings.
<Git Blamer> GIT_COMMIT=59f22521c097741a45528f0d4afb7ebceb62d47c, workspace=<https://builds.apache.org/job/kafka-trunk-jdk8/ws/>
[FINDBUGS] Computing warning deltas based on reference build #3313
Recording test results
Setting GRADLE_4_8_1_HOME=/home/jenkins/tools/gradle/4.8.1
Setting GRADLE_4_8_1_HOME=/home/jenkins/tools/gradle/4.8.1
Not sending mail to unregistered user noreply@github.com
Not sending mail to unregistered user vahid.hashemian@gmail.com
Not sending mail to unregistered user wangguoz@gmail.com
Not sending mail to unregistered user ismael@juma.me.uk
Not sending mail to unregistered user manikumar.reddy@gmail.com

Build failed in Jenkins: kafka-trunk-jdk8 #3327

Posted by Apache Jenkins Server <je...@builds.apache.org>.
See <https://builds.apache.org/job/kafka-trunk-jdk8/3327/display/redirect?page=changes>

Changes:

[github] MINOR: Remove the InvalidTopicException handling in InternalTopicManager

[github] KAFKA-7652: Part I; Fix SessionStore's findSession(single-key) (#6134)

------------------------------------------
[...truncated 2.26 MB...]

org.apache.kafka.streams.test.OutputVerifierTest > shouldFailIfValueIsDifferentForCompareValueWithProducerRecord PASSED

org.apache.kafka.streams.test.OutputVerifierTest > shouldPassIfValueIsEqualForCompareValue STARTED

org.apache.kafka.streams.test.OutputVerifierTest > shouldPassIfValueIsEqualForCompareValue PASSED

org.apache.kafka.streams.test.OutputVerifierTest > shouldNotAllowNullProducerRecordWithExpectedRecordForCompareKeyValueTimestamp STARTED

org.apache.kafka.streams.test.OutputVerifierTest > shouldNotAllowNullProducerRecordWithExpectedRecordForCompareKeyValueTimestamp PASSED

org.apache.kafka.streams.test.OutputVerifierTest > shouldFailIfKeyIsDifferentForCompareKeyValue STARTED

org.apache.kafka.streams.test.OutputVerifierTest > shouldFailIfKeyIsDifferentForCompareKeyValue PASSED

org.apache.kafka.streams.test.OutputVerifierTest > shouldNotAllowNullProducerRecordWithExpectedRecordForCompareKeyValue STARTED

org.apache.kafka.streams.test.OutputVerifierTest > shouldNotAllowNullProducerRecordWithExpectedRecordForCompareKeyValue PASSED

org.apache.kafka.streams.test.OutputVerifierTest > shouldFailIfKeyIsDifferentWithNullForCompareKeyValueWithProducerRecord STARTED

org.apache.kafka.streams.test.OutputVerifierTest > shouldFailIfKeyIsDifferentWithNullForCompareKeyValueWithProducerRecord PASSED

org.apache.kafka.streams.test.OutputVerifierTest > shouldPassIfKeyAndValueAndTimestampIsEqualForCompareKeyValueTimestampWithProducerRecord STARTED

org.apache.kafka.streams.test.OutputVerifierTest > shouldPassIfKeyAndValueAndTimestampIsEqualForCompareKeyValueTimestampWithProducerRecord PASSED

org.apache.kafka.streams.test.OutputVerifierTest > shouldPassIfValueIsEqualWithNullForCompareValue STARTED

org.apache.kafka.streams.test.OutputVerifierTest > shouldPassIfValueIsEqualWithNullForCompareValue PASSED

org.apache.kafka.streams.test.OutputVerifierTest > shouldPassIfValueAndTimestampIsEqualWithNullForCompareValueTimestamp STARTED

org.apache.kafka.streams.test.OutputVerifierTest > shouldPassIfValueAndTimestampIsEqualWithNullForCompareValueTimestamp PASSED

org.apache.kafka.streams.test.OutputVerifierTest > shouldFailIfValueIsDifferentWithNullForCompareValueTimestampWithProducerRecord STARTED

org.apache.kafka.streams.test.OutputVerifierTest > shouldFailIfValueIsDifferentWithNullForCompareValueTimestampWithProducerRecord PASSED

org.apache.kafka.streams.test.OutputVerifierTest > shouldFailIfValueIsDifferentWithNullForCompareValueWithProducerRecord STARTED

org.apache.kafka.streams.test.OutputVerifierTest > shouldFailIfValueIsDifferentWithNullForCompareValueWithProducerRecord PASSED

org.apache.kafka.streams.test.OutputVerifierTest > shouldFailIfKeyIsDifferentWithNullReversForCompareKeyValueTimestampWithProducerRecord STARTED

org.apache.kafka.streams.test.OutputVerifierTest > shouldFailIfKeyIsDifferentWithNullReversForCompareKeyValueTimestampWithProducerRecord PASSED

org.apache.kafka.streams.test.OutputVerifierTest > shouldFailIfKeyIsDifferentWithNullReversForCompareKeyValue STARTED

org.apache.kafka.streams.test.OutputVerifierTest > shouldFailIfKeyIsDifferentWithNullReversForCompareKeyValue PASSED

org.apache.kafka.streams.test.OutputVerifierTest > shouldPassIfKeyAndValueIsEqualForCompareKeyValueWithProducerRecord STARTED

org.apache.kafka.streams.test.OutputVerifierTest > shouldPassIfKeyAndValueIsEqualForCompareKeyValueWithProducerRecord PASSED

org.apache.kafka.streams.test.OutputVerifierTest > shouldFailIfValueIsDifferentForCompareKeyValueWithProducerRecord STARTED

org.apache.kafka.streams.test.OutputVerifierTest > shouldFailIfValueIsDifferentForCompareKeyValueWithProducerRecord PASSED

org.apache.kafka.streams.test.OutputVerifierTest > shouldFailIfValueIsDifferentForCompareValueTimestamp STARTED

org.apache.kafka.streams.test.OutputVerifierTest > shouldFailIfValueIsDifferentForCompareValueTimestamp PASSED

org.apache.kafka.streams.test.OutputVerifierTest > shouldNotAllowNullProducerRecordForCompareValue STARTED

org.apache.kafka.streams.test.OutputVerifierTest > shouldNotAllowNullProducerRecordForCompareValue PASSED

org.apache.kafka.streams.test.OutputVerifierTest > shouldFailIfValueIsDifferentWithNullForCompareValueTimestamp STARTED

org.apache.kafka.streams.test.OutputVerifierTest > shouldFailIfValueIsDifferentWithNullForCompareValueTimestamp PASSED

org.apache.kafka.streams.test.OutputVerifierTest > shouldFailIfKeyIsDifferentForCompareKeyValueTimestamp STARTED

org.apache.kafka.streams.test.OutputVerifierTest > shouldFailIfKeyIsDifferentForCompareKeyValueTimestamp PASSED

org.apache.kafka.streams.test.OutputVerifierTest > shouldFailIfKeyIsDifferentForCompareKeyValueTimestampWithProducerRecord STARTED

org.apache.kafka.streams.test.OutputVerifierTest > shouldFailIfKeyIsDifferentForCompareKeyValueTimestampWithProducerRecord PASSED

org.apache.kafka.streams.test.OutputVerifierTest > shouldPassIfValueIsEqualWithNullForCompareValueWithProducerRecord STARTED

org.apache.kafka.streams.test.OutputVerifierTest > shouldPassIfValueIsEqualWithNullForCompareValueWithProducerRecord PASSED

org.apache.kafka.streams.test.OutputVerifierTest > shouldFailIfValueIsDifferentWithNullReverseForCompareValueTimestamp STARTED

org.apache.kafka.streams.test.OutputVerifierTest > shouldFailIfValueIsDifferentWithNullReverseForCompareValueTimestamp PASSED

org.apache.kafka.streams.test.OutputVerifierTest > shouldFailIfValueIsDifferentWithNullReverseForCompareValue STARTED

org.apache.kafka.streams.test.OutputVerifierTest > shouldFailIfValueIsDifferentWithNullReverseForCompareValue PASSED

org.apache.kafka.streams.test.OutputVerifierTest > shouldFailIfTimestampIsDifferentForCompareValueTimestamp STARTED

org.apache.kafka.streams.test.OutputVerifierTest > shouldFailIfTimestampIsDifferentForCompareValueTimestamp PASSED

org.apache.kafka.streams.test.OutputVerifierTest > shouldPassIfKeyAndValueAndTimestampIsEqualWithNullForCompareKeyValueTimestampWithProducerRecord STARTED

org.apache.kafka.streams.test.OutputVerifierTest > shouldPassIfKeyAndValueAndTimestampIsEqualWithNullForCompareKeyValueTimestampWithProducerRecord PASSED

org.apache.kafka.streams.test.OutputVerifierTest > shouldFailIfValueIsDifferentWithNullForCompareKeyValueWithProducerRecord STARTED

org.apache.kafka.streams.test.OutputVerifierTest > shouldFailIfValueIsDifferentWithNullForCompareKeyValueWithProducerRecord PASSED

org.apache.kafka.streams.test.OutputVerifierTest > shouldFailIfValueIsDifferentForCompareKeyValueTimestampWithProducerRecord STARTED

org.apache.kafka.streams.test.OutputVerifierTest > shouldFailIfValueIsDifferentForCompareKeyValueTimestampWithProducerRecord PASSED

org.apache.kafka.streams.test.OutputVerifierTest > shouldNotAllowNullProducerRecordWithExpectedRecordForCompareValueTimestamp STARTED

org.apache.kafka.streams.test.OutputVerifierTest > shouldNotAllowNullProducerRecordWithExpectedRecordForCompareValueTimestamp PASSED

org.apache.kafka.streams.test.OutputVerifierTest > shouldNotAllowNullExpectedRecordForCompareValue STARTED

org.apache.kafka.streams.test.OutputVerifierTest > shouldNotAllowNullExpectedRecordForCompareValue PASSED

org.apache.kafka.streams.test.OutputVerifierTest > shouldFailIfValueIsDifferentWithNullReversForCompareKeyValueTimestampWithProducerRecord STARTED

org.apache.kafka.streams.test.OutputVerifierTest > shouldFailIfValueIsDifferentWithNullReversForCompareKeyValueTimestampWithProducerRecord PASSED

org.apache.kafka.streams.test.OutputVerifierTest > shouldNotAllowNullProducerRecordForCompareKeyValue STARTED

org.apache.kafka.streams.test.OutputVerifierTest > shouldNotAllowNullProducerRecordForCompareKeyValue PASSED

org.apache.kafka.streams.test.OutputVerifierTest > shouldFailIfValueIsDifferentWithNullReversForCompareKeyValueWithProducerRecord STARTED

org.apache.kafka.streams.test.OutputVerifierTest > shouldFailIfValueIsDifferentWithNullReversForCompareKeyValueWithProducerRecord PASSED

org.apache.kafka.streams.test.OutputVerifierTest > shouldPassIfKeyAndValueAndTimestampIsEqualForCompareKeyValueTimestamp STARTED

org.apache.kafka.streams.test.OutputVerifierTest > shouldPassIfKeyAndValueAndTimestampIsEqualForCompareKeyValueTimestamp PASSED

org.apache.kafka.streams.test.OutputVerifierTest > shouldFailIfValueIsDifferentWithNullForCompareKeyValueTimestampWithProducerRecord STARTED

org.apache.kafka.streams.test.OutputVerifierTest > shouldFailIfValueIsDifferentWithNullForCompareKeyValueTimestampWithProducerRecord PASSED

org.apache.kafka.streams.test.OutputVerifierTest > shouldFailIfKeyIsDifferentWithNullReversForCompareKeyValueWithProducerRecord STARTED

org.apache.kafka.streams.test.OutputVerifierTest > shouldFailIfKeyIsDifferentWithNullReversForCompareKeyValueWithProducerRecord PASSED

org.apache.kafka.streams.test.OutputVerifierTest > shouldPassIfKeyAndValueIsEqualWithNullForCompareKeyValueWithProducerRecord STARTED

org.apache.kafka.streams.test.OutputVerifierTest > shouldPassIfKeyAndValueIsEqualWithNullForCompareKeyValueWithProducerRecord PASSED

org.apache.kafka.streams.test.OutputVerifierTest > shouldFailIfKeyIsDifferentWithNullForCompareKeyValueTimestampWithProducerRecord STARTED

org.apache.kafka.streams.test.OutputVerifierTest > shouldFailIfKeyIsDifferentWithNullForCompareKeyValueTimestampWithProducerRecord PASSED

org.apache.kafka.streams.test.OutputVerifierTest > shouldFailIfValueIsDifferentForCompareKeyValueTimestamp STARTED

org.apache.kafka.streams.test.OutputVerifierTest > shouldFailIfValueIsDifferentForCompareKeyValueTimestamp PASSED

org.apache.kafka.streams.test.OutputVerifierTest > shouldPassIfValueAndTimestampIsEqualForCompareValueTimestampWithProducerRecord STARTED

org.apache.kafka.streams.test.OutputVerifierTest > shouldPassIfValueAndTimestampIsEqualForCompareValueTimestampWithProducerRecord PASSED

org.apache.kafka.streams.test.OutputVerifierTest > shouldFailIfValueIsDifferentWithNullReversForCompareKeyValueTimestamp STARTED

org.apache.kafka.streams.test.OutputVerifierTest > shouldFailIfValueIsDifferentWithNullReversForCompareKeyValueTimestamp PASSED

org.apache.kafka.streams.test.OutputVerifierTest > shouldFailIfValueIsDifferentWithNullReverseForCompareValueTimestampWithProducerRecord STARTED

org.apache.kafka.streams.test.OutputVerifierTest > shouldFailIfValueIsDifferentWithNullReverseForCompareValueTimestampWithProducerRecord PASSED

> Task :connect:basic-auth-extension:test

org.apache.kafka.connect.rest.basic.auth.extension.JaasBasicAuthFilterTest > testSuccess STARTED

org.apache.kafka.connect.rest.basic.auth.extension.JaasBasicAuthFilterTest > testSuccess PASSED

org.apache.kafka.connect.rest.basic.auth.extension.JaasBasicAuthFilterTest > testBadCredential STARTED

org.apache.kafka.connect.rest.basic.auth.extension.JaasBasicAuthFilterTest > testBadCredential PASSED

org.apache.kafka.connect.rest.basic.auth.extension.JaasBasicAuthFilterTest > testBadPassword STARTED

org.apache.kafka.connect.rest.basic.auth.extension.JaasBasicAuthFilterTest > testBadPassword PASSED

org.apache.kafka.connect.rest.basic.auth.extension.JaasBasicAuthFilterTest > testUnknownBearer STARTED

org.apache.kafka.connect.rest.basic.auth.extension.JaasBasicAuthFilterTest > testUnknownBearer PASSED

org.apache.kafka.connect.rest.basic.auth.extension.JaasBasicAuthFilterTest > testUnknownLoginModule STARTED

org.apache.kafka.connect.rest.basic.auth.extension.JaasBasicAuthFilterTest > testUnknownLoginModule PASSED

org.apache.kafka.connect.rest.basic.auth.extension.JaasBasicAuthFilterTest > testUnknownCredentialsFile STARTED

org.apache.kafka.connect.rest.basic.auth.extension.JaasBasicAuthFilterTest > testUnknownCredentialsFile PASSED

org.apache.kafka.connect.rest.basic.auth.extension.JaasBasicAuthFilterTest > testEmptyCredentialsFile STARTED

org.apache.kafka.connect.rest.basic.auth.extension.JaasBasicAuthFilterTest > testEmptyCredentialsFile PASSED

org.apache.kafka.connect.rest.basic.auth.extension.JaasBasicAuthFilterTest > testNoFileOption STARTED

org.apache.kafka.connect.rest.basic.auth.extension.JaasBasicAuthFilterTest > testNoFileOption PASSED

> Task :examples:test NO-SOURCE

FAILURE: Build failed with an exception.

* What went wrong:
Execution failed for task ':connect:runtime:test'.
> There were failing tests. See the report at: file://<https://builds.apache.org/job/kafka-trunk-jdk8/ws/connect/runtime/build/reports/tests/test/index.html>

* Try:
Run with --stacktrace option to get the stack trace. Run with --info or --debug option to get more log output. Run with --scan to get full insights.

* Get more help at https://help.gradle.org

Deprecated Gradle features were used in this build, making it incompatible with Gradle 6.0.
Use '--warning-mode all' to show the individual deprecation warnings.
See https://docs.gradle.org/5.1/userguide/command_line_interface.html#sec:command_line_warnings

BUILD FAILED in 2h 10m 16s
166 actionable tasks: 165 executed, 1 up-to-date
Build step 'Execute shell' marked build as failure
[FINDBUGS] Collecting findbugs analysis files...
Setting GRADLE_4_8_1_HOME=/home/jenkins/tools/gradle/4.8.1
[FINDBUGS] Searching for all files in <https://builds.apache.org/job/kafka-trunk-jdk8/ws/> that match the pattern **/build/reports/*bugs/*.xml
[FINDBUGS] Parsing 16 files in <https://builds.apache.org/job/kafka-trunk-jdk8/ws/>
[FINDBUGS] Successfully parsed file <https://builds.apache.org/job/kafka-trunk-jdk8/ws/clients/build/reports/spotbugs/main.xml> with 0 unique warnings and 0 duplicates.
[FINDBUGS] Successfully parsed file <https://builds.apache.org/job/kafka-trunk-jdk8/ws/connect/api/build/reports/spotbugs/main.xml> with 0 unique warnings and 0 duplicates.
[FINDBUGS] Successfully parsed file <https://builds.apache.org/job/kafka-trunk-jdk8/ws/connect/basic-auth-extension/build/reports/spotbugs/main.xml> with 0 unique warnings and 0 duplicates.
[FINDBUGS] Successfully parsed file <https://builds.apache.org/job/kafka-trunk-jdk8/ws/connect/file/build/reports/spotbugs/main.xml> with 0 unique warnings and 0 duplicates.
[FINDBUGS] Successfully parsed file <https://builds.apache.org/job/kafka-trunk-jdk8/ws/connect/json/build/reports/spotbugs/main.xml> with 0 unique warnings and 0 duplicates.
[FINDBUGS] Successfully parsed file <https://builds.apache.org/job/kafka-trunk-jdk8/ws/connect/runtime/build/reports/spotbugs/main.xml> with 0 unique warnings and 0 duplicates.
[FINDBUGS] Successfully parsed file <https://builds.apache.org/job/kafka-trunk-jdk8/ws/connect/transforms/build/reports/spotbugs/main.xml> with 0 unique warnings and 0 duplicates.
[FINDBUGS] Successfully parsed file <https://builds.apache.org/job/kafka-trunk-jdk8/ws/core/build/reports/spotbugs/main.xml> with 0 unique warnings and 0 duplicates.
[FINDBUGS] Successfully parsed file <https://builds.apache.org/job/kafka-trunk-jdk8/ws/examples/build/reports/spotbugs/main.xml> with 0 unique warnings and 0 duplicates.
[FINDBUGS] Successfully parsed file <https://builds.apache.org/job/kafka-trunk-jdk8/ws/jmh-benchmarks/build/reports/spotbugs/main.xml> with 0 unique warnings and 0 duplicates.
[FINDBUGS] Successfully parsed file <https://builds.apache.org/job/kafka-trunk-jdk8/ws/log4j-appender/build/reports/spotbugs/main.xml> with 0 unique warnings and 0 duplicates.
[FINDBUGS] Successfully parsed file <https://builds.apache.org/job/kafka-trunk-jdk8/ws/streams/build/reports/spotbugs/main.xml> with 0 unique warnings and 0 duplicates.
[FINDBUGS] Successfully parsed file <https://builds.apache.org/job/kafka-trunk-jdk8/ws/streams/examples/build/reports/spotbugs/main.xml> with 0 unique warnings and 0 duplicates.
[FINDBUGS] Successfully parsed file <https://builds.apache.org/job/kafka-trunk-jdk8/ws/streams/streams-scala/build/reports/spotbugs/main.xml> with 0 unique warnings and 0 duplicates.
[FINDBUGS] Successfully parsed file <https://builds.apache.org/job/kafka-trunk-jdk8/ws/streams/test-utils/build/reports/spotbugs/main.xml> with 0 unique warnings and 0 duplicates.
[FINDBUGS] Successfully parsed file <https://builds.apache.org/job/kafka-trunk-jdk8/ws/tools/build/reports/spotbugs/main.xml> with 0 unique warnings and 0 duplicates.
Setting GRADLE_4_8_1_HOME=/home/jenkins/tools/gradle/4.8.1
Setting GRADLE_4_8_1_HOME=/home/jenkins/tools/gradle/4.8.1
<Git Blamer> Using GitBlamer to create author and commit information for all warnings.
<Git Blamer> GIT_COMMIT=56139df84495a67d311b160045497ec26f60c3a9, workspace=<https://builds.apache.org/job/kafka-trunk-jdk8/ws/>
[FINDBUGS] Computing warning deltas based on reference build #3313
Recording test results
Setting GRADLE_4_8_1_HOME=/home/jenkins/tools/gradle/4.8.1
Setting GRADLE_4_8_1_HOME=/home/jenkins/tools/gradle/4.8.1
Not sending mail to unregistered user noreply@github.com
Not sending mail to unregistered user vahid.hashemian@gmail.com
Not sending mail to unregistered user wangguoz@gmail.com
Not sending mail to unregistered user manikumar.reddy@gmail.com