You are viewing a plain text version of this content. The canonical link for it is here.
Posted to commits@cayenne.apache.org by Apache Jenkins Server <je...@builds.apache.org> on 2017/05/30 08:30:09 UTC

Build failed in Jenkins: cayenne-master » derby,JDK 1.8 (latest),ubuntu #659

See <https://builds.apache.org/job/cayenne-master/cayenneTestConnection=derby,jdk=JDK%201.8%20(latest),slave=ubuntu/659/display/redirect?page=changes>

Changes:

[andrus] CAY-2259 QueryCache: support for referencing type-safe caches

[andrus] CAY-2166 Auto-loading of Cayenne modules

[andrus] CAY-2166 Auto-loading of Cayenne modules

[andrus] CAY-2259 QueryCache: support for referencing type-safe caches

[andrus] CAY-2259 QueryCache: support for referencing type-safe caches

------------------------------------------
[...truncated 10.33 MB...]
        at java.nio.file.Files.copy(Files.java:1274)
        at org.apache.cayenne.tools.BaseTaskIT.prepareBuildScript(BaseTaskIT.java:71)
        at org.apache.cayenne.tools.BaseTaskIT.createRunner(BaseTaskIT.java:53)
        at org.apache.cayenne.tools.CgenTaskIT.classGeneratingWithDefaultConfigSuccess(CgenTaskIT.java:41)

org.apache.cayenne.tools.DbGenerateTaskIT > defaultConfigTaskSuccess FAILED
    java.nio.file.NoSuchFileException: /home/jenkins/jenkins-slave/workspace/cayenne-master/cayenneTestConnection/derby/jdk/JDK%201.8%20(latest)/slave/ubuntu/cayenne-gradle-plugin/build/resources/test/org/apache/cayenne/tools/cdbgen_simple.gradle
        at sun.nio.fs.UnixException.translateToIOException(UnixException.java:86)
        at sun.nio.fs.UnixException.rethrowAsIOException(UnixException.java:102)
        at sun.nio.fs.UnixException.rethrowAsIOException(UnixException.java:107)
        at sun.nio.fs.UnixCopyFile.copy(UnixCopyFile.java:526)
        at sun.nio.fs.UnixFileSystemProvider.copy(UnixFileSystemProvider.java:253)
        at java.nio.file.Files.copy(Files.java:1274)
        at org.apache.cayenne.tools.BaseTaskIT.prepareBuildScript(BaseTaskIT.java:71)
        at org.apache.cayenne.tools.BaseTaskIT.createRunner(BaseTaskIT.java:53)
        at org.apache.cayenne.tools.DbGenerateTaskIT.defaultConfigTaskSuccess(DbGenerateTaskIT.java:56)

org.apache.cayenne.tools.DbGenerateTaskIT > notConfiguredTaskFailure FAILED
    java.nio.file.NoSuchFileException: /home/jenkins/jenkins-slave/workspace/cayenne-master/cayenneTestConnection/derby/jdk/JDK%201.8%20(latest)/slave/ubuntu/cayenne-gradle-plugin/build/resources/test/org/apache/cayenne/tools/cdbgen_failure.gradle
        at sun.nio.fs.UnixException.translateToIOException(UnixException.java:86)
        at sun.nio.fs.UnixException.rethrowAsIOException(UnixException.java:102)
        at sun.nio.fs.UnixException.rethrowAsIOException(UnixException.java:107)
        at sun.nio.fs.UnixCopyFile.copy(UnixCopyFile.java:526)
        at sun.nio.fs.UnixFileSystemProvider.copy(UnixFileSystemProvider.java:253)
        at java.nio.file.Files.copy(Files.java:1274)
        at org.apache.cayenne.tools.BaseTaskIT.prepareBuildScript(BaseTaskIT.java:71)
        at org.apache.cayenne.tools.BaseTaskIT.createRunner(BaseTaskIT.java:53)
        at org.apache.cayenne.tools.DbGenerateTaskIT.notConfiguredTaskFailure(DbGenerateTaskIT.java:40)

org.apache.cayenne.tools.DbGenerateTaskIT > customConfigTaskSuccess FAILED
    java.nio.file.NoSuchFileException: /home/jenkins/jenkins-slave/workspace/cayenne-master/cayenneTestConnection/derby/jdk/JDK%201.8%20(latest)/slave/ubuntu/cayenne-gradle-plugin/build/resources/test/org/apache/cayenne/tools/cdbgen_custom.gradle
        at sun.nio.fs.UnixException.translateToIOException(UnixException.java:86)
        at sun.nio.fs.UnixException.rethrowAsIOException(UnixException.java:102)
        at sun.nio.fs.UnixException.rethrowAsIOException(UnixException.java:107)
        at sun.nio.fs.UnixCopyFile.copy(UnixCopyFile.java:526)
        at sun.nio.fs.UnixFileSystemProvider.copy(UnixFileSystemProvider.java:253)
        at java.nio.file.Files.copy(Files.java:1274)
        at org.apache.cayenne.tools.BaseTaskIT.prepareBuildScript(BaseTaskIT.java:71)
        at org.apache.cayenne.tools.BaseTaskIT.createRunner(BaseTaskIT.java:53)
        at org.apache.cayenne.tools.DbGenerateTaskIT.customConfigTaskSuccess(DbGenerateTaskIT.java:83)

org.apache.cayenne.tools.DbImportIT > emptyDbTaskSuccess FAILED
    java.nio.file.NoSuchFileException: /home/jenkins/jenkins-slave/workspace/cayenne-master/cayenneTestConnection/derby/jdk/JDK%201.8%20(latest)/slave/ubuntu/cayenne-gradle-plugin/build/resources/test/org/apache/cayenne/tools/dbimport_empty_db.gradle
        at sun.nio.fs.UnixException.translateToIOException(UnixException.java:86)
        at sun.nio.fs.UnixException.rethrowAsIOException(UnixException.java:102)
        at sun.nio.fs.UnixException.rethrowAsIOException(UnixException.java:107)
        at sun.nio.fs.UnixCopyFile.copy(UnixCopyFile.java:526)
        at sun.nio.fs.UnixFileSystemProvider.copy(UnixFileSystemProvider.java:253)
        at java.nio.file.Files.copy(Files.java:1274)
        at org.apache.cayenne.tools.BaseTaskIT.prepareBuildScript(BaseTaskIT.java:71)
        at org.apache.cayenne.tools.BaseTaskIT.createRunner(BaseTaskIT.java:53)
        at org.apache.cayenne.tools.DbImportIT.emptyDbTaskSuccess(DbImportIT.java:59)

org.apache.cayenne.tools.DbImportIT > simpleDbTaskSuccess FAILED
    java.nio.file.NoSuchFileException: /home/jenkins/jenkins-slave/workspace/cayenne-master/cayenneTestConnection/derby/jdk/JDK%201.8%20(latest)/slave/ubuntu/cayenne-gradle-plugin/build/resources/test/org/apache/cayenne/tools/dbimport_simple_db.gradle
        at sun.nio.fs.UnixException.translateToIOException(UnixException.java:86)
        at sun.nio.fs.UnixException.rethrowAsIOException(UnixException.java:102)
        at sun.nio.fs.UnixException.rethrowAsIOException(UnixException.java:107)
        at sun.nio.fs.UnixCopyFile.copy(UnixCopyFile.java:526)
        at sun.nio.fs.UnixFileSystemProvider.copy(UnixFileSystemProvider.java:253)
        at java.nio.file.Files.copy(Files.java:1274)
        at org.apache.cayenne.tools.BaseTaskIT.prepareBuildScript(BaseTaskIT.java:71)
        at org.apache.cayenne.tools.BaseTaskIT.createRunner(BaseTaskIT.java:53)
        at org.apache.cayenne.tools.DbImportIT.simpleDbTaskSuccess(DbImportIT.java:74)

org.apache.cayenne.tools.DbImportIT > notConfiguredTaskFailure FAILED
    java.nio.file.NoSuchFileException: /home/jenkins/jenkins-slave/workspace/cayenne-master/cayenneTestConnection/derby/jdk/JDK%201.8%20(latest)/slave/ubuntu/cayenne-gradle-plugin/build/resources/test/org/apache/cayenne/tools/dbimport_failure.gradle
        at sun.nio.fs.UnixException.translateToIOException(UnixException.java:86)
        at sun.nio.fs.UnixException.rethrowAsIOException(UnixException.java:102)
        at sun.nio.fs.UnixException.rethrowAsIOException(UnixException.java:107)
        at sun.nio.fs.UnixCopyFile.copy(UnixCopyFile.java:526)
        at sun.nio.fs.UnixFileSystemProvider.copy(UnixFileSystemProvider.java:253)
        at java.nio.file.Files.copy(Files.java:1274)
        at org.apache.cayenne.tools.BaseTaskIT.prepareBuildScript(BaseTaskIT.java:71)
        at org.apache.cayenne.tools.BaseTaskIT.createRunner(BaseTaskIT.java:53)
        at org.apache.cayenne.tools.DbImportIT.notConfiguredTaskFailure(DbImportIT.java:47)

org.apache.cayenne.tools.GradlePluginIT > testGradleVersionsCompatibility FAILED
    java.lang.AssertionError: Failed versions: 3.5 3.3 3.0 2.12 2.8
        at org.junit.Assert.fail(Assert.java:88)
        at org.junit.Assert.assertTrue(Assert.java:41)
        at org.apache.cayenne.tools.GradlePluginIT.testGradleVersionsCompatibility(GradlePluginIT.java:67)
Gradle Test Executor 1 finished executing tests.

28 tests completed, 9 failed
Finished generating test XML results (0.036 secs) into: <https://builds.apache.org/job/cayenne-master/cayenneTestConnection=derby,jdk=JDK%201.8%20(latest),slave=ubuntu/ws/cayenne-gradle-plugin/build/test-results/test>
Generating HTML test report...
Finished generating test html results (0.055 secs) into: <https://builds.apache.org/job/cayenne-master/cayenneTestConnection=derby,jdk=JDK%201.8%20(latest),slave=ubuntu/ws/cayenne-gradle-plugin/build/reports/tests/test>
:test FAILED
:test (Thread[main,5,main]) completed. Took 7.06 secs.

FAILURE: Build failed with an exception.

* What went wrong:
Execution failed for task ':test'.
> There were failing tests. See the report at: file:///home/jenkins/jenkins-slave/workspace/cayenne-master/cayenneTestConnection/derby/jdk/JDK%201.8%20(latest)/slave/ubuntu/cayenne-gradle-plugin/build/reports/tests/test/index.html

* Try:
Run with --stacktrace option to get the stack trace. Run with --debug option to get more log output.

BUILD FAILED

Total time: 19.395 secs
Stopped 0 worker daemon(s).
[ERROR] Command execution failed.
org.apache.commons.exec.ExecuteException: Process exited with an error: 1 (Exit value: 1)
	at org.apache.commons.exec.DefaultExecutor.executeInternal(DefaultExecutor.java:404)
	at org.apache.commons.exec.DefaultExecutor.execute(DefaultExecutor.java:166)
	at org.codehaus.mojo.exec.ExecMojo.executeCommandLine(ExecMojo.java:804)
	at org.codehaus.mojo.exec.ExecMojo.executeCommandLine(ExecMojo.java:751)
	at org.codehaus.mojo.exec.ExecMojo.execute(ExecMojo.java:313)
	at org.apache.maven.plugin.DefaultBuildPluginManager.executeMojo(DefaultBuildPluginManager.java:134)
	at org.apache.maven.lifecycle.internal.MojoExecutor.execute(MojoExecutor.java:207)
	at org.apache.maven.lifecycle.internal.MojoExecutor.execute(MojoExecutor.java:153)
	at org.apache.maven.lifecycle.internal.MojoExecutor.execute(MojoExecutor.java:145)
	at org.apache.maven.lifecycle.internal.LifecycleModuleBuilder.buildProject(LifecycleModuleBuilder.java:116)
	at org.apache.maven.lifecycle.internal.LifecycleModuleBuilder.buildProject(LifecycleModuleBuilder.java:80)
	at org.apache.maven.lifecycle.internal.builder.singlethreaded.SingleThreadedBuilder.build(SingleThreadedBuilder.java:51)
	at org.apache.maven.lifecycle.internal.LifecycleStarter.execute(LifecycleStarter.java:128)
	at org.apache.maven.DefaultMaven.doExecute(DefaultMaven.java:307)
	at org.apache.maven.DefaultMaven.doExecute(DefaultMaven.java:193)
	at org.apache.maven.DefaultMaven.execute(DefaultMaven.java:106)
	at org.apache.maven.cli.MavenCli.execute(MavenCli.java:863)
	at org.apache.maven.cli.MavenCli.doMain(MavenCli.java:288)
	at org.apache.maven.cli.MavenCli.main(MavenCli.java:199)
	at sun.reflect.NativeMethodAccessorImpl.invoke0(Native Method)
	at sun.reflect.NativeMethodAccessorImpl.invoke(NativeMethodAccessorImpl.java:62)
	at sun.reflect.DelegatingMethodAccessorImpl.invoke(DelegatingMethodAccessorImpl.java:43)
	at java.lang.reflect.Method.invoke(Method.java:498)
	at org.codehaus.plexus.classworlds.launcher.Launcher.launchEnhanced(Launcher.java:289)
	at org.codehaus.plexus.classworlds.launcher.Launcher.launch(Launcher.java:229)
	at org.codehaus.plexus.classworlds.launcher.Launcher.mainWithExitCode(Launcher.java:415)
	at org.codehaus.plexus.classworlds.launcher.Launcher.main(Launcher.java:356)
[INFO] ------------------------------------------------------------------------
[INFO] Reactor Summary:
[INFO] 
[INFO] cayenne-parent: Top-level parent of Cayenne modules  SUCCESS [  0.568 s]
[INFO] build-tools-parent: Cayenne Build Tools Parent ..... SUCCESS [  0.017 s]
[INFO] cayenne-legal: Cayenne License and Notice Bundle ... SUCCESS [  1.058 s]
[INFO] cayenne-test-utilities: Common Unit Test Utilities . SUCCESS [  0.861 s]
[INFO] cayenne-checkers: Cayenne Code Checkers ............ SUCCESS [  0.049 s]
[INFO] cayenne-di: Cayenne Dependency Injection Container . SUCCESS [  9.268 s]
[INFO] cayenne-server: Cayenne Server ..................... SUCCESS [01:39 min]
[INFO] cayenne-client: Cayenne ROP Client ................. SUCCESS [ 31.729 s]
[INFO] cayenne-project: Cayenne Project ................... SUCCESS [  7.336 s]
[INFO] cayenne-dbsync: Database Synchronization Tools ..... SUCCESS [ 26.920 s]
[INFO] cayenne-cgen: Cayenne Class Generation Tools ....... SUCCESS [  2.930 s]
[INFO] cayenne-ant: Cayenne Ant Tasks ..................... SUCCESS [  7.036 s]
[INFO] cayenne-commitlog: Cayenne Commit Log Module ....... SUCCESS [  4.926 s]
[INFO] cayenne-lifecycle: Cayenne Lifecycle Utilities ..... SUCCESS [  9.449 s]
[INFO] cayenne-maven-plugins-parent: Maven Plugins parent . SUCCESS [  0.297 s]
[INFO] cayenne-maven-plugin: Cayenne Maven Plugin ......... SUCCESS [ 20.185 s]
[INFO] cayenne-crypto: Cayenne Cryptography Extensions .... SUCCESS [ 10.780 s]
[INFO] cayenne-joda: Cayenne Joda Extensions .............. SUCCESS [  4.758 s]
[INFO] cayenne-dbcp2: Cayenne DBCP2 Extension ............. SUCCESS [  2.040 s]
[INFO] cayenne-jcache: Cayenne JCache Integration ......... SUCCESS [  8.809 s]
[INFO] cayenne-cache-invalidation: Cayenne Cache Invalidation SUCCESS [  3.429 s]
[INFO] cayenne-itests-parent: Integration Tests Parent .... SUCCESS [  0.035 s]
[INFO] cayenne-tools-itest: Tools integration tests ....... SUCCESS [  1.677 s]
[INFO] cayenne-modeler-parent: Cayenne Modeler Parent ..... SUCCESS [  0.013 s]
[INFO] cayenne-wocompat: WebObjects Compatibility Library . SUCCESS [  6.183 s]
[INFO] cayenne-modeler: Cayenne Modeler Core .............. SUCCESS [ 14.460 s]
[INFO] cayenne-modeler-generic-ext: Modeler Generic Extensions SUCCESS [  1.972 s]
[INFO] cayenne-modeler-generic: Modeler Generic Assembly .. SUCCESS [  0.600 s]
[INFO] cayenne-modeler-mac-ext: Modeler MacOS Extensions .. SUCCESS [  2.410 s]
[INFO] cayenne-modeler-mac: Modeler MacOS Assembly ........ SUCCESS [  0.664 s]
[INFO] cayenne-modeler-win-ext: Modeler Win Extensions .... SUCCESS [  1.847 s]
[INFO] cayenne-modeler-win: Modeler Windows Assembly ...... SUCCESS [  0.596 s]
[INFO] maven-cayenne-plugin: Deprecated Cayenne Maven Plugin SUCCESS [  7.116 s]
[INFO] cayenne-modeler-maven-plugin: Cayenne Modeler Maven Plugin SUCCESS [  3.124 s]
[INFO] cayenne-tutorials-parent: Cayenne Tutorials ........ SUCCESS [  0.014 s]
[INFO] tutorial: ayenne Tutorial .......................... SUCCESS [  1.105 s]
[INFO] tutorial-rop-server: Cayenne ROP Server Tutorial ... SUCCESS [  2.227 s]
[INFO] tutorial-rop-client: Cayenne ROP Client Tutorial ... SUCCESS [  1.140 s]
[INFO] cayenne-java8: Cayenne Java8 Extensions ............ SUCCESS [  4.405 s]
[INFO] cayenne-protostuff: Cayenne Protostuff Extension ... SUCCESS [  6.139 s]
[INFO] tutorial-rop-server-http2: Cayenne ROP HTTP/2 Server Tutorial SUCCESS [  2.214 s]
[INFO] cayenne-client-jetty: Cayenne ROP Client (Jetty) ... SUCCESS [  5.760 s]
[INFO] tutorial-rop-client-http2: Cayenne ROP HTTP/2 Client Tutorial SUCCESS [  1.377 s]
[INFO] cayenne-docs-parent: Cayenne Documenation Parent ... SUCCESS [  0.008 s]
[INFO] cayenne-doc: Cayenne Documentation ................. SUCCESS [01:11 min]
[INFO] cayenne-docbook: Cayenne Docbook Documentation ..... SUCCESS [  0.998 s]
[INFO] docbook-stylesheets: Docbook - Cayenne Stylesheets . SUCCESS [  0.087 s]
[INFO] cayenne-guide: Docbook - Cayenne Guide ............. SUCCESS [ 12.347 s]
[INFO] getting-started: Docbook - Getting Started with Cayenne SUCCESS [  4.361 s]
[INFO] getting-started-rop: Docbook - Getting Started with Cayenne ROP SUCCESS [  3.084 s]
[INFO] upgrade-guide: Docbook - Cayenne New Features and Upgrade Guide SUCCESS [  1.777 s]
[INFO] cayenne-eventbridges-parent: Event bridges implementations parent SUCCESS [  0.060 s]
[INFO] cayenne-jgroups: Cayenne JGroups Event bridge ...... SUCCESS [  1.983 s]
[INFO] cayenne-jms: Cayenne JMS Event bridge .............. SUCCESS [  2.036 s]
[INFO] cayenne-xmpp: Cayenne XMPP Event bridge ............ SUCCESS [  2.160 s]
[INFO] cayenne-gradle-plugin: Cayenne Gradle Plugin ....... FAILURE [ 21.054 s]
[INFO] cayenne-assembly: Cayenne Release Assembly ......... SKIPPED
[INFO] ------------------------------------------------------------------------
[INFO] BUILD FAILURE
[INFO] ------------------------------------------------------------------------
[INFO] Total time: 07:20 min
[INFO] Finished at: 2017-05-30T08:29:39+00:00
[INFO] Final Memory: 272M/458M
[INFO] ------------------------------------------------------------------------
[ERROR] Failed to execute goal org.codehaus.mojo:exec-maven-plugin:1.6.0:exec (gradle) on project cayenne-gradle-plugin: Command execution failed. Process exited with an error: 1 (Exit value: 1) -> [Help 1]
org.apache.maven.lifecycle.LifecycleExecutionException: Failed to execute goal org.codehaus.mojo:exec-maven-plugin:1.6.0:exec (gradle) on project cayenne-gradle-plugin: Command execution failed.
	at org.apache.maven.lifecycle.internal.MojoExecutor.execute(MojoExecutor.java:212)
	at org.apache.maven.lifecycle.internal.MojoExecutor.execute(MojoExecutor.java:153)
	at org.apache.maven.lifecycle.internal.MojoExecutor.execute(MojoExecutor.java:145)
	at org.apache.maven.lifecycle.internal.LifecycleModuleBuilder.buildProject(LifecycleModuleBuilder.java:116)
	at org.apache.maven.lifecycle.internal.LifecycleModuleBuilder.buildProject(LifecycleModuleBuilder.java:80)
	at org.apache.maven.lifecycle.internal.builder.singlethreaded.SingleThreadedBuilder.build(SingleThreadedBuilder.java:51)
	at org.apache.maven.lifecycle.internal.LifecycleStarter.execute(LifecycleStarter.java:128)
	at org.apache.maven.DefaultMaven.doExecute(DefaultMaven.java:307)
	at org.apache.maven.DefaultMaven.doExecute(DefaultMaven.java:193)
	at org.apache.maven.DefaultMaven.execute(DefaultMaven.java:106)
	at org.apache.maven.cli.MavenCli.execute(MavenCli.java:863)
	at org.apache.maven.cli.MavenCli.doMain(MavenCli.java:288)
	at org.apache.maven.cli.MavenCli.main(MavenCli.java:199)
	at sun.reflect.NativeMethodAccessorImpl.invoke0(Native Method)
	at sun.reflect.NativeMethodAccessorImpl.invoke(NativeMethodAccessorImpl.java:62)
	at sun.reflect.DelegatingMethodAccessorImpl.invoke(DelegatingMethodAccessorImpl.java:43)
	at java.lang.reflect.Method.invoke(Method.java:498)
	at org.codehaus.plexus.classworlds.launcher.Launcher.launchEnhanced(Launcher.java:289)
	at org.codehaus.plexus.classworlds.launcher.Launcher.launch(Launcher.java:229)
	at org.codehaus.plexus.classworlds.launcher.Launcher.mainWithExitCode(Launcher.java:415)
	at org.codehaus.plexus.classworlds.launcher.Launcher.main(Launcher.java:356)
Caused by: org.apache.maven.plugin.MojoExecutionException: Command execution failed.
	at org.codehaus.mojo.exec.ExecMojo.execute(ExecMojo.java:326)
	at org.apache.maven.plugin.DefaultBuildPluginManager.executeMojo(DefaultBuildPluginManager.java:134)
	at org.apache.maven.lifecycle.internal.MojoExecutor.execute(MojoExecutor.java:207)
	... 20 more
Caused by: org.apache.commons.exec.ExecuteException: Process exited with an error: 1 (Exit value: 1)
	at org.apache.commons.exec.DefaultExecutor.executeInternal(DefaultExecutor.java:404)
	at org.apache.commons.exec.DefaultExecutor.execute(DefaultExecutor.java:166)
	at org.codehaus.mojo.exec.ExecMojo.executeCommandLine(ExecMojo.java:804)
	at org.codehaus.mojo.exec.ExecMojo.executeCommandLine(ExecMojo.java:751)
	at org.codehaus.mojo.exec.ExecMojo.execute(ExecMojo.java:313)
	... 22 more
[ERROR] 
[ERROR] Re-run Maven using the -X switch to enable full debug logging.
[ERROR] 
[ERROR] For more information about the errors and possible solutions, please read the following articles:
[ERROR] [Help 1] http://cwiki.apache.org/confluence/display/MAVEN/MojoExecutionException
[ERROR] 
[ERROR] After correcting the problems, you can resume the build with the command
[ERROR]   mvn <goals> -rf :cayenne-gradle-plugin
Build step 'Invoke top-level Maven targets' marked build as failure
Recording test results
Not sending mail to unregistered user stariy95@gmail.com
Not sending mail to unregistered user andrus@objectstyle.com
Not sending mail to unregistered user maks1464@gmail.com
Not sending mail to unregistered user drekoas@gmail.com

Jenkins build is back to normal : cayenne-master » derby,JDK 1.8 (latest),ubuntu #661

Posted by Apache Jenkins Server <je...@builds.apache.org>.
See <https://builds.apache.org/job/cayenne-master/cayenneTestConnection=derby,jdk=JDK%201.8%20(latest),slave=ubuntu/661/display/redirect?page=changes>


Build failed in Jenkins: cayenne-master » derby,JDK 1.8 (latest),ubuntu #660

Posted by Apache Jenkins Server <je...@builds.apache.org>.
See <https://builds.apache.org/job/cayenne-master/cayenneTestConnection=derby,jdk=JDK%201.8%20(latest),slave=ubuntu/660/display/redirect?page=changes>

Changes:

[andrus] CAY-2326 DI: can't override List/Map elements from another Module

[andrus] CAY-2326 DI: can't override List/Map elements from another Module

[andrus] CAY-2259 QueryCache: support for referencing type-safe caches

[andrus] CAY-2259 QueryCache: support for referencing type-safe caches

------------------------------------------
[...truncated 8.89 MB...]
[INFO] Compiling 25 source files to <https://builds.apache.org/job/cayenne-master/cayenneTestConnection=derby,jdk=JDK%201.8%20(latest),slave=ubuntu/ws/cayenne-lifecycle/target/classes>
[INFO] 
[INFO] --- maven-resources-plugin:2.4.3:testResources (default-testResources) @ cayenne-lifecycle ---
[INFO] Using 'UTF-8' encoding to copy filtered resources.
[INFO] Copying 2 resources
[INFO] Copying 33 resources
[INFO] 
[INFO] --- maven-compiler-plugin:2.3.2:testCompile (default-testCompile) @ cayenne-lifecycle ---
[INFO] Compiling 35 source files to <https://builds.apache.org/job/cayenne-master/cayenneTestConnection=derby,jdk=JDK%201.8%20(latest),slave=ubuntu/ws/cayenne-lifecycle/target/test-classes>
[INFO] 
[INFO] --- maven-surefire-plugin:2.5:test (default-test) @ cayenne-lifecycle ---
[INFO] Surefire report directory: <https://builds.apache.org/job/cayenne-master/cayenneTestConnection=derby,jdk=JDK%201.8%20(latest),slave=ubuntu/ws/cayenne-lifecycle/target/surefire-reports>

-------------------------------------------------------
 T E S T S
-------------------------------------------------------
Running org.apache.cayenne.lifecycle.sort.WeightedAshwoodEntitySorterTest
[main] INFO org.apache.cayenne.configuration.XMLDataChannelDescriptorLoader - Loading XML configuration resource from <https://builds.apache.org/job/cayenne-master/cayenneTestConnection=derby,jdk=JDK%201.8%20(latest),slave=ubuntu/ws/cayenne-lifecycle/target/test-classes/cayenne-lifecycle.xml>
[main] INFO org.apache.cayenne.configuration.XMLDataChannelDescriptorLoader - Loading XML DataMap resource from <https://builds.apache.org/job/cayenne-master/cayenneTestConnection=derby,jdk=JDK%201.8%20(latest),slave=ubuntu/ws/cayenne-lifecycle/target/test-classes/lifecycle-map.map.xml>
[main] INFO org.apache.cayenne.configuration.XMLDataChannelDescriptorLoader - loading user name and password.
[main] INFO org.apache.cayenne.datasource.DriverDataSource - Connecting to 'jdbc:hsqldb:mem:lifecycle' as 'sa'
[main] INFO org.apache.cayenne.datasource.DriverDataSource - +++ Connecting: SUCCESS.
[main] INFO org.apache.cayenne.configuration.server.DataDomainProvider - setting DataNode 'lifecycle-db' as default, used by all unlinked DataMaps
Tests run: 1, Failures: 0, Errors: 1, Skipped: 0, Time elapsed: 0.976 sec <<< FAILURE!
Running org.apache.cayenne.lifecycle.id.IdCoderTest
[main] INFO org.apache.cayenne.configuration.XMLDataChannelDescriptorLoader - Loading XML configuration resource from <https://builds.apache.org/job/cayenne-master/cayenneTestConnection=derby,jdk=JDK%201.8%20(latest),slave=ubuntu/ws/cayenne-lifecycle/target/test-classes/cayenne-lifecycle.xml>
[main] INFO org.apache.cayenne.configuration.XMLDataChannelDescriptorLoader - Loading XML DataMap resource from <https://builds.apache.org/job/cayenne-master/cayenneTestConnection=derby,jdk=JDK%201.8%20(latest),slave=ubuntu/ws/cayenne-lifecycle/target/test-classes/lifecycle-map.map.xml>
[main] INFO org.apache.cayenne.configuration.XMLDataChannelDescriptorLoader - loading user name and password.
[main] INFO org.apache.cayenne.datasource.DriverDataSource - Connecting to 'jdbc:hsqldb:mem:lifecycle' as 'sa'
[main] INFO org.apache.cayenne.datasource.DriverDataSource - +++ Connecting: SUCCESS.
[main] INFO org.apache.cayenne.configuration.server.DataDomainProvider - setting DataNode 'lifecycle-db' as default, used by all unlinked DataMaps
[main] INFO org.apache.cayenne.configuration.XMLDataChannelDescriptorLoader - Loading XML configuration resource from <https://builds.apache.org/job/cayenne-master/cayenneTestConnection=derby,jdk=JDK%201.8%20(latest),slave=ubuntu/ws/cayenne-lifecycle/target/test-classes/cayenne-lifecycle.xml>
[main] INFO org.apache.cayenne.configuration.XMLDataChannelDescriptorLoader - Loading XML DataMap resource from <https://builds.apache.org/job/cayenne-master/cayenneTestConnection=derby,jdk=JDK%201.8%20(latest),slave=ubuntu/ws/cayenne-lifecycle/target/test-classes/lifecycle-map.map.xml>
[main] INFO org.apache.cayenne.configuration.XMLDataChannelDescriptorLoader - loading user name and password.
[main] INFO org.apache.cayenne.datasource.DriverDataSource - Connecting to 'jdbc:hsqldb:mem:lifecycle' as 'sa'
[main] INFO org.apache.cayenne.datasource.DriverDataSource - +++ Connecting: SUCCESS.
[main] INFO org.apache.cayenne.configuration.server.DataDomainProvider - setting DataNode 'lifecycle-db' as default, used by all unlinked DataMaps
[main] INFO org.apache.cayenne.configuration.XMLDataChannelDescriptorLoader - Loading XML configuration resource from <https://builds.apache.org/job/cayenne-master/cayenneTestConnection=derby,jdk=JDK%201.8%20(latest),slave=ubuntu/ws/cayenne-lifecycle/target/test-classes/cayenne-lifecycle.xml>
[main] INFO org.apache.cayenne.configuration.XMLDataChannelDescriptorLoader - Loading XML DataMap resource from <https://builds.apache.org/job/cayenne-master/cayenneTestConnection=derby,jdk=JDK%201.8%20(latest),slave=ubuntu/ws/cayenne-lifecycle/target/test-classes/lifecycle-map.map.xml>
[main] INFO org.apache.cayenne.configuration.XMLDataChannelDescriptorLoader - loading user name and password.
[main] INFO org.apache.cayenne.datasource.DriverDataSource - Connecting to 'jdbc:hsqldb:mem:lifecycle' as 'sa'
[main] INFO org.apache.cayenne.datasource.DriverDataSource - +++ Connecting: SUCCESS.
[main] INFO org.apache.cayenne.configuration.server.DataDomainProvider - setting DataNode 'lifecycle-db' as default, used by all unlinked DataMaps
[main] INFO org.apache.cayenne.configuration.XMLDataChannelDescriptorLoader - Loading XML configuration resource from <https://builds.apache.org/job/cayenne-master/cayenneTestConnection=derby,jdk=JDK%201.8%20(latest),slave=ubuntu/ws/cayenne-lifecycle/target/test-classes/cayenne-lifecycle.xml>
[main] INFO org.apache.cayenne.configuration.XMLDataChannelDescriptorLoader - Loading XML DataMap resource from <https://builds.apache.org/job/cayenne-master/cayenneTestConnection=derby,jdk=JDK%201.8%20(latest),slave=ubuntu/ws/cayenne-lifecycle/target/test-classes/lifecycle-map.map.xml>
[main] INFO org.apache.cayenne.configuration.XMLDataChannelDescriptorLoader - loading user name and password.
[main] INFO org.apache.cayenne.datasource.DriverDataSource - Connecting to 'jdbc:hsqldb:mem:lifecycle' as 'sa'
[main] INFO org.apache.cayenne.datasource.DriverDataSource - +++ Connecting: SUCCESS.
[main] INFO org.apache.cayenne.configuration.server.DataDomainProvider - setting DataNode 'lifecycle-db' as default, used by all unlinked DataMaps
[main] INFO org.apache.cayenne.configuration.XMLDataChannelDescriptorLoader - Loading XML configuration resource from <https://builds.apache.org/job/cayenne-master/cayenneTestConnection=derby,jdk=JDK%201.8%20(latest),slave=ubuntu/ws/cayenne-lifecycle/target/test-classes/cayenne-lifecycle.xml>
[main] INFO org.apache.cayenne.configuration.XMLDataChannelDescriptorLoader - Loading XML DataMap resource from <https://builds.apache.org/job/cayenne-master/cayenneTestConnection=derby,jdk=JDK%201.8%20(latest),slave=ubuntu/ws/cayenne-lifecycle/target/test-classes/lifecycle-map.map.xml>
[main] INFO org.apache.cayenne.configuration.XMLDataChannelDescriptorLoader - loading user name and password.
[main] INFO org.apache.cayenne.datasource.DriverDataSource - Connecting to 'jdbc:hsqldb:mem:lifecycle' as 'sa'
[main] INFO org.apache.cayenne.datasource.DriverDataSource - +++ Connecting: SUCCESS.
[main] INFO org.apache.cayenne.configuration.server.DataDomainProvider - setting DataNode 'lifecycle-db' as default, used by all unlinked DataMaps
Tests run: 5, Failures: 0, Errors: 5, Skipped: 0, Time elapsed: 0.206 sec <<< FAILURE!
Running org.apache.cayenne.lifecycle.id.EntityIdCoderTest
[main] INFO org.apache.cayenne.configuration.XMLDataChannelDescriptorLoader - Loading XML configuration resource from <https://builds.apache.org/job/cayenne-master/cayenneTestConnection=derby,jdk=JDK%201.8%20(latest),slave=ubuntu/ws/cayenne-lifecycle/target/test-classes/cayenne-lifecycle.xml>
[main] INFO org.apache.cayenne.configuration.XMLDataChannelDescriptorLoader - Loading XML DataMap resource from <https://builds.apache.org/job/cayenne-master/cayenneTestConnection=derby,jdk=JDK%201.8%20(latest),slave=ubuntu/ws/cayenne-lifecycle/target/test-classes/lifecycle-map.map.xml>
[main] INFO org.apache.cayenne.configuration.XMLDataChannelDescriptorLoader - loading user name and password.
[main] INFO org.apache.cayenne.datasource.DriverDataSource - Connecting to 'jdbc:hsqldb:mem:lifecycle' as 'sa'
[main] INFO org.apache.cayenne.datasource.DriverDataSource - +++ Connecting: SUCCESS.
[main] INFO org.apache.cayenne.configuration.server.DataDomainProvider - setting DataNode 'lifecycle-db' as default, used by all unlinked DataMaps
Tests run: 7, Failures: 0, Errors: 1, Skipped: 0, Time elapsed: 0.217 sec <<< FAILURE!
Running org.apache.cayenne.lifecycle.relationship.ObjectIdRelationshipHandlerTest
[main] INFO org.apache.cayenne.configuration.XMLDataChannelDescriptorLoader - Loading XML configuration resource from <https://builds.apache.org/job/cayenne-master/cayenneTestConnection=derby,jdk=JDK%201.8%20(latest),slave=ubuntu/ws/cayenne-lifecycle/target/test-classes/cayenne-lifecycle.xml>
[main] INFO org.apache.cayenne.configuration.XMLDataChannelDescriptorLoader - Loading XML DataMap resource from <https://builds.apache.org/job/cayenne-master/cayenneTestConnection=derby,jdk=JDK%201.8%20(latest),slave=ubuntu/ws/cayenne-lifecycle/target/test-classes/lifecycle-map.map.xml>
[main] INFO org.apache.cayenne.configuration.XMLDataChannelDescriptorLoader - loading user name and password.
[main] INFO org.apache.cayenne.datasource.DriverDataSource - Connecting to 'jdbc:hsqldb:mem:lifecycle' as 'sa'
[main] INFO org.apache.cayenne.datasource.DriverDataSource - +++ Connecting: SUCCESS.
[main] INFO org.apache.cayenne.configuration.server.DataDomainProvider - setting DataNode 'lifecycle-db' as default, used by all unlinked DataMaps
[main] INFO org.apache.cayenne.configuration.XMLDataChannelDescriptorLoader - Loading XML configuration resource from <https://builds.apache.org/job/cayenne-master/cayenneTestConnection=derby,jdk=JDK%201.8%20(latest),slave=ubuntu/ws/cayenne-lifecycle/target/test-classes/cayenne-lifecycle.xml>
[main] INFO org.apache.cayenne.configuration.XMLDataChannelDescriptorLoader - Loading XML DataMap resource from <https://builds.apache.org/job/cayenne-master/cayenneTestConnection=derby,jdk=JDK%201.8%20(latest),slave=ubuntu/ws/cayenne-lifecycle/target/test-classes/lifecycle-map.map.xml>
[main] INFO org.apache.cayenne.configuration.XMLDataChannelDescriptorLoader - loading user name and password.
[main] INFO org.apache.cayenne.datasource.DriverDataSource - Connecting to 'jdbc:hsqldb:mem:lifecycle' as 'sa'
[main] INFO org.apache.cayenne.datasource.DriverDataSource - +++ Connecting: SUCCESS.
[main] INFO org.apache.cayenne.configuration.server.DataDomainProvider - setting DataNode 'lifecycle-db' as default, used by all unlinked DataMaps
[main] INFO org.apache.cayenne.configuration.XMLDataChannelDescriptorLoader - Loading XML configuration resource from <https://builds.apache.org/job/cayenne-master/cayenneTestConnection=derby,jdk=JDK%201.8%20(latest),slave=ubuntu/ws/cayenne-lifecycle/target/test-classes/cayenne-lifecycle.xml>
[main] INFO org.apache.cayenne.configuration.XMLDataChannelDescriptorLoader - Loading XML DataMap resource from <https://builds.apache.org/job/cayenne-master/cayenneTestConnection=derby,jdk=JDK%201.8%20(latest),slave=ubuntu/ws/cayenne-lifecycle/target/test-classes/lifecycle-map.map.xml>
[main] INFO org.apache.cayenne.configuration.XMLDataChannelDescriptorLoader - loading user name and password.
[main] INFO org.apache.cayenne.datasource.DriverDataSource - Connecting to 'jdbc:hsqldb:mem:lifecycle' as 'sa'
[main] INFO org.apache.cayenne.datasource.DriverDataSource - +++ Connecting: SUCCESS.
[main] INFO org.apache.cayenne.configuration.server.DataDomainProvider - setting DataNode 'lifecycle-db' as default, used by all unlinked DataMaps
Tests run: 3, Failures: 0, Errors: 3, Skipped: 0, Time elapsed: 0.083 sec <<< FAILURE!
Running org.apache.cayenne.lifecycle.id.StringIdQueryTest
[main] INFO org.apache.cayenne.configuration.XMLDataChannelDescriptorLoader - Loading XML configuration resource from <https://builds.apache.org/job/cayenne-master/cayenneTestConnection=derby,jdk=JDK%201.8%20(latest),slave=ubuntu/ws/cayenne-lifecycle/target/test-classes/cayenne-lifecycle.xml>
[main] INFO org.apache.cayenne.configuration.XMLDataChannelDescriptorLoader - Loading XML DataMap resource from <https://builds.apache.org/job/cayenne-master/cayenneTestConnection=derby,jdk=JDK%201.8%20(latest),slave=ubuntu/ws/cayenne-lifecycle/target/test-classes/lifecycle-map.map.xml>
[main] INFO org.apache.cayenne.configuration.XMLDataChannelDescriptorLoader - loading user name and password.
[main] INFO org.apache.cayenne.datasource.DriverDataSource - Connecting to 'jdbc:hsqldb:mem:lifecycle' as 'sa'
[main] INFO org.apache.cayenne.datasource.DriverDataSource - +++ Connecting: SUCCESS.
[main] INFO org.apache.cayenne.configuration.server.DataDomainProvider - setting DataNode 'lifecycle-db' as default, used by all unlinked DataMaps
[main] INFO org.apache.cayenne.configuration.XMLDataChannelDescriptorLoader - Loading XML configuration resource from <https://builds.apache.org/job/cayenne-master/cayenneTestConnection=derby,jdk=JDK%201.8%20(latest),slave=ubuntu/ws/cayenne-lifecycle/target/test-classes/cayenne-lifecycle.xml>
[main] INFO org.apache.cayenne.configuration.XMLDataChannelDescriptorLoader - Loading XML DataMap resource from <https://builds.apache.org/job/cayenne-master/cayenneTestConnection=derby,jdk=JDK%201.8%20(latest),slave=ubuntu/ws/cayenne-lifecycle/target/test-classes/lifecycle-map.map.xml>
[main] INFO org.apache.cayenne.configuration.XMLDataChannelDescriptorLoader - loading user name and password.
[main] INFO org.apache.cayenne.datasource.DriverDataSource - Connecting to 'jdbc:hsqldb:mem:lifecycle' as 'sa'
[main] INFO org.apache.cayenne.datasource.DriverDataSource - +++ Connecting: SUCCESS.
[main] INFO org.apache.cayenne.configuration.server.DataDomainProvider - setting DataNode 'lifecycle-db' as default, used by all unlinked DataMaps
[main] INFO org.apache.cayenne.configuration.XMLDataChannelDescriptorLoader - Loading XML configuration resource from <https://builds.apache.org/job/cayenne-master/cayenneTestConnection=derby,jdk=JDK%201.8%20(latest),slave=ubuntu/ws/cayenne-lifecycle/target/test-classes/cayenne-lifecycle.xml>
[main] INFO org.apache.cayenne.configuration.XMLDataChannelDescriptorLoader - Loading XML DataMap resource from <https://builds.apache.org/job/cayenne-master/cayenneTestConnection=derby,jdk=JDK%201.8%20(latest),slave=ubuntu/ws/cayenne-lifecycle/target/test-classes/lifecycle-map.map.xml>
[main] INFO org.apache.cayenne.configuration.XMLDataChannelDescriptorLoader - loading user name and password.
[main] INFO org.apache.cayenne.datasource.DriverDataSource - Connecting to 'jdbc:hsqldb:mem:lifecycle' as 'sa'
[main] INFO org.apache.cayenne.datasource.DriverDataSource - +++ Connecting: SUCCESS.
[main] INFO org.apache.cayenne.configuration.server.DataDomainProvider - setting DataNode 'lifecycle-db' as default, used by all unlinked DataMaps
Tests run: 3, Failures: 0, Errors: 3, Skipped: 0, Time elapsed: 0.06 sec <<< FAILURE!
Running org.apache.cayenne.lifecycle.audit.AuditableFilterTest
[main] INFO org.apache.cayenne.configuration.XMLDataChannelDescriptorLoader - Loading XML configuration resource from <https://builds.apache.org/job/cayenne-master/cayenneTestConnection=derby,jdk=JDK%201.8%20(latest),slave=ubuntu/ws/cayenne-lifecycle/target/test-classes/cayenne-lifecycle.xml>
[main] INFO org.apache.cayenne.configuration.XMLDataChannelDescriptorLoader - Loading XML DataMap resource from <https://builds.apache.org/job/cayenne-master/cayenneTestConnection=derby,jdk=JDK%201.8%20(latest),slave=ubuntu/ws/cayenne-lifecycle/target/test-classes/lifecycle-map.map.xml>
[main] INFO org.apache.cayenne.configuration.XMLDataChannelDescriptorLoader - loading user name and password.
[main] INFO org.apache.cayenne.datasource.DriverDataSource - Connecting to 'jdbc:hsqldb:mem:lifecycle' as 'sa'
[main] INFO org.apache.cayenne.datasource.DriverDataSource - +++ Connecting: SUCCESS.
[main] INFO org.apache.cayenne.configuration.server.DataDomainProvider - setting DataNode 'lifecycle-db' as default, used by all unlinked DataMaps
Tests run: 7, Failures: 0, Errors: 1, Skipped: 0, Time elapsed: 0.178 sec <<< FAILURE!

Results :

Tests in error: 
  testSortDbEntities(org.apache.cayenne.lifecycle.sort.WeightedAshwoodEntitySorterTest)
  testGetSringId_TempWithReplacement(org.apache.cayenne.lifecycle.id.IdCoderTest)
  testGetStringId_ObjectId(org.apache.cayenne.lifecycle.id.IdCoderTest)
  testGetStringId(org.apache.cayenne.lifecycle.id.IdCoderTest)
  testGetStringId_Temp(org.apache.cayenne.lifecycle.id.IdCoderTest)
  testGetObjectId_Temp(org.apache.cayenne.lifecycle.id.IdCoderTest)
  testTempId(org.apache.cayenne.lifecycle.id.EntityIdCoderTest)
  testRelate_New(org.apache.cayenne.lifecycle.relationship.ObjectIdRelationshipHandlerTest)
  testRelate_Existing(org.apache.cayenne.lifecycle.relationship.ObjectIdRelationshipHandlerTest)
  testRelate_Change(org.apache.cayenne.lifecycle.relationship.ObjectIdRelationshipHandlerTest)
  testPerformQuery_MultipleEntities(org.apache.cayenne.lifecycle.id.StringIdQueryTest)
  testPerformQuery_SingleEntity(org.apache.cayenne.lifecycle.id.StringIdQueryTest)
  testConstructor(org.apache.cayenne.lifecycle.id.StringIdQueryTest)
  testUpdateAuditChildByObjectIdRelationship(org.apache.cayenne.lifecycle.audit.AuditableFilterTest)

Tests run: 26, Failures: 0, Errors: 14, Skipped: 0

[INFO] ------------------------------------------------------------------------
[INFO] Reactor Summary:
[INFO] 
[INFO] cayenne-parent: Top-level parent of Cayenne modules  SUCCESS [  0.856 s]
[INFO] build-tools-parent: Cayenne Build Tools Parent ..... SUCCESS [  0.016 s]
[INFO] cayenne-legal: Cayenne License and Notice Bundle ... SUCCESS [  1.483 s]
[INFO] cayenne-test-utilities: Common Unit Test Utilities . SUCCESS [  1.356 s]
[INFO] cayenne-checkers: Cayenne Code Checkers ............ SUCCESS [  0.086 s]
[INFO] cayenne-di: Cayenne Dependency Injection Container . SUCCESS [  9.955 s]
[INFO] cayenne-server: Cayenne Server ..................... SUCCESS [01:38 min]
[INFO] cayenne-client: Cayenne ROP Client ................. SUCCESS [ 30.572 s]
[INFO] cayenne-project: Cayenne Project ................... SUCCESS [  7.139 s]
[INFO] cayenne-dbsync: Database Synchronization Tools ..... SUCCESS [ 29.499 s]
[INFO] cayenne-cgen: Cayenne Class Generation Tools ....... SUCCESS [  3.588 s]
[INFO] cayenne-ant: Cayenne Ant Tasks ..................... SUCCESS [  8.596 s]
[INFO] cayenne-commitlog: Cayenne Commit Log Module ....... SUCCESS [  5.281 s]
[INFO] cayenne-lifecycle: Cayenne Lifecycle Utilities ..... FAILURE [  6.793 s]
[INFO] cayenne-maven-plugins-parent: Maven Plugins parent . SKIPPED
[INFO] cayenne-maven-plugin: Cayenne Maven Plugin ......... SKIPPED
[INFO] cayenne-crypto: Cayenne Cryptography Extensions .... SKIPPED
[INFO] cayenne-joda: Cayenne Joda Extensions .............. SKIPPED
[INFO] cayenne-dbcp2: Cayenne DBCP2 Extension ............. SKIPPED
[INFO] cayenne-jcache: Cayenne JCache Integration ......... SKIPPED
[INFO] cayenne-cache-invalidation: Cayenne Cache Invalidation SKIPPED
[INFO] cayenne-itests-parent: Integration Tests Parent .... SKIPPED
[INFO] cayenne-tools-itest: Tools integration tests ....... SKIPPED
[INFO] cayenne-modeler-parent: Cayenne Modeler Parent ..... SKIPPED
[INFO] cayenne-wocompat: WebObjects Compatibility Library . SKIPPED
[INFO] cayenne-modeler: Cayenne Modeler Core .............. SKIPPED
[INFO] cayenne-modeler-generic-ext: Modeler Generic Extensions SKIPPED
[INFO] cayenne-modeler-generic: Modeler Generic Assembly .. SKIPPED
[INFO] cayenne-modeler-mac-ext: Modeler MacOS Extensions .. SKIPPED
[INFO] cayenne-modeler-mac: Modeler MacOS Assembly ........ SKIPPED
[INFO] cayenne-modeler-win-ext: Modeler Win Extensions .... SKIPPED
[INFO] cayenne-modeler-win: Modeler Windows Assembly ...... SKIPPED
[INFO] maven-cayenne-plugin: Deprecated Cayenne Maven Plugin SKIPPED
[INFO] cayenne-modeler-maven-plugin: Cayenne Modeler Maven Plugin SKIPPED
[INFO] cayenne-tutorials-parent: Cayenne Tutorials ........ SKIPPED
[INFO] tutorial: ayenne Tutorial .......................... SKIPPED
[INFO] tutorial-rop-server: Cayenne ROP Server Tutorial ... SKIPPED
[INFO] tutorial-rop-client: Cayenne ROP Client Tutorial ... SKIPPED
[INFO] cayenne-java8: Cayenne Java8 Extensions ............ SKIPPED
[INFO] cayenne-protostuff: Cayenne Protostuff Extension ... SKIPPED
[INFO] tutorial-rop-server-http2: Cayenne ROP HTTP/2 Server Tutorial SKIPPED
[INFO] cayenne-client-jetty: Cayenne ROP Client (Jetty) ... SKIPPED
[INFO] tutorial-rop-client-http2: Cayenne ROP HTTP/2 Client Tutorial SKIPPED
[INFO] cayenne-docs-parent: Cayenne Documenation Parent ... SKIPPED
[INFO] cayenne-doc: Cayenne Documentation ................. SKIPPED
[INFO] cayenne-docbook: Cayenne Docbook Documentation ..... SKIPPED
[INFO] docbook-stylesheets: Docbook - Cayenne Stylesheets . SKIPPED
[INFO] cayenne-guide: Docbook - Cayenne Guide ............. SKIPPED
[INFO] getting-started: Docbook - Getting Started with Cayenne SKIPPED
[INFO] getting-started-rop: Docbook - Getting Started with Cayenne ROP SKIPPED
[INFO] upgrade-guide: Docbook - Cayenne New Features and Upgrade Guide SKIPPED
[INFO] cayenne-eventbridges-parent: Event bridges implementations parent SKIPPED
[INFO] cayenne-jgroups: Cayenne JGroups Event bridge ...... SKIPPED
[INFO] cayenne-jms: Cayenne JMS Event bridge .............. SKIPPED
[INFO] cayenne-xmpp: Cayenne XMPP Event bridge ............ SKIPPED
[INFO] cayenne-gradle-plugin: Cayenne Gradle Plugin ....... SKIPPED
[INFO] cayenne-assembly: Cayenne Release Assembly ......... SKIPPED
[INFO] ------------------------------------------------------------------------
[INFO] BUILD FAILURE
[INFO] ------------------------------------------------------------------------
[INFO] Total time: 03:24 min
[INFO] Finished at: 2017-05-30T10:33:03+00:00
[INFO] Final Memory: 177M/490M
[INFO] ------------------------------------------------------------------------
[ERROR] Failed to execute goal org.apache.maven.plugins:maven-surefire-plugin:2.5:test (default-test) on project cayenne-lifecycle: There are test failures.
[ERROR] 
[ERROR] Please refer to <https://builds.apache.org/job/cayenne-master/cayenneTestConnection=derby,jdk=JDK%201.8%20(latest),slave=ubuntu/ws/cayenne-lifecycle/target/surefire-reports> for the individual test results.
[ERROR] -> [Help 1]
org.apache.maven.lifecycle.LifecycleExecutionException: Failed to execute goal org.apache.maven.plugins:maven-surefire-plugin:2.5:test (default-test) on project cayenne-lifecycle: There are test failures.

Please refer to <https://builds.apache.org/job/cayenne-master/cayenneTestConnection=derby,jdk=JDK%201.8%20(latest),slave=ubuntu/ws/cayenne-lifecycle/target/surefire-reports> for the individual test results.
	at org.apache.maven.lifecycle.internal.MojoExecutor.execute(MojoExecutor.java:212)
	at org.apache.maven.lifecycle.internal.MojoExecutor.execute(MojoExecutor.java:153)
	at org.apache.maven.lifecycle.internal.MojoExecutor.execute(MojoExecutor.java:145)
	at org.apache.maven.lifecycle.internal.LifecycleModuleBuilder.buildProject(LifecycleModuleBuilder.java:116)
	at org.apache.maven.lifecycle.internal.LifecycleModuleBuilder.buildProject(LifecycleModuleBuilder.java:80)
	at org.apache.maven.lifecycle.internal.builder.singlethreaded.SingleThreadedBuilder.build(SingleThreadedBuilder.java:51)
	at org.apache.maven.lifecycle.internal.LifecycleStarter.execute(LifecycleStarter.java:128)
	at org.apache.maven.DefaultMaven.doExecute(DefaultMaven.java:307)
	at org.apache.maven.DefaultMaven.doExecute(DefaultMaven.java:193)
	at org.apache.maven.DefaultMaven.execute(DefaultMaven.java:106)
	at org.apache.maven.cli.MavenCli.execute(MavenCli.java:863)
	at org.apache.maven.cli.MavenCli.doMain(MavenCli.java:288)
	at org.apache.maven.cli.MavenCli.main(MavenCli.java:199)
	at sun.reflect.NativeMethodAccessorImpl.invoke0(Native Method)
	at sun.reflect.NativeMethodAccessorImpl.invoke(NativeMethodAccessorImpl.java:62)
	at sun.reflect.DelegatingMethodAccessorImpl.invoke(DelegatingMethodAccessorImpl.java:43)
	at java.lang.reflect.Method.invoke(Method.java:498)
	at org.codehaus.plexus.classworlds.launcher.Launcher.launchEnhanced(Launcher.java:289)
	at org.codehaus.plexus.classworlds.launcher.Launcher.launch(Launcher.java:229)
	at org.codehaus.plexus.classworlds.launcher.Launcher.mainWithExitCode(Launcher.java:415)
	at org.codehaus.plexus.classworlds.launcher.Launcher.main(Launcher.java:356)
Caused by: org.apache.maven.plugin.MojoFailureException: There are test failures.

Please refer to <https://builds.apache.org/job/cayenne-master/cayenneTestConnection=derby,jdk=JDK%201.8%20(latest),slave=ubuntu/ws/cayenne-lifecycle/target/surefire-reports> for the individual test results.
	at org.apache.maven.plugin.surefire.SurefirePlugin.execute(SurefirePlugin.java:629)
	at org.apache.maven.plugin.DefaultBuildPluginManager.executeMojo(DefaultBuildPluginManager.java:134)
	at org.apache.maven.lifecycle.internal.MojoExecutor.execute(MojoExecutor.java:207)
	... 20 more
[ERROR] 
[ERROR] Re-run Maven using the -X switch to enable full debug logging.
[ERROR] 
[ERROR] For more information about the errors and possible solutions, please read the following articles:
[ERROR] [Help 1] http://cwiki.apache.org/confluence/display/MAVEN/MojoFailureException
[ERROR] 
[ERROR] After correcting the problems, you can resume the build with the command
[ERROR]   mvn <goals> -rf :cayenne-lifecycle
Build step 'Invoke top-level Maven targets' marked build as failure
Recording test results
Not sending mail to unregistered user stariy95@gmail.com
Not sending mail to unregistered user andrus@objectstyle.com
Not sending mail to unregistered user maks1464@gmail.com
Not sending mail to unregistered user drekoas@gmail.com