You are viewing a plain text version of this content. The canonical link for it is here.
Posted to dev@pdfbox.apache.org by Apache Jenkins Server <je...@builds.apache.org> on 2023/10/19 06:37:13 UTC

Build failed in Jenkins: PDFBox » PDFBox-3.0.x #72

See <https://ci-builds.apache.org/job/PDFBox/job/PDFBox-3.0.x/72/display/redirect>

Changes:


------------------------------------------
Started by an SCM change
Running as SYSTEM
[EnvInject] - Loading node environment variables.
Building remotely on builds56 (ubuntu) in workspace <https://ci-builds.apache.org/job/PDFBox/job/PDFBox-3.0.x/ws/>
Cleaning up <https://ci-builds.apache.org/job/PDFBox/job/PDFBox-3.0.x/ws/.>
Updating http://svn.apache.org/repos/asf/pdfbox/branches/3.0 at revision '2023-10-19T06:37:09.690 +0000' --quiet
ERROR: Failed to update http://svn.apache.org/repos/asf/pdfbox/branches/3.0
org.tmatesoft.svn.core.SVNException: svn: E200030: FULL
	at org.tmatesoft.svn.core.internal.wc.SVNErrorManager.error(SVNErrorManager.java:70)
	at org.tmatesoft.svn.core.internal.wc.SVNErrorManager.error(SVNErrorManager.java:57)
	at org.tmatesoft.svn.core.internal.db.SVNSqlJetDb.createSqlJetError(SVNSqlJetDb.java:195)
	at org.tmatesoft.svn.core.internal.db.SVNSqlJetDb.beginTransaction(SVNSqlJetDb.java:211)
	at org.tmatesoft.svn.core.internal.db.SVNSqlJetDb.runTransaction(SVNSqlJetDb.java:257)
	at org.tmatesoft.svn.core.internal.db.SVNSqlJetDb.runTransaction(SVNSqlJetDb.java:252)
	at org.tmatesoft.svn.core.internal.wc17.db.SVNWCDb.obtainWCLock(SVNWCDb.java:5867)
	at org.tmatesoft.svn.core.internal.wc17.SVNWCContext.acquireWriteLock(SVNWCContext.java:1652)
	at org.tmatesoft.svn.core.internal.wc2.ng.SvnNgAbstractUpdate.update(SvnNgAbstractUpdate.java:110)
	at org.tmatesoft.svn.core.internal.wc2.ng.SvnNgUpdate.run(SvnNgUpdate.java:40)
	at org.tmatesoft.svn.core.internal.wc2.ng.SvnNgUpdate.run(SvnNgUpdate.java:18)
	at org.tmatesoft.svn.core.internal.wc2.ng.SvnNgOperationRunner.run(SvnNgOperationRunner.java:20)
	at org.tmatesoft.svn.core.internal.wc2.SvnOperationRunner.run(SvnOperationRunner.java:21)
	at org.tmatesoft.svn.core.wc2.SvnOperationFactory.run(SvnOperationFactory.java:1239)
	at org.tmatesoft.svn.core.wc2.SvnOperation.run(SvnOperation.java:294)
	at org.tmatesoft.svn.core.wc.SVNUpdateClient.doUpdate(SVNUpdateClient.java:311)
	at org.tmatesoft.svn.core.wc.SVNUpdateClient.doUpdate(SVNUpdateClient.java:291)
	at org.tmatesoft.svn.core.wc.SVNUpdateClient.doUpdate(SVNUpdateClient.java:387)
	at hudson.scm.subversion.UpdateUpdater$TaskImpl.perform(UpdateUpdater.java:165)
	at hudson.scm.subversion.WorkspaceUpdater$UpdateTask.delegateTo(WorkspaceUpdater.java:168)
	at hudson.scm.SubversionSCM$CheckOutUpdateTask.perform(SubversionSCM.java:1086)
	at hudson.scm.SubversionSCM$CheckOutUpdateTask.run(SubversionSCM.java:1067)
	at hudson.scm.SubversionSCM$CheckOutTask.invoke(SubversionSCM.java:1037)
	at hudson.scm.SubversionSCM$CheckOutTask.invoke(SubversionSCM.java:1020)
	at hudson.FilePath$FileCallableWrapper.call(FilePath.java:3578)
	at hudson.remoting.UserRequest.perform(UserRequest.java:211)
	at hudson.remoting.UserRequest.perform(UserRequest.java:54)
	at hudson.remoting.Request$2.run(Request.java:377)
	at hudson.remoting.InterceptingExecutorService.lambda$wrap$0(InterceptingExecutorService.java:78)
	at java.base/java.util.concurrent.FutureTask.run(FutureTask.java:264)
	at java.base/java.util.concurrent.ThreadPoolExecutor.runWorker(ThreadPoolExecutor.java:1128)
	at java.base/java.util.concurrent.ThreadPoolExecutor$Worker.run(ThreadPoolExecutor.java:628)
	at java.base/java.lang.Thread.run(Thread.java:829)
Caused by: org.tmatesoft.sqljet.core.SqlJetException: FULL: error code is FULL
	at org.tmatesoft.sqljet.core.internal.pager.SqlJetPager.openJournal(SqlJetPager.java:3044)
	at org.tmatesoft.sqljet.core.internal.pager.SqlJetPager.begin(SqlJetPager.java:2775)
	at org.tmatesoft.sqljet.core.internal.btree.SqlJetBtree.beginTrans(SqlJetBtree.java:931)
	at org.tmatesoft.sqljet.core.table.engine.SqlJetEngine.doBeginTransaction(SqlJetEngine.java:561)
	at org.tmatesoft.sqljet.core.table.engine.SqlJetEngine.access$100(SqlJetEngine.java:55)
	at org.tmatesoft.sqljet.core.table.engine.SqlJetEngine$9.runSynchronized(SqlJetEngine.java:475)
	at org.tmatesoft.sqljet.core.table.engine.SqlJetEngine.runSynchronized(SqlJetEngine.java:217)
	at org.tmatesoft.sqljet.core.table.engine.SqlJetEngine.beginTransaction(SqlJetEngine.java:471)
	at org.tmatesoft.svn.core.internal.db.SVNSqlJetDb.beginTransaction(SVNSqlJetDb.java:206)
	... 29 more
ERROR: Subversion update failed
org.tmatesoft.sqljet.core.SqlJetException: FULL: error code is FULL
	at org.tmatesoft.sqljet.core.internal.pager.SqlJetPager.openJournal(SqlJetPager.java:3044)
	at org.tmatesoft.sqljet.core.internal.pager.SqlJetPager.begin(SqlJetPager.java:2775)
	at org.tmatesoft.sqljet.core.internal.btree.SqlJetBtree.beginTrans(SqlJetBtree.java:931)
	at org.tmatesoft.sqljet.core.table.engine.SqlJetEngine.doBeginTransaction(SqlJetEngine.java:561)
	at org.tmatesoft.sqljet.core.table.engine.SqlJetEngine.access$100(SqlJetEngine.java:55)
	at org.tmatesoft.sqljet.core.table.engine.SqlJetEngine$9.runSynchronized(SqlJetEngine.java:475)
	at org.tmatesoft.sqljet.core.table.engine.SqlJetEngine.runSynchronized(SqlJetEngine.java:217)
	at org.tmatesoft.sqljet.core.table.engine.SqlJetEngine.beginTransaction(SqlJetEngine.java:471)
	at org.tmatesoft.svn.core.internal.db.SVNSqlJetDb.beginTransaction(SVNSqlJetDb.java:206)
Caused: org.tmatesoft.svn.core.SVNException: svn: E200030: FULL
	at org.tmatesoft.svn.core.internal.wc.SVNErrorManager.error(SVNErrorManager.java:70)
	at org.tmatesoft.svn.core.internal.wc.SVNErrorManager.error(SVNErrorManager.java:57)
	at org.tmatesoft.svn.core.internal.db.SVNSqlJetDb.createSqlJetError(SVNSqlJetDb.java:195)
	at org.tmatesoft.svn.core.internal.db.SVNSqlJetDb.beginTransaction(SVNSqlJetDb.java:211)
	at org.tmatesoft.svn.core.internal.db.SVNSqlJetDb.runTransaction(SVNSqlJetDb.java:257)
	at org.tmatesoft.svn.core.internal.db.SVNSqlJetDb.runTransaction(SVNSqlJetDb.java:252)
	at org.tmatesoft.svn.core.internal.wc17.db.SVNWCDb.obtainWCLock(SVNWCDb.java:5867)
	at org.tmatesoft.svn.core.internal.wc17.SVNWCContext.acquireWriteLock(SVNWCContext.java:1652)
	at org.tmatesoft.svn.core.internal.wc2.ng.SvnNgAbstractUpdate.update(SvnNgAbstractUpdate.java:110)
	at org.tmatesoft.svn.core.internal.wc2.ng.SvnNgUpdate.run(SvnNgUpdate.java:40)
	at org.tmatesoft.svn.core.internal.wc2.ng.SvnNgUpdate.run(SvnNgUpdate.java:18)
	at org.tmatesoft.svn.core.internal.wc2.ng.SvnNgOperationRunner.run(SvnNgOperationRunner.java:20)
	at org.tmatesoft.svn.core.internal.wc2.SvnOperationRunner.run(SvnOperationRunner.java:21)
	at org.tmatesoft.svn.core.wc2.SvnOperationFactory.run(SvnOperationFactory.java:1239)
	at org.tmatesoft.svn.core.wc2.SvnOperation.run(SvnOperation.java:294)
	at org.tmatesoft.svn.core.wc.SVNUpdateClient.doUpdate(SVNUpdateClient.java:311)
	at org.tmatesoft.svn.core.wc.SVNUpdateClient.doUpdate(SVNUpdateClient.java:291)
	at org.tmatesoft.svn.core.wc.SVNUpdateClient.doUpdate(SVNUpdateClient.java:387)
	at hudson.scm.subversion.UpdateUpdater$TaskImpl.perform(UpdateUpdater.java:165)
Caused: hudson.scm.subversion.UpdaterException: failed to perform svn update
Also:   hudson.remoting.Channel$CallSiteStackTrace: Remote call to builds56
		at hudson.remoting.Channel.attachCallSiteStackTrace(Channel.java:1784)
		at hudson.remoting.UserRequest$ExceptionResponse.retrieve(UserRequest.java:356)
		at hudson.remoting.Channel.call(Channel.java:1000)
		at hudson.FilePath.act(FilePath.java:1192)
		at hudson.FilePath.act(FilePath.java:1181)
		at hudson.scm.SubversionSCM.checkout(SubversionSCM.java:970)
		at hudson.scm.SubversionSCM.checkout(SubversionSCM.java:892)
		at hudson.scm.SCM.checkout(SCM.java:540)
		at hudson.model.AbstractProject.checkout(AbstractProject.java:1240)
		at hudson.model.AbstractBuild$AbstractBuildExecution.defaultCheckout(AbstractBuild.java:649)
		at jenkins.scm.SCMCheckoutStrategy.checkout(SCMCheckoutStrategy.java:85)
		at hudson.model.AbstractBuild$AbstractBuildExecution.run(AbstractBuild.java:521)
		at hudson.model.Run.execute(Run.java:1900)
		at hudson.maven.MavenModuleSetBuild.run(MavenModuleSetBuild.java:543)
		at hudson.model.ResourceController.execute(ResourceController.java:101)
		at hudson.model.Executor.run(Executor.java:442)
Caused: java.io.IOException
	at hudson.scm.subversion.UpdateUpdater$TaskImpl.perform(UpdateUpdater.java:220)
	at hudson.scm.subversion.WorkspaceUpdater$UpdateTask.delegateTo(WorkspaceUpdater.java:168)
	at hudson.scm.SubversionSCM$CheckOutUpdateTask.perform(SubversionSCM.java:1086)
	at hudson.scm.SubversionSCM$CheckOutUpdateTask.run(SubversionSCM.java:1067)
	at hudson.scm.SubversionSCM$CheckOutTask.invoke(SubversionSCM.java:1037)
	at hudson.scm.SubversionSCM$CheckOutTask.invoke(SubversionSCM.java:1020)
	at hudson.FilePath$FileCallableWrapper.call(FilePath.java:3578)
	at hudson.remoting.UserRequest.perform(UserRequest.java:211)
	at hudson.remoting.UserRequest.perform(UserRequest.java:54)
	at hudson.remoting.Request$2.run(Request.java:377)
	at hudson.remoting.InterceptingExecutorService.lambda$wrap$0(InterceptingExecutorService.java:78)
	at java.base/java.util.concurrent.FutureTask.run(FutureTask.java:264)
	at java.base/java.util.concurrent.ThreadPoolExecutor.runWorker(ThreadPoolExecutor.java:1128)
	at java.base/java.util.concurrent.ThreadPoolExecutor$Worker.run(ThreadPoolExecutor.java:628)
	at java.base/java.lang.Thread.run(Thread.java:829)
Archiving artifacts

---------------------------------------------------------------------
To unsubscribe, e-mail: dev-unsubscribe@pdfbox.apache.org
For additional commands, e-mail: dev-help@pdfbox.apache.org


Jenkins build is back to normal : PDFBox » PDFBox-3.0.x #75

Posted by Apache Jenkins Server <je...@builds.apache.org>.
See <https://ci-builds.apache.org/job/PDFBox/job/PDFBox-3.0.x/75/display/redirect?page=changes>


---------------------------------------------------------------------
To unsubscribe, e-mail: dev-unsubscribe@pdfbox.apache.org
For additional commands, e-mail: dev-help@pdfbox.apache.org


Build failed in Jenkins: PDFBox » PDFBox-3.0.x #74

Posted by Apache Jenkins Server <je...@builds.apache.org>.
See <https://ci-builds.apache.org/job/PDFBox/job/PDFBox-3.0.x/74/display/redirect>

Changes:


------------------------------------------
[...truncated 3.78 MB...]
[INFO] Analyzed bundle 'Apache PDFBox examples' with 99 classes
[INFO] 
[INFO] --- animal-sniffer-maven-plugin:1.23:check (check-java-version) @ pdfbox-examples ---
[INFO] Checking unresolved references to org.codehaus.mojo.signature:java18:1.0
[INFO] 
[INFO] --- maven-jar-plugin:3.3.0:jar (default-jar) @ pdfbox-examples ---
[INFO] Building jar: <https://ci-builds.apache.org/job/PDFBox/job/PDFBox-3.0.x/ws/examples/target/pdfbox-examples-3.0.1-SNAPSHOT.jar>
[INFO] 
[INFO] --- maven-site-plugin:3.12.1:attach-descriptor (attach-descriptor) @ pdfbox-examples ---
[INFO] Skipping because packaging 'jar' is not pom.
[INFO] 
[INFO] >>> maven-source-plugin:3.2.1:jar (attach-sources) > generate-sources @ pdfbox-examples >>>
[INFO] 
[INFO] --- maven-enforcer-plugin:3.4.1:enforce (default) @ pdfbox-examples ---
[INFO] 
[INFO] --- maven-enforcer-plugin:3.4.1:enforce (enforce-maven-version) @ pdfbox-examples ---
[INFO] 
[INFO] --- maven-enforcer-plugin:3.4.1:enforce (enforce-java-version) @ pdfbox-examples ---
[INFO] 
[INFO] --- jacoco-maven-plugin:0.8.11:prepare-agent (default) @ pdfbox-examples ---
[INFO] surefireArgLine set to -javaagent:/home/jenkins/.m2/repository/org/jacoco/org.jacoco.agent/0.8.11/org.jacoco.agent-0.8.11-runtime.jar=destfile=<https://ci-builds.apache.org/job/PDFBox/job/PDFBox-3.0.x/ws/examples/target/jacoco.exec>
[WARNING] Failed to getClass for org.apache.maven.plugins.source.SourceJarMojo
[INFO] 
[INFO] <<< maven-source-plugin:3.2.1:jar (attach-sources) < generate-sources @ pdfbox-examples <<<
[INFO] 
[INFO] 
[INFO] --- maven-source-plugin:3.2.1:jar (attach-sources) @ pdfbox-examples ---
[INFO] Skipping source per configuration.
[INFO] 
[INFO] --- apache-rat-plugin:0.15:check (default) @ pdfbox-examples ---
[INFO] Enabled default license matchers.
[INFO] Will parse SCM ignores for exclusions...
[INFO] Finished adding exclusions from SCM ignore files.
[INFO] 62 implicit excludes.
[INFO] 2 explicit excludes.
[INFO] 118 resources included
[INFO] Rat check: Summary over all files. Unapproved: 0, unknown: 0, generated: 0, approved: 111 licenses.
[INFO] 
[INFO] --- dependency-check-maven:8.4.0:check (default) @ pdfbox-examples ---
[INFO] Checking for updates
[INFO] Skipping NVD check since last check was within 4 hours.
[INFO] Skipping RetireJS update since last update was within 24 hours.
[INFO] Skipping Hosted Suppressions file update since last update was within 2 hours.
[INFO] Skipping Known Exploited Vulnerabilities update check since last check was within 24 hours.
[INFO] Check for updates complete (70 ms)
[INFO] 

Dependency-Check is an open source tool performing a best effort analysis of 3rd party dependencies; false positives and false negatives may exist in the analysis performed by the tool. Use of the tool and the reporting provided constitutes acceptance for use in an AS IS condition, and there are NO warranties, implied or otherwise, with regard to the analysis or its use. Any use of the tool and the reporting provided is at the user?s risk. In no event shall the copyright holder or OWASP be held liable for any damages whatsoever arising out of or in connection with the use of this tool, the analysis performed, or the resulting report.


   About ODC: https://jeremylong.github.io/DependencyCheck/general/internals.html
   False Positives: https://jeremylong.github.io/DependencyCheck/general/suppression.html

? Sponsor: https://github.com/sponsors/jeremylong


[INFO] Analysis Started
[INFO] Finished Archive Analyzer (0 seconds)
[INFO] Finished File Name Analyzer (0 seconds)
[INFO] Finished Jar Analyzer (0 seconds)
[INFO] Finished Dependency Merging Analyzer (0 seconds)
[INFO] Finished Hint Analyzer (0 seconds)
[INFO] Finished Version Filter Analyzer (0 seconds)
[INFO] Created CPE Index (2 seconds)
[INFO] Finished CPE Analyzer (2 seconds)
[INFO] Finished False Positive Analyzer (0 seconds)
[INFO] Finished NVD CVE Analyzer (0 seconds)
[INFO] Finished Sonatype OSS Index Analyzer (0 seconds)
[INFO] Finished Vulnerability Suppression Analyzer (0 seconds)
[INFO] Finished Known Exploited Vulnerability Analyzer (0 seconds)
[INFO] Finished Dependency Bundling Analyzer (0 seconds)
[INFO] Finished Unused Suppression Rule Analyzer (0 seconds)
[INFO] Analysis Complete (3 seconds)
[INFO] Writing report to: <https://ci-builds.apache.org/job/PDFBox/job/PDFBox-3.0.x/ws/examples/target/dependency-check-report.html>
[INFO] 
[INFO] --- maven-install-plugin:3.1.0:install (default-install) @ pdfbox-examples ---
[INFO] Installing <https://ci-builds.apache.org/job/PDFBox/job/PDFBox-3.0.x/ws/examples/pom.xml> to /home/jenkins/.m2/repository/org/apache/pdfbox/pdfbox-examples/3.0.1-SNAPSHOT/pdfbox-examples-3.0.1-SNAPSHOT.pom
[INFO] Installing <https://ci-builds.apache.org/job/PDFBox/job/PDFBox-3.0.x/ws/examples/target/pdfbox-examples-3.0.1-SNAPSHOT.jar> to /home/jenkins/.m2/repository/org/apache/pdfbox/pdfbox-examples/3.0.1-SNAPSHOT/pdfbox-examples-3.0.1-SNAPSHOT.jar
[INFO] 
[INFO] --- maven-deploy-plugin:2.8.2:deploy (default-deploy) @ pdfbox-examples ---
[INFO] Downloading from apache.snapshots.https: https://repository.apache.org/content/repositories/snapshots/org/apache/pdfbox/pdfbox-examples/3.0.1-SNAPSHOT/maven-metadata.xml
[INFO] Downloaded from apache.snapshots.https: https://repository.apache.org/content/repositories/snapshots/org/apache/pdfbox/pdfbox-examples/3.0.1-SNAPSHOT/maven-metadata.xml (785 B at 1.0 kB/s)
[INFO] Uploading to apache.snapshots.https: https://repository.apache.org/content/repositories/snapshots/org/apache/pdfbox/pdfbox-examples/3.0.1-SNAPSHOT/pdfbox-examples-3.0.1-20231019.101452-36.jar
[INFO] Uploaded to apache.snapshots.https: https://repository.apache.org/content/repositories/snapshots/org/apache/pdfbox/pdfbox-examples/3.0.1-SNAPSHOT/pdfbox-examples-3.0.1-20231019.101452-36.jar (385 kB at 228 kB/s)
[INFO] Uploading to apache.snapshots.https: https://repository.apache.org/content/repositories/snapshots/org/apache/pdfbox/pdfbox-examples/3.0.1-SNAPSHOT/pdfbox-examples-3.0.1-20231019.101452-36.pom
[INFO] Uploaded to apache.snapshots.https: https://repository.apache.org/content/repositories/snapshots/org/apache/pdfbox/pdfbox-examples/3.0.1-SNAPSHOT/pdfbox-examples-3.0.1-20231019.101452-36.pom (6.6 kB at 6.5 kB/s)
[INFO] Downloading from apache.snapshots.https: https://repository.apache.org/content/repositories/snapshots/org/apache/pdfbox/pdfbox-examples/maven-metadata.xml
[INFO] Downloaded from apache.snapshots.https: https://repository.apache.org/content/repositories/snapshots/org/apache/pdfbox/pdfbox-examples/maven-metadata.xml (474 B at 1.4 kB/s)
[INFO] Uploading to apache.snapshots.https: https://repository.apache.org/content/repositories/snapshots/org/apache/pdfbox/pdfbox-examples/3.0.1-SNAPSHOT/maven-metadata.xml
[INFO] Uploaded to apache.snapshots.https: https://repository.apache.org/content/repositories/snapshots/org/apache/pdfbox/pdfbox-examples/3.0.1-SNAPSHOT/maven-metadata.xml (785 B at 400 B/s)
[INFO] Uploading to apache.snapshots.https: https://repository.apache.org/content/repositories/snapshots/org/apache/pdfbox/pdfbox-examples/maven-metadata.xml
[INFO] Uploaded to apache.snapshots.https: https://repository.apache.org/content/repositories/snapshots/org/apache/pdfbox/pdfbox-examples/maven-metadata.xml (474 B at 468 B/s)
[INFO] 
[INFO] --- ossindex-maven-plugin:3.2.0:audit (default-cli) @ pdfbox-examples ---
[INFO] Checking for vulnerabilities; 31 artifacts
[INFO] Exclude coordinates: []
[INFO] Exclude vulnerability identifiers: []
[INFO] CVSS-score threshold: 0.0
[INFO] 
[INFO] ------------------< org.apache.pdfbox:pdfbox-reactor >------------------
[INFO] Building Apache PDFBox 3.0.1-SNAPSHOT                            [13/13]
[INFO] --------------------------------[ pom ]---------------------------------
[INFO] 
[INFO] --- maven-clean-plugin:3.2.0:clean (default-clean) @ pdfbox-reactor ---
[INFO] 
[INFO] --- maven-enforcer-plugin:3.4.1:enforce (default) @ pdfbox-reactor ---
[INFO] 
[INFO] --- maven-enforcer-plugin:3.4.1:enforce (enforce-maven-version) @ pdfbox-reactor ---
[INFO] 
[INFO] --- maven-enforcer-plugin:3.4.1:enforce (enforce-java-version) @ pdfbox-reactor ---
[INFO] 
[INFO] --- jacoco-maven-plugin:0.8.11:prepare-agent (default) @ pdfbox-reactor ---
[INFO] surefireArgLine set to -javaagent:/home/jenkins/.m2/repository/org/jacoco/org.jacoco.agent/0.8.11/org.jacoco.agent-0.8.11-runtime.jar=destfile=<https://ci-builds.apache.org/job/PDFBox/job/PDFBox-3.0.x/ws/target/jacoco.exec>
[INFO] 
[INFO] --- maven-remote-resources-plugin:1.7.0:process (process-resource-bundles) @ pdfbox-reactor ---
[INFO] Preparing remote bundle org.apache:apache-jar-resource-bundle:1.4
[INFO] Copying 3 resources from 1 bundle.
[INFO] 
[INFO] --- jacoco-maven-plugin:0.8.11:report (report) @ pdfbox-reactor ---
[INFO] Skipping JaCoCo execution due to missing execution data file.
[INFO] 
[INFO] --- animal-sniffer-maven-plugin:1.23:check (check-java-version) @ pdfbox-reactor ---
[INFO] Checking unresolved references to org.codehaus.mojo.signature:java18:1.0
[INFO] 
[INFO] --- maven-site-plugin:3.12.1:attach-descriptor (attach-descriptor) @ pdfbox-reactor ---
[INFO] No site descriptor found: nothing to attach.
[INFO] 
[INFO] >>> maven-source-plugin:3.2.1:jar (attach-sources) > generate-sources @ pdfbox-reactor >>>
[INFO] 
[INFO] --- maven-enforcer-plugin:3.4.1:enforce (default) @ pdfbox-reactor ---
[INFO] 
[INFO] --- maven-enforcer-plugin:3.4.1:enforce (enforce-maven-version) @ pdfbox-reactor ---
[INFO] 
[INFO] --- maven-enforcer-plugin:3.4.1:enforce (enforce-java-version) @ pdfbox-reactor ---
[INFO] 
[INFO] --- jacoco-maven-plugin:0.8.11:prepare-agent (default) @ pdfbox-reactor ---
[INFO] surefireArgLine set to -javaagent:/home/jenkins/.m2/repository/org/jacoco/org.jacoco.agent/0.8.11/org.jacoco.agent-0.8.11-runtime.jar=destfile=<https://ci-builds.apache.org/job/PDFBox/job/PDFBox-3.0.x/ws/target/jacoco.exec>
[WARNING] Failed to getClass for org.apache.maven.plugins.source.SourceJarMojo
[INFO] 
[INFO] <<< maven-source-plugin:3.2.1:jar (attach-sources) < generate-sources @ pdfbox-reactor <<<
[INFO] 
[INFO] 
[INFO] --- maven-source-plugin:3.2.1:jar (attach-sources) @ pdfbox-reactor ---
[INFO] Skipping source per configuration.
[INFO] 
[INFO] --- apache-rat-plugin:0.15:check (default) @ pdfbox-reactor ---
[INFO] Enabled default license matchers.
[INFO] Will parse SCM ignores for exclusions...
[INFO] Parsing exclusions from <https://ci-builds.apache.org/job/PDFBox/job/PDFBox-3.0.x/ws/.gitignore>
[INFO] Finished adding exclusions from SCM ignore files.
[INFO] 78 implicit excludes.
[INFO] 2 explicit excludes.
[INFO] 15 resources included
[INFO] Rat check: Summary over all files. Unapproved: 0, unknown: 0, generated: 0, approved: 11 licenses.
[INFO] 
[INFO] --- dependency-check-maven:8.4.0:check (default) @ pdfbox-reactor ---
[INFO] Checking for updates
[INFO] Skipping NVD check since last check was within 4 hours.
[INFO] Skipping RetireJS update since last update was within 24 hours.
[INFO] Skipping Hosted Suppressions file update since last update was within 2 hours.
[INFO] Skipping Known Exploited Vulnerabilities update check since last check was within 24 hours.
[INFO] Check for updates complete (62 ms)
[INFO] 

Dependency-Check is an open source tool performing a best effort analysis of 3rd party dependencies; false positives and false negatives may exist in the analysis performed by the tool. Use of the tool and the reporting provided constitutes acceptance for use in an AS IS condition, and there are NO warranties, implied or otherwise, with regard to the analysis or its use. Any use of the tool and the reporting provided is at the user?s risk. In no event shall the copyright holder or OWASP be held liable for any damages whatsoever arising out of or in connection with the use of this tool, the analysis performed, or the resulting report.


   About ODC: https://jeremylong.github.io/DependencyCheck/general/internals.html
   False Positives: https://jeremylong.github.io/DependencyCheck/general/suppression.html

? Sponsor: https://github.com/sponsors/jeremylong


[INFO] Analysis Started
[INFO] Finished File Name Analyzer (0 seconds)
[INFO] Finished Dependency Merging Analyzer (0 seconds)
[INFO] Finished Hint Analyzer (0 seconds)
[INFO] Finished Version Filter Analyzer (0 seconds)
[INFO] Created CPE Index (1 seconds)
[INFO] Finished CPE Analyzer (2 seconds)
[INFO] Finished False Positive Analyzer (0 seconds)
[INFO] Finished NVD CVE Analyzer (0 seconds)
[INFO] Finished Sonatype OSS Index Analyzer (0 seconds)
[INFO] Finished Vulnerability Suppression Analyzer (0 seconds)
[INFO] Finished Known Exploited Vulnerability Analyzer (0 seconds)
[INFO] Finished Dependency Bundling Analyzer (0 seconds)
[INFO] Finished Unused Suppression Rule Analyzer (0 seconds)
[INFO] Analysis Complete (2 seconds)
[INFO] Writing report to: <https://ci-builds.apache.org/job/PDFBox/job/PDFBox-3.0.x/ws/target/dependency-check-report.html>
[INFO] 
[INFO] --- maven-install-plugin:3.1.0:install (default-install) @ pdfbox-reactor ---
[INFO] Installing <https://ci-builds.apache.org/job/PDFBox/job/PDFBox-3.0.x/ws/pom.xml> to /home/jenkins/.m2/repository/org/apache/pdfbox/pdfbox-reactor/3.0.1-SNAPSHOT/pdfbox-reactor-3.0.1-SNAPSHOT.pom
[INFO] 
[INFO] --- maven-deploy-plugin:2.8.2:deploy (default-deploy) @ pdfbox-reactor ---
[INFO] Skipping artifact deployment
[INFO] 
[INFO] --- ossindex-maven-plugin:3.2.0:audit (default-cli) @ pdfbox-reactor ---
[INFO] Skipping; POM module
[INFO] ------------------------------------------------------------------------
[INFO] Reactor Summary for Apache PDFBox 3.0.1-SNAPSHOT:
[INFO] 
[INFO] PDFBox parent ...................................... SUCCESS [03:44 min]
[INFO] Apache PDFBox io ................................... SUCCESS [ 58.629 s]
[INFO] Apache FontBox ..................................... SUCCESS [ 49.055 s]
[INFO] Apache XmpBox ...................................... SUCCESS [ 28.887 s]
[INFO] Apache PDFBox ...................................... SUCCESS [01:49 min]
[INFO] Apache Preflight ................................... SUCCESS [01:15 min]
[INFO] Apache Preflight application ....................... SUCCESS [ 30.239 s]
[INFO] Apache PDFBox Debugger ............................. SUCCESS [ 25.018 s]
[INFO] Apache PDFBox tools ................................ SUCCESS [ 34.899 s]
[INFO] Apache PDFBox application .......................... SUCCESS [ 30.344 s]
[INFO] Apache PDFBox Debugger application ................. SUCCESS [ 28.710 s]
[INFO] Apache PDFBox examples ............................. SUCCESS [ 58.929 s]
[INFO] Apache PDFBox ...................................... SUCCESS [ 10.608 s]
[INFO] ------------------------------------------------------------------------
[INFO] BUILD SUCCESS
[INFO] ------------------------------------------------------------------------
[INFO] Total time:  13:49 min
[INFO] Finished at: 2023-10-19T10:28:42Z
[INFO] ------------------------------------------------------------------------
Waiting for Jenkins to finish collecting data
[JENKINS] Archiving <https://ci-builds.apache.org/job/PDFBox/job/PDFBox-3.0.x/ws/examples/pom.xml> to org.apache.pdfbox/pdfbox-examples/3.0.1-SNAPSHOT/pdfbox-examples-3.0.1-SNAPSHOT.pom
[JENKINS] Archiving <https://ci-builds.apache.org/job/PDFBox/job/PDFBox-3.0.x/ws/examples/target/pdfbox-examples-3.0.1-SNAPSHOT.jar> to org.apache.pdfbox/pdfbox-examples/3.0.1-20231019.101452-36/pdfbox-examples-3.0.1-20231019.101452-36.jar
[JENKINS] Archiving <https://ci-builds.apache.org/job/PDFBox/job/PDFBox-3.0.x/ws/parent/pom.xml> to org.apache.pdfbox/pdfbox-parent/3.0.1-SNAPSHOT/pdfbox-parent-3.0.1-SNAPSHOT.pom
[JENKINS] Archiving <https://ci-builds.apache.org/job/PDFBox/job/PDFBox-3.0.x/ws/pdfbox/pom.xml> to org.apache.pdfbox/pdfbox/3.0.1-SNAPSHOT/pdfbox-3.0.1-SNAPSHOT.pom
[JENKINS] Archiving <https://ci-builds.apache.org/job/PDFBox/job/PDFBox-3.0.x/ws/pdfbox/target/pdfbox-3.0.1-SNAPSHOT.jar> to org.apache.pdfbox/pdfbox/3.0.1-20231019.101452-38/pdfbox-3.0.1-20231019.101452-38.jar
[JENKINS] Archiving <https://ci-builds.apache.org/job/PDFBox/job/PDFBox-3.0.x/ws/debugger-app/pom.xml> to org.apache.pdfbox/debugger-app/3.0.1-SNAPSHOT/debugger-app-3.0.1-SNAPSHOT.pom
[JENKINS] Archiving <https://ci-builds.apache.org/job/PDFBox/job/PDFBox-3.0.x/ws/debugger-app/target/debugger-app-3.0.1-SNAPSHOT.jar> to org.apache.pdfbox/debugger-app/3.0.1-20231019.101452-36/debugger-app-3.0.1-20231019.101452-36.jar
[JENKINS] Archiving <https://ci-builds.apache.org/job/PDFBox/job/PDFBox-3.0.x/ws/io/pom.xml> to org.apache.pdfbox/pdfbox-io/3.0.1-SNAPSHOT/pdfbox-io-3.0.1-SNAPSHOT.pom
[JENKINS] Archiving <https://ci-builds.apache.org/job/PDFBox/job/PDFBox-3.0.x/ws/io/target/pdfbox-io-3.0.1-SNAPSHOT.jar> to org.apache.pdfbox/pdfbox-io/3.0.1-20231019.101452-63/pdfbox-io-3.0.1-20231019.101452-63.jar
[JENKINS] Archiving <https://ci-builds.apache.org/job/PDFBox/job/PDFBox-3.0.x/ws/fontbox/pom.xml> to org.apache.pdfbox/fontbox/3.0.1-SNAPSHOT/fontbox-3.0.1-SNAPSHOT.pom
[JENKINS] Archiving <https://ci-builds.apache.org/job/PDFBox/job/PDFBox-3.0.x/ws/fontbox/target/fontbox-3.0.1-SNAPSHOT.jar> to org.apache.pdfbox/fontbox/3.0.1-20231019.101452-63/fontbox-3.0.1-20231019.101452-63.jar
[JENKINS] Archiving <https://ci-builds.apache.org/job/PDFBox/job/PDFBox-3.0.x/ws/xmpbox/pom.xml> to org.apache.pdfbox/xmpbox/3.0.1-SNAPSHOT/xmpbox-3.0.1-SNAPSHOT.pom
[JENKINS] Archiving <https://ci-builds.apache.org/job/PDFBox/job/PDFBox-3.0.x/ws/xmpbox/target/xmpbox-3.0.1-SNAPSHOT.jar> to org.apache.pdfbox/xmpbox/3.0.1-20231019.101452-62/xmpbox-3.0.1-20231019.101452-62.jar
[JENKINS] Archiving <https://ci-builds.apache.org/job/PDFBox/job/PDFBox-3.0.x/ws/tools/pom.xml> to org.apache.pdfbox/pdfbox-tools/3.0.1-SNAPSHOT/pdfbox-tools-3.0.1-SNAPSHOT.pom
[JENKINS] Archiving <https://ci-builds.apache.org/job/PDFBox/job/PDFBox-3.0.x/ws/tools/target/pdfbox-tools-3.0.1-SNAPSHOT.jar> to org.apache.pdfbox/pdfbox-tools/3.0.1-20231019.101452-36/pdfbox-tools-3.0.1-20231019.101452-36.jar
[JENKINS] Archiving <https://ci-builds.apache.org/job/PDFBox/job/PDFBox-3.0.x/ws/debugger/pom.xml> to org.apache.pdfbox/pdfbox-debugger/3.0.1-SNAPSHOT/pdfbox-debugger-3.0.1-SNAPSHOT.pom
[JENKINS] Archiving <https://ci-builds.apache.org/job/PDFBox/job/PDFBox-3.0.x/ws/debugger/target/pdfbox-debugger-3.0.1-SNAPSHOT.jar> to org.apache.pdfbox/pdfbox-debugger/3.0.1-20231019.101452-36/pdfbox-debugger-3.0.1-20231019.101452-36.jar
[JENKINS] Archiving <https://ci-builds.apache.org/job/PDFBox/job/PDFBox-3.0.x/ws/preflight-app/pom.xml> to org.apache.pdfbox/preflight-app/3.0.1-SNAPSHOT/preflight-app-3.0.1-SNAPSHOT.pom
[JENKINS] Archiving <https://ci-builds.apache.org/job/PDFBox/job/PDFBox-3.0.x/ws/preflight-app/target/preflight-app-3.0.1-SNAPSHOT.jar> to org.apache.pdfbox/preflight-app/3.0.1-20231019.101452-36/preflight-app-3.0.1-20231019.101452-36.jar
[JENKINS] Archiving <https://ci-builds.apache.org/job/PDFBox/job/PDFBox-3.0.x/ws/app/pom.xml> to org.apache.pdfbox/pdfbox-app/3.0.1-SNAPSHOT/pdfbox-app-3.0.1-SNAPSHOT.pom
[JENKINS] Archiving <https://ci-builds.apache.org/job/PDFBox/job/PDFBox-3.0.x/ws/app/target/pdfbox-app-3.0.1-SNAPSHOT.jar> to org.apache.pdfbox/pdfbox-app/3.0.1-20231019.101452-36/pdfbox-app-3.0.1-20231019.101452-36.jar
[JENKINS] Archiving <https://ci-builds.apache.org/job/PDFBox/job/PDFBox-3.0.x/ws/preflight/pom.xml> to org.apache.pdfbox/preflight/3.0.1-SNAPSHOT/preflight-3.0.1-SNAPSHOT.pom
[JENKINS] Archiving <https://ci-builds.apache.org/job/PDFBox/job/PDFBox-3.0.x/ws/preflight/target/preflight-3.0.1-SNAPSHOT.jar> to org.apache.pdfbox/preflight/3.0.1-20231019.101452-36/preflight-3.0.1-20231019.101452-36.jar
[JENKINS] Archiving <https://ci-builds.apache.org/job/PDFBox/job/PDFBox-3.0.x/ws/pom.xml> to org.apache.pdfbox/pdfbox-reactor/3.0.1-SNAPSHOT/pdfbox-reactor-3.0.1-SNAPSHOT.pom
channel stopped
Archiving artifacts
?pdfbox/target/pdfbox.log? doesn?t match anything: ?pdfbox? exists but not ?pdfbox/target/pdfbox.log?
ERROR: Step ?Archive the artifacts? failed: No artifacts found that match the file pattern "pdfbox/target/pdfbox.log". Configuration error?

---------------------------------------------------------------------
To unsubscribe, e-mail: dev-unsubscribe@pdfbox.apache.org
For additional commands, e-mail: dev-help@pdfbox.apache.org


Build failed in Jenkins: PDFBox » PDFBox-3.0.x #73

Posted by Apache Jenkins Server <je...@builds.apache.org>.
See <https://ci-builds.apache.org/job/PDFBox/job/PDFBox-3.0.x/73/display/redirect>

Changes:


------------------------------------------
Started by user Tilman Hausherr
Running as SYSTEM
[EnvInject] - Loading node environment variables.
Building remotely on builds56 (ubuntu) in workspace <https://ci-builds.apache.org/job/PDFBox/job/PDFBox-3.0.x/ws/>
Cleaning up <https://ci-builds.apache.org/job/PDFBox/job/PDFBox-3.0.x/ws/.>
Updating http://svn.apache.org/repos/asf/pdfbox/branches/3.0 at revision '2023-10-19T06:44:57.415 +0000' --quiet
ERROR: Failed to update http://svn.apache.org/repos/asf/pdfbox/branches/3.0
org.tmatesoft.svn.core.SVNException: svn: E200030: FULL
	at org.tmatesoft.svn.core.internal.wc.SVNErrorManager.error(SVNErrorManager.java:70)
	at org.tmatesoft.svn.core.internal.wc.SVNErrorManager.error(SVNErrorManager.java:57)
	at org.tmatesoft.svn.core.internal.db.SVNSqlJetDb.createSqlJetError(SVNSqlJetDb.java:195)
	at org.tmatesoft.svn.core.internal.db.SVNSqlJetDb.beginTransaction(SVNSqlJetDb.java:211)
	at org.tmatesoft.svn.core.internal.db.SVNSqlJetDb.runTransaction(SVNSqlJetDb.java:257)
	at org.tmatesoft.svn.core.internal.db.SVNSqlJetDb.runTransaction(SVNSqlJetDb.java:252)
	at org.tmatesoft.svn.core.internal.wc17.db.SVNWCDb.obtainWCLock(SVNWCDb.java:5867)
	at org.tmatesoft.svn.core.internal.wc17.SVNWCContext.acquireWriteLock(SVNWCContext.java:1652)
	at org.tmatesoft.svn.core.internal.wc2.ng.SvnNgAbstractUpdate.update(SvnNgAbstractUpdate.java:110)
	at org.tmatesoft.svn.core.internal.wc2.ng.SvnNgUpdate.run(SvnNgUpdate.java:40)
	at org.tmatesoft.svn.core.internal.wc2.ng.SvnNgUpdate.run(SvnNgUpdate.java:18)
	at org.tmatesoft.svn.core.internal.wc2.ng.SvnNgOperationRunner.run(SvnNgOperationRunner.java:20)
	at org.tmatesoft.svn.core.internal.wc2.SvnOperationRunner.run(SvnOperationRunner.java:21)
	at org.tmatesoft.svn.core.wc2.SvnOperationFactory.run(SvnOperationFactory.java:1239)
	at org.tmatesoft.svn.core.wc2.SvnOperation.run(SvnOperation.java:294)
	at org.tmatesoft.svn.core.wc.SVNUpdateClient.doUpdate(SVNUpdateClient.java:311)
	at org.tmatesoft.svn.core.wc.SVNUpdateClient.doUpdate(SVNUpdateClient.java:291)
	at org.tmatesoft.svn.core.wc.SVNUpdateClient.doUpdate(SVNUpdateClient.java:387)
	at hudson.scm.subversion.UpdateUpdater$TaskImpl.perform(UpdateUpdater.java:165)
	at hudson.scm.subversion.WorkspaceUpdater$UpdateTask.delegateTo(WorkspaceUpdater.java:168)
	at hudson.scm.SubversionSCM$CheckOutUpdateTask.perform(SubversionSCM.java:1086)
	at hudson.scm.SubversionSCM$CheckOutUpdateTask.run(SubversionSCM.java:1067)
	at hudson.scm.SubversionSCM$CheckOutTask.invoke(SubversionSCM.java:1037)
	at hudson.scm.SubversionSCM$CheckOutTask.invoke(SubversionSCM.java:1020)
	at hudson.FilePath$FileCallableWrapper.call(FilePath.java:3578)
	at hudson.remoting.UserRequest.perform(UserRequest.java:211)
	at hudson.remoting.UserRequest.perform(UserRequest.java:54)
	at hudson.remoting.Request$2.run(Request.java:377)
	at hudson.remoting.InterceptingExecutorService.lambda$wrap$0(InterceptingExecutorService.java:78)
	at java.base/java.util.concurrent.FutureTask.run(FutureTask.java:264)
	at java.base/java.util.concurrent.ThreadPoolExecutor.runWorker(ThreadPoolExecutor.java:1128)
	at java.base/java.util.concurrent.ThreadPoolExecutor$Worker.run(ThreadPoolExecutor.java:628)
	at java.base/java.lang.Thread.run(Thread.java:829)
Caused by: org.tmatesoft.sqljet.core.SqlJetException: FULL: error code is FULL
	at org.tmatesoft.sqljet.core.internal.pager.SqlJetPager.openJournal(SqlJetPager.java:3044)
	at org.tmatesoft.sqljet.core.internal.pager.SqlJetPager.begin(SqlJetPager.java:2775)
	at org.tmatesoft.sqljet.core.internal.btree.SqlJetBtree.beginTrans(SqlJetBtree.java:931)
	at org.tmatesoft.sqljet.core.table.engine.SqlJetEngine.doBeginTransaction(SqlJetEngine.java:561)
	at org.tmatesoft.sqljet.core.table.engine.SqlJetEngine.access$100(SqlJetEngine.java:55)
	at org.tmatesoft.sqljet.core.table.engine.SqlJetEngine$9.runSynchronized(SqlJetEngine.java:475)
	at org.tmatesoft.sqljet.core.table.engine.SqlJetEngine.runSynchronized(SqlJetEngine.java:217)
	at org.tmatesoft.sqljet.core.table.engine.SqlJetEngine.beginTransaction(SqlJetEngine.java:471)
	at org.tmatesoft.svn.core.internal.db.SVNSqlJetDb.beginTransaction(SVNSqlJetDb.java:206)
	... 29 more
ERROR: Subversion update failed
org.tmatesoft.sqljet.core.SqlJetException: FULL: error code is FULL
	at org.tmatesoft.sqljet.core.internal.pager.SqlJetPager.openJournal(SqlJetPager.java:3044)
	at org.tmatesoft.sqljet.core.internal.pager.SqlJetPager.begin(SqlJetPager.java:2775)
	at org.tmatesoft.sqljet.core.internal.btree.SqlJetBtree.beginTrans(SqlJetBtree.java:931)
	at org.tmatesoft.sqljet.core.table.engine.SqlJetEngine.doBeginTransaction(SqlJetEngine.java:561)
	at org.tmatesoft.sqljet.core.table.engine.SqlJetEngine.access$100(SqlJetEngine.java:55)
	at org.tmatesoft.sqljet.core.table.engine.SqlJetEngine$9.runSynchronized(SqlJetEngine.java:475)
	at org.tmatesoft.sqljet.core.table.engine.SqlJetEngine.runSynchronized(SqlJetEngine.java:217)
	at org.tmatesoft.sqljet.core.table.engine.SqlJetEngine.beginTransaction(SqlJetEngine.java:471)
	at org.tmatesoft.svn.core.internal.db.SVNSqlJetDb.beginTransaction(SVNSqlJetDb.java:206)
Caused: org.tmatesoft.svn.core.SVNException: svn: E200030: FULL
	at org.tmatesoft.svn.core.internal.wc.SVNErrorManager.error(SVNErrorManager.java:70)
	at org.tmatesoft.svn.core.internal.wc.SVNErrorManager.error(SVNErrorManager.java:57)
	at org.tmatesoft.svn.core.internal.db.SVNSqlJetDb.createSqlJetError(SVNSqlJetDb.java:195)
	at org.tmatesoft.svn.core.internal.db.SVNSqlJetDb.beginTransaction(SVNSqlJetDb.java:211)
	at org.tmatesoft.svn.core.internal.db.SVNSqlJetDb.runTransaction(SVNSqlJetDb.java:257)
	at org.tmatesoft.svn.core.internal.db.SVNSqlJetDb.runTransaction(SVNSqlJetDb.java:252)
	at org.tmatesoft.svn.core.internal.wc17.db.SVNWCDb.obtainWCLock(SVNWCDb.java:5867)
	at org.tmatesoft.svn.core.internal.wc17.SVNWCContext.acquireWriteLock(SVNWCContext.java:1652)
	at org.tmatesoft.svn.core.internal.wc2.ng.SvnNgAbstractUpdate.update(SvnNgAbstractUpdate.java:110)
	at org.tmatesoft.svn.core.internal.wc2.ng.SvnNgUpdate.run(SvnNgUpdate.java:40)
	at org.tmatesoft.svn.core.internal.wc2.ng.SvnNgUpdate.run(SvnNgUpdate.java:18)
	at org.tmatesoft.svn.core.internal.wc2.ng.SvnNgOperationRunner.run(SvnNgOperationRunner.java:20)
	at org.tmatesoft.svn.core.internal.wc2.SvnOperationRunner.run(SvnOperationRunner.java:21)
	at org.tmatesoft.svn.core.wc2.SvnOperationFactory.run(SvnOperationFactory.java:1239)
	at org.tmatesoft.svn.core.wc2.SvnOperation.run(SvnOperation.java:294)
	at org.tmatesoft.svn.core.wc.SVNUpdateClient.doUpdate(SVNUpdateClient.java:311)
	at org.tmatesoft.svn.core.wc.SVNUpdateClient.doUpdate(SVNUpdateClient.java:291)
	at org.tmatesoft.svn.core.wc.SVNUpdateClient.doUpdate(SVNUpdateClient.java:387)
	at hudson.scm.subversion.UpdateUpdater$TaskImpl.perform(UpdateUpdater.java:165)
Caused: hudson.scm.subversion.UpdaterException: failed to perform svn update
Also:   hudson.remoting.Channel$CallSiteStackTrace: Remote call to builds56
		at hudson.remoting.Channel.attachCallSiteStackTrace(Channel.java:1784)
		at hudson.remoting.UserRequest$ExceptionResponse.retrieve(UserRequest.java:356)
		at hudson.remoting.Channel.call(Channel.java:1000)
		at hudson.FilePath.act(FilePath.java:1192)
		at hudson.FilePath.act(FilePath.java:1181)
		at hudson.scm.SubversionSCM.checkout(SubversionSCM.java:970)
		at hudson.scm.SubversionSCM.checkout(SubversionSCM.java:892)
		at hudson.scm.SCM.checkout(SCM.java:540)
		at hudson.model.AbstractProject.checkout(AbstractProject.java:1240)
		at hudson.model.AbstractBuild$AbstractBuildExecution.defaultCheckout(AbstractBuild.java:649)
		at jenkins.scm.SCMCheckoutStrategy.checkout(SCMCheckoutStrategy.java:85)
		at hudson.model.AbstractBuild$AbstractBuildExecution.run(AbstractBuild.java:521)
		at hudson.model.Run.execute(Run.java:1900)
		at hudson.maven.MavenModuleSetBuild.run(MavenModuleSetBuild.java:543)
		at hudson.model.ResourceController.execute(ResourceController.java:101)
		at hudson.model.Executor.run(Executor.java:442)
Caused: java.io.IOException
	at hudson.scm.subversion.UpdateUpdater$TaskImpl.perform(UpdateUpdater.java:220)
	at hudson.scm.subversion.WorkspaceUpdater$UpdateTask.delegateTo(WorkspaceUpdater.java:168)
	at hudson.scm.SubversionSCM$CheckOutUpdateTask.perform(SubversionSCM.java:1086)
	at hudson.scm.SubversionSCM$CheckOutUpdateTask.run(SubversionSCM.java:1067)
	at hudson.scm.SubversionSCM$CheckOutTask.invoke(SubversionSCM.java:1037)
	at hudson.scm.SubversionSCM$CheckOutTask.invoke(SubversionSCM.java:1020)
	at hudson.FilePath$FileCallableWrapper.call(FilePath.java:3578)
	at hudson.remoting.UserRequest.perform(UserRequest.java:211)
	at hudson.remoting.UserRequest.perform(UserRequest.java:54)
	at hudson.remoting.Request$2.run(Request.java:377)
	at hudson.remoting.InterceptingExecutorService.lambda$wrap$0(InterceptingExecutorService.java:78)
	at java.base/java.util.concurrent.FutureTask.run(FutureTask.java:264)
	at java.base/java.util.concurrent.ThreadPoolExecutor.runWorker(ThreadPoolExecutor.java:1128)
	at java.base/java.util.concurrent.ThreadPoolExecutor$Worker.run(ThreadPoolExecutor.java:628)
	at java.base/java.lang.Thread.run(Thread.java:829)
Archiving artifacts

---------------------------------------------------------------------
To unsubscribe, e-mail: dev-unsubscribe@pdfbox.apache.org
For additional commands, e-mail: dev-help@pdfbox.apache.org