You are viewing a plain text version of this content. The canonical link for it is here.
Posted to issues@flink.apache.org by "Matthias Pohl (Jira)" <ji...@apache.org> on 2022/02/23 07:44:00 UTC

[jira] [Created] (FLINK-26321) KafkaSinkITCase.testWriteRecordsToKafkaWithExactlyOnceGuarantee fails on azure

Matthias Pohl created FLINK-26321:
-------------------------------------

             Summary: KafkaSinkITCase.testWriteRecordsToKafkaWithExactlyOnceGuarantee fails on azure
                 Key: FLINK-26321
                 URL: https://issues.apache.org/jira/browse/FLINK-26321
             Project: Flink
          Issue Type: Bug
          Components: Connectors / Kafka
    Affects Versions: 1.15.0
            Reporter: Matthias Pohl


[This build|https://dev.azure.com/mapohl/flink/_build/results?buildId=769&view=logs&j=d543d572-9428-5803-a30c-e8e09bf70915&t=4e4199a3-fbbb-5d5b-a2be-802955ffb013&l=35635] failed due to a test failure in {{KafkaSinkITCase.testWriteRecordsToKafkaWithExactlyOnceGuarantee}}:
{code}
Feb 22 21:55:15 [ERROR] Tests run: 8, Failures: 1, Errors: 0, Skipped: 0, Time elapsed: 65.897 s <<< FAILURE! - in org.apache.flink.connector.kafka.sink.KafkaSinkITCase
Feb 22 21:55:15 [ERROR] org.apache.flink.connector.kafka.sink.KafkaSinkITCase.testWriteRecordsToKafkaWithExactlyOnceGuarantee  Time elapsed: 25.251 s  <<< FAILURE!
Feb 22 21:55:15 java.lang.AssertionError: expected:<20912> but was:<20913>
Feb 22 21:55:15 	at org.junit.Assert.fail(Assert.java:89)
Feb 22 21:55:15 	at org.junit.Assert.failNotEquals(Assert.java:835)
Feb 22 21:55:15 	at org.junit.Assert.assertEquals(Assert.java:647)
Feb 22 21:55:15 	at org.junit.Assert.assertEquals(Assert.java:633)
Feb 22 21:55:15 	at org.apache.flink.connector.kafka.sink.KafkaSinkITCase.writeRecordsToKafka(KafkaSinkITCase.java:424)
Feb 22 21:55:15 	at org.apache.flink.connector.kafka.sink.KafkaSinkITCase.testWriteRecordsToKafkaWithExactlyOnceGuarantee(KafkaSinkITCase.java:231)
[...]
{code}



--
This message was sent by Atlassian Jira
(v8.20.1#820001)