You are viewing a plain text version of this content. The canonical link for it is here.
Posted to dev@lucene.apache.org by Policeman Jenkins Server <je...@thetaphi.de> on 2018/11/07 19:04:34 UTC
[JENKINS] Lucene-Solr-7.x-Linux (32bit/jdk1.8.0_172) - Build # 3052
- Still Unstable!
Build: https://jenkins.thetaphi.de/job/Lucene-Solr-7.x-Linux/3052/
Java: 32bit/jdk1.8.0_172 -server -XX:+UseSerialGC
5 tests failed.
FAILED: org.apache.solr.client.solrj.impl.CloudSolrClientTest.testCollectionDoesntExist
Error Message:
Tried fetching cluster state using the node names we knew of, i.e. [127.0.0.1:38379_solr, 127.0.0.1:39499_solr, 127.0.0.1:46713_solr]. However, succeeded in obtaining the cluster state from none of them.If you think your Solr cluster is up and is accessible, you could try re-creating a new CloudSolrClient using working solrUrl(s) or zkHost(s).
Stack Trace:
java.lang.RuntimeException: Tried fetching cluster state using the node names we knew of, i.e. [127.0.0.1:38379_solr, 127.0.0.1:39499_solr, 127.0.0.1:46713_solr]. However, succeeded in obtaining the cluster state from none of them.If you think your Solr cluster is up and is accessible, you could try re-creating a new CloudSolrClient using working solrUrl(s) or zkHost(s).
at __randomizedtesting.SeedInfo.seed([F21F3742FF47ABF5:90BC29ECFDC5CFE5]:0)
at org.apache.solr.client.solrj.impl.HttpClusterStateProvider.getState(HttpClusterStateProvider.java:108)
at org.apache.solr.client.solrj.impl.CloudSolrClient.resolveAliases(CloudSolrClient.java:1115)
at org.apache.solr.client.solrj.impl.CloudSolrClient.requestWithRetryOnStaleState(CloudSolrClient.java:844)
at org.apache.solr.client.solrj.impl.CloudSolrClient.request(CloudSolrClient.java:817)
at org.apache.solr.client.solrj.SolrRequest.process(SolrRequest.java:194)
at org.apache.solr.client.solrj.SolrClient.add(SolrClient.java:177)
at org.apache.solr.client.solrj.SolrClient.add(SolrClient.java:138)
at org.apache.solr.client.solrj.impl.CloudSolrClientTest.testCollectionDoesntExist(CloudSolrClientTest.java:779)
at sun.reflect.NativeMethodAccessorImpl.invoke0(Native Method)
at sun.reflect.NativeMethodAccessorImpl.invoke(NativeMethodAccessorImpl.java:62)
at sun.reflect.DelegatingMethodAccessorImpl.invoke(DelegatingMethodAccessorImpl.java:43)
at java.lang.reflect.Method.invoke(Method.java:498)
at com.carrotsearch.randomizedtesting.RandomizedRunner.invoke(RandomizedRunner.java:1742)
at com.carrotsearch.randomizedtesting.RandomizedRunner$8.evaluate(RandomizedRunner.java:935)
at com.carrotsearch.randomizedtesting.RandomizedRunner$9.evaluate(RandomizedRunner.java:971)
at com.carrotsearch.randomizedtesting.RandomizedRunner$10.evaluate(RandomizedRunner.java:985)
at org.junit.rules.ExpectedException$ExpectedExceptionStatement.evaluate(ExpectedException.java:110)
at com.carrotsearch.randomizedtesting.rules.SystemPropertiesRestoreRule$1.evaluate(SystemPropertiesRestoreRule.java:57)
at org.apache.lucene.util.TestRuleSetupTeardownChained$1.evaluate(TestRuleSetupTeardownChained.java:49)
at org.apache.lucene.util.AbstractBeforeAfterRule$1.evaluate(AbstractBeforeAfterRule.java:45)
at org.apache.lucene.util.TestRuleThreadAndTestName$1.evaluate(TestRuleThreadAndTestName.java:48)
at org.apache.lucene.util.TestRuleIgnoreAfterMaxFailures$1.evaluate(TestRuleIgnoreAfterMaxFailures.java:64)
at org.apache.lucene.util.TestRuleMarkFailure$1.evaluate(TestRuleMarkFailure.java:47)
at com.carrotsearch.randomizedtesting.rules.StatementAdapter.evaluate(StatementAdapter.java:36)
at com.carrotsearch.randomizedtesting.ThreadLeakControl$StatementRunner.run(ThreadLeakControl.java:368)
at com.carrotsearch.randomizedtesting.ThreadLeakControl.forkTimeoutingTask(ThreadLeakControl.java:817)
at com.carrotsearch.randomizedtesting.ThreadLeakControl$3.evaluate(ThreadLeakControl.java:468)
at com.carrotsearch.randomizedtesting.RandomizedRunner.runSingleTest(RandomizedRunner.java:944)
at com.carrotsearch.randomizedtesting.RandomizedRunner$5.evaluate(RandomizedRunner.java:830)
at com.carrotsearch.randomizedtesting.RandomizedRunner$6.evaluate(RandomizedRunner.java:880)
at com.carrotsearch.randomizedtesting.RandomizedRunner$7.evaluate(RandomizedRunner.java:891)
at com.carrotsearch.randomizedtesting.rules.StatementAdapter.evaluate(StatementAdapter.java:36)
at com.carrotsearch.randomizedtesting.rules.SystemPropertiesRestoreRule$1.evaluate(SystemPropertiesRestoreRule.java:57)
at org.apache.lucene.util.AbstractBeforeAfterRule$1.evaluate(AbstractBeforeAfterRule.java:45)
at com.carrotsearch.randomizedtesting.rules.StatementAdapter.evaluate(StatementAdapter.java:36)
at org.apache.lucene.util.TestRuleStoreClassName$1.evaluate(TestRuleStoreClassName.java:41)
at com.carrotsearch.randomizedtesting.rules.NoShadowingOrOverridesOnMethodsRule$1.evaluate(NoShadowingOrOverridesOnMethodsRule.java:40)
at com.carrotsearch.randomizedtesting.rules.NoShadowingOrOverridesOnMethodsRule$1.evaluate(NoShadowingOrOverridesOnMethodsRule.java:40)
at com.carrotsearch.randomizedtesting.rules.StatementAdapter.evaluate(StatementAdapter.java:36)
at com.carrotsearch.randomizedtesting.rules.StatementAdapter.evaluate(StatementAdapter.java:36)
at com.carrotsearch.randomizedtesting.rules.StatementAdapter.evaluate(StatementAdapter.java:36)
at org.apache.lucene.util.TestRuleAssertionsRequired$1.evaluate(TestRuleAssertionsRequired.java:53)
at org.apache.lucene.util.TestRuleMarkFailure$1.evaluate(TestRuleMarkFailure.java:47)
at org.apache.lucene.util.TestRuleIgnoreAfterMaxFailures$1.evaluate(TestRuleIgnoreAfterMaxFailures.java:64)
at org.apache.lucene.util.TestRuleIgnoreTestSuites$1.evaluate(TestRuleIgnoreTestSuites.java:54)
at com.carrotsearch.randomizedtesting.rules.StatementAdapter.evaluate(StatementAdapter.java:36)
at com.carrotsearch.randomizedtesting.ThreadLeakControl$StatementRunner.run(ThreadLeakControl.java:368)
at java.lang.Thread.run(Thread.java:748)
FAILED: org.apache.solr.client.solrj.impl.CloudSolrClientTest.testCollectionDoesntExist
Error Message:
Tried fetching cluster state using the node names we knew of, i.e. [127.0.0.1:37433_solr, 127.0.0.1:37131_solr, 127.0.0.1:34309_solr]. However, succeeded in obtaining the cluster state from none of them.If you think your Solr cluster is up and is accessible, you could try re-creating a new CloudSolrClient using working solrUrl(s) or zkHost(s).
Stack Trace:
java.lang.RuntimeException: Tried fetching cluster state using the node names we knew of, i.e. [127.0.0.1:37433_solr, 127.0.0.1:37131_solr, 127.0.0.1:34309_solr]. However, succeeded in obtaining the cluster state from none of them.If you think your Solr cluster is up and is accessible, you could try re-creating a new CloudSolrClient using working solrUrl(s) or zkHost(s).
at __randomizedtesting.SeedInfo.seed([F21F3742FF47ABF5:90BC29ECFDC5CFE5]:0)
at org.apache.solr.client.solrj.impl.HttpClusterStateProvider.getState(HttpClusterStateProvider.java:108)
at org.apache.solr.client.solrj.impl.CloudSolrClient.resolveAliases(CloudSolrClient.java:1115)
at org.apache.solr.client.solrj.impl.CloudSolrClient.requestWithRetryOnStaleState(CloudSolrClient.java:844)
at org.apache.solr.client.solrj.impl.CloudSolrClient.request(CloudSolrClient.java:817)
at org.apache.solr.client.solrj.SolrRequest.process(SolrRequest.java:194)
at org.apache.solr.client.solrj.SolrClient.add(SolrClient.java:177)
at org.apache.solr.client.solrj.SolrClient.add(SolrClient.java:138)
at org.apache.solr.client.solrj.impl.CloudSolrClientTest.testCollectionDoesntExist(CloudSolrClientTest.java:779)
at sun.reflect.NativeMethodAccessorImpl.invoke0(Native Method)
at sun.reflect.NativeMethodAccessorImpl.invoke(NativeMethodAccessorImpl.java:62)
at sun.reflect.DelegatingMethodAccessorImpl.invoke(DelegatingMethodAccessorImpl.java:43)
at java.lang.reflect.Method.invoke(Method.java:498)
at com.carrotsearch.randomizedtesting.RandomizedRunner.invoke(RandomizedRunner.java:1742)
at com.carrotsearch.randomizedtesting.RandomizedRunner$8.evaluate(RandomizedRunner.java:935)
at com.carrotsearch.randomizedtesting.RandomizedRunner$9.evaluate(RandomizedRunner.java:971)
at com.carrotsearch.randomizedtesting.RandomizedRunner$10.evaluate(RandomizedRunner.java:985)
at org.junit.rules.ExpectedException$ExpectedExceptionStatement.evaluate(ExpectedException.java:110)
at com.carrotsearch.randomizedtesting.rules.SystemPropertiesRestoreRule$1.evaluate(SystemPropertiesRestoreRule.java:57)
at org.apache.lucene.util.TestRuleSetupTeardownChained$1.evaluate(TestRuleSetupTeardownChained.java:49)
at org.apache.lucene.util.AbstractBeforeAfterRule$1.evaluate(AbstractBeforeAfterRule.java:45)
at org.apache.lucene.util.TestRuleThreadAndTestName$1.evaluate(TestRuleThreadAndTestName.java:48)
at org.apache.lucene.util.TestRuleIgnoreAfterMaxFailures$1.evaluate(TestRuleIgnoreAfterMaxFailures.java:64)
at org.apache.lucene.util.TestRuleMarkFailure$1.evaluate(TestRuleMarkFailure.java:47)
at com.carrotsearch.randomizedtesting.rules.StatementAdapter.evaluate(StatementAdapter.java:36)
at com.carrotsearch.randomizedtesting.ThreadLeakControl$StatementRunner.run(ThreadLeakControl.java:368)
at com.carrotsearch.randomizedtesting.ThreadLeakControl.forkTimeoutingTask(ThreadLeakControl.java:817)
at com.carrotsearch.randomizedtesting.ThreadLeakControl$3.evaluate(ThreadLeakControl.java:468)
at com.carrotsearch.randomizedtesting.RandomizedRunner.runSingleTest(RandomizedRunner.java:944)
at com.carrotsearch.randomizedtesting.RandomizedRunner$5.evaluate(RandomizedRunner.java:830)
at com.carrotsearch.randomizedtesting.RandomizedRunner$6.evaluate(RandomizedRunner.java:880)
at com.carrotsearch.randomizedtesting.RandomizedRunner$7.evaluate(RandomizedRunner.java:891)
at com.carrotsearch.randomizedtesting.rules.StatementAdapter.evaluate(StatementAdapter.java:36)
at com.carrotsearch.randomizedtesting.rules.SystemPropertiesRestoreRule$1.evaluate(SystemPropertiesRestoreRule.java:57)
at org.apache.lucene.util.AbstractBeforeAfterRule$1.evaluate(AbstractBeforeAfterRule.java:45)
at com.carrotsearch.randomizedtesting.rules.StatementAdapter.evaluate(StatementAdapter.java:36)
at org.apache.lucene.util.TestRuleStoreClassName$1.evaluate(TestRuleStoreClassName.java:41)
at com.carrotsearch.randomizedtesting.rules.NoShadowingOrOverridesOnMethodsRule$1.evaluate(NoShadowingOrOverridesOnMethodsRule.java:40)
at com.carrotsearch.randomizedtesting.rules.NoShadowingOrOverridesOnMethodsRule$1.evaluate(NoShadowingOrOverridesOnMethodsRule.java:40)
at com.carrotsearch.randomizedtesting.rules.StatementAdapter.evaluate(StatementAdapter.java:36)
at com.carrotsearch.randomizedtesting.rules.StatementAdapter.evaluate(StatementAdapter.java:36)
at com.carrotsearch.randomizedtesting.rules.StatementAdapter.evaluate(StatementAdapter.java:36)
at org.apache.lucene.util.TestRuleAssertionsRequired$1.evaluate(TestRuleAssertionsRequired.java:53)
at org.apache.lucene.util.TestRuleMarkFailure$1.evaluate(TestRuleMarkFailure.java:47)
at org.apache.lucene.util.TestRuleIgnoreAfterMaxFailures$1.evaluate(TestRuleIgnoreAfterMaxFailures.java:64)
at org.apache.lucene.util.TestRuleIgnoreTestSuites$1.evaluate(TestRuleIgnoreTestSuites.java:54)
at com.carrotsearch.randomizedtesting.rules.StatementAdapter.evaluate(StatementAdapter.java:36)
at com.carrotsearch.randomizedtesting.ThreadLeakControl$StatementRunner.run(ThreadLeakControl.java:368)
at java.lang.Thread.run(Thread.java:748)
FAILED: org.apache.solr.client.solrj.impl.CloudSolrClientTest.testCollectionDoesntExist
Error Message:
Tried fetching cluster state using the node names we knew of, i.e. [127.0.0.1:33175_solr, 127.0.0.1:41481_solr, 127.0.0.1:37399_solr]. However, succeeded in obtaining the cluster state from none of them.If you think your Solr cluster is up and is accessible, you could try re-creating a new CloudSolrClient using working solrUrl(s) or zkHost(s).
Stack Trace:
java.lang.RuntimeException: Tried fetching cluster state using the node names we knew of, i.e. [127.0.0.1:33175_solr, 127.0.0.1:41481_solr, 127.0.0.1:37399_solr]. However, succeeded in obtaining the cluster state from none of them.If you think your Solr cluster is up and is accessible, you could try re-creating a new CloudSolrClient using working solrUrl(s) or zkHost(s).
at __randomizedtesting.SeedInfo.seed([F21F3742FF47ABF5:90BC29ECFDC5CFE5]:0)
at org.apache.solr.client.solrj.impl.HttpClusterStateProvider.getState(HttpClusterStateProvider.java:108)
at org.apache.solr.client.solrj.impl.CloudSolrClient.resolveAliases(CloudSolrClient.java:1115)
at org.apache.solr.client.solrj.impl.CloudSolrClient.requestWithRetryOnStaleState(CloudSolrClient.java:844)
at org.apache.solr.client.solrj.impl.CloudSolrClient.request(CloudSolrClient.java:817)
at org.apache.solr.client.solrj.SolrRequest.process(SolrRequest.java:194)
at org.apache.solr.client.solrj.SolrClient.add(SolrClient.java:177)
at org.apache.solr.client.solrj.SolrClient.add(SolrClient.java:138)
at org.apache.solr.client.solrj.impl.CloudSolrClientTest.testCollectionDoesntExist(CloudSolrClientTest.java:779)
at sun.reflect.NativeMethodAccessorImpl.invoke0(Native Method)
at sun.reflect.NativeMethodAccessorImpl.invoke(NativeMethodAccessorImpl.java:62)
at sun.reflect.DelegatingMethodAccessorImpl.invoke(DelegatingMethodAccessorImpl.java:43)
at java.lang.reflect.Method.invoke(Method.java:498)
at com.carrotsearch.randomizedtesting.RandomizedRunner.invoke(RandomizedRunner.java:1742)
at com.carrotsearch.randomizedtesting.RandomizedRunner$8.evaluate(RandomizedRunner.java:935)
at com.carrotsearch.randomizedtesting.RandomizedRunner$9.evaluate(RandomizedRunner.java:971)
at com.carrotsearch.randomizedtesting.RandomizedRunner$10.evaluate(RandomizedRunner.java:985)
at org.junit.rules.ExpectedException$ExpectedExceptionStatement.evaluate(ExpectedException.java:110)
at com.carrotsearch.randomizedtesting.rules.SystemPropertiesRestoreRule$1.evaluate(SystemPropertiesRestoreRule.java:57)
at org.apache.lucene.util.TestRuleSetupTeardownChained$1.evaluate(TestRuleSetupTeardownChained.java:49)
at org.apache.lucene.util.AbstractBeforeAfterRule$1.evaluate(AbstractBeforeAfterRule.java:45)
at org.apache.lucene.util.TestRuleThreadAndTestName$1.evaluate(TestRuleThreadAndTestName.java:48)
at org.apache.lucene.util.TestRuleIgnoreAfterMaxFailures$1.evaluate(TestRuleIgnoreAfterMaxFailures.java:64)
at org.apache.lucene.util.TestRuleMarkFailure$1.evaluate(TestRuleMarkFailure.java:47)
at com.carrotsearch.randomizedtesting.rules.StatementAdapter.evaluate(StatementAdapter.java:36)
at com.carrotsearch.randomizedtesting.ThreadLeakControl$StatementRunner.run(ThreadLeakControl.java:368)
at com.carrotsearch.randomizedtesting.ThreadLeakControl.forkTimeoutingTask(ThreadLeakControl.java:817)
at com.carrotsearch.randomizedtesting.ThreadLeakControl$3.evaluate(ThreadLeakControl.java:468)
at com.carrotsearch.randomizedtesting.RandomizedRunner.runSingleTest(RandomizedRunner.java:944)
at com.carrotsearch.randomizedtesting.RandomizedRunner$5.evaluate(RandomizedRunner.java:830)
at com.carrotsearch.randomizedtesting.RandomizedRunner$6.evaluate(RandomizedRunner.java:880)
at com.carrotsearch.randomizedtesting.RandomizedRunner$7.evaluate(RandomizedRunner.java:891)
at com.carrotsearch.randomizedtesting.rules.StatementAdapter.evaluate(StatementAdapter.java:36)
at com.carrotsearch.randomizedtesting.rules.SystemPropertiesRestoreRule$1.evaluate(SystemPropertiesRestoreRule.java:57)
at org.apache.lucene.util.AbstractBeforeAfterRule$1.evaluate(AbstractBeforeAfterRule.java:45)
at com.carrotsearch.randomizedtesting.rules.StatementAdapter.evaluate(StatementAdapter.java:36)
at org.apache.lucene.util.TestRuleStoreClassName$1.evaluate(TestRuleStoreClassName.java:41)
at com.carrotsearch.randomizedtesting.rules.NoShadowingOrOverridesOnMethodsRule$1.evaluate(NoShadowingOrOverridesOnMethodsRule.java:40)
at com.carrotsearch.randomizedtesting.rules.NoShadowingOrOverridesOnMethodsRule$1.evaluate(NoShadowingOrOverridesOnMethodsRule.java:40)
at com.carrotsearch.randomizedtesting.rules.StatementAdapter.evaluate(StatementAdapter.java:36)
at com.carrotsearch.randomizedtesting.rules.StatementAdapter.evaluate(StatementAdapter.java:36)
at com.carrotsearch.randomizedtesting.rules.StatementAdapter.evaluate(StatementAdapter.java:36)
at org.apache.lucene.util.TestRuleAssertionsRequired$1.evaluate(TestRuleAssertionsRequired.java:53)
at org.apache.lucene.util.TestRuleMarkFailure$1.evaluate(TestRuleMarkFailure.java:47)
at org.apache.lucene.util.TestRuleIgnoreAfterMaxFailures$1.evaluate(TestRuleIgnoreAfterMaxFailures.java:64)
at org.apache.lucene.util.TestRuleIgnoreTestSuites$1.evaluate(TestRuleIgnoreTestSuites.java:54)
at com.carrotsearch.randomizedtesting.rules.StatementAdapter.evaluate(StatementAdapter.java:36)
at com.carrotsearch.randomizedtesting.ThreadLeakControl$StatementRunner.run(ThreadLeakControl.java:368)
at java.lang.Thread.run(Thread.java:748)
FAILED: org.apache.solr.client.solrj.impl.CloudSolrClientTest.testCollectionDoesntExist
Error Message:
Tried fetching cluster state using the node names we knew of, i.e. [127.0.0.1:44569_solr, 127.0.0.1:42231_solr, 127.0.0.1:39915_solr]. However, succeeded in obtaining the cluster state from none of them.If you think your Solr cluster is up and is accessible, you could try re-creating a new CloudSolrClient using working solrUrl(s) or zkHost(s).
Stack Trace:
java.lang.RuntimeException: Tried fetching cluster state using the node names we knew of, i.e. [127.0.0.1:44569_solr, 127.0.0.1:42231_solr, 127.0.0.1:39915_solr]. However, succeeded in obtaining the cluster state from none of them.If you think your Solr cluster is up and is accessible, you could try re-creating a new CloudSolrClient using working solrUrl(s) or zkHost(s).
at __randomizedtesting.SeedInfo.seed([F21F3742FF47ABF5:90BC29ECFDC5CFE5]:0)
at org.apache.solr.client.solrj.impl.HttpClusterStateProvider.getState(HttpClusterStateProvider.java:108)
at org.apache.solr.client.solrj.impl.CloudSolrClient.resolveAliases(CloudSolrClient.java:1115)
at org.apache.solr.client.solrj.impl.CloudSolrClient.requestWithRetryOnStaleState(CloudSolrClient.java:844)
at org.apache.solr.client.solrj.impl.CloudSolrClient.request(CloudSolrClient.java:817)
at org.apache.solr.client.solrj.SolrRequest.process(SolrRequest.java:194)
at org.apache.solr.client.solrj.SolrClient.add(SolrClient.java:177)
at org.apache.solr.client.solrj.SolrClient.add(SolrClient.java:138)
at org.apache.solr.client.solrj.impl.CloudSolrClientTest.testCollectionDoesntExist(CloudSolrClientTest.java:779)
at sun.reflect.NativeMethodAccessorImpl.invoke0(Native Method)
at sun.reflect.NativeMethodAccessorImpl.invoke(NativeMethodAccessorImpl.java:62)
at sun.reflect.DelegatingMethodAccessorImpl.invoke(DelegatingMethodAccessorImpl.java:43)
at java.lang.reflect.Method.invoke(Method.java:498)
at com.carrotsearch.randomizedtesting.RandomizedRunner.invoke(RandomizedRunner.java:1742)
at com.carrotsearch.randomizedtesting.RandomizedRunner$8.evaluate(RandomizedRunner.java:935)
at com.carrotsearch.randomizedtesting.RandomizedRunner$9.evaluate(RandomizedRunner.java:971)
at com.carrotsearch.randomizedtesting.RandomizedRunner$10.evaluate(RandomizedRunner.java:985)
at org.junit.rules.ExpectedException$ExpectedExceptionStatement.evaluate(ExpectedException.java:110)
at com.carrotsearch.randomizedtesting.rules.SystemPropertiesRestoreRule$1.evaluate(SystemPropertiesRestoreRule.java:57)
at org.apache.lucene.util.TestRuleSetupTeardownChained$1.evaluate(TestRuleSetupTeardownChained.java:49)
at org.apache.lucene.util.AbstractBeforeAfterRule$1.evaluate(AbstractBeforeAfterRule.java:45)
at org.apache.lucene.util.TestRuleThreadAndTestName$1.evaluate(TestRuleThreadAndTestName.java:48)
at org.apache.lucene.util.TestRuleIgnoreAfterMaxFailures$1.evaluate(TestRuleIgnoreAfterMaxFailures.java:64)
at org.apache.lucene.util.TestRuleMarkFailure$1.evaluate(TestRuleMarkFailure.java:47)
at com.carrotsearch.randomizedtesting.rules.StatementAdapter.evaluate(StatementAdapter.java:36)
at com.carrotsearch.randomizedtesting.ThreadLeakControl$StatementRunner.run(ThreadLeakControl.java:368)
at com.carrotsearch.randomizedtesting.ThreadLeakControl.forkTimeoutingTask(ThreadLeakControl.java:817)
at com.carrotsearch.randomizedtesting.ThreadLeakControl$3.evaluate(ThreadLeakControl.java:468)
at com.carrotsearch.randomizedtesting.RandomizedRunner.runSingleTest(RandomizedRunner.java:944)
at com.carrotsearch.randomizedtesting.RandomizedRunner$5.evaluate(RandomizedRunner.java:830)
at com.carrotsearch.randomizedtesting.RandomizedRunner$6.evaluate(RandomizedRunner.java:880)
at com.carrotsearch.randomizedtesting.RandomizedRunner$7.evaluate(RandomizedRunner.java:891)
at com.carrotsearch.randomizedtesting.rules.StatementAdapter.evaluate(StatementAdapter.java:36)
at com.carrotsearch.randomizedtesting.rules.SystemPropertiesRestoreRule$1.evaluate(SystemPropertiesRestoreRule.java:57)
at org.apache.lucene.util.AbstractBeforeAfterRule$1.evaluate(AbstractBeforeAfterRule.java:45)
at com.carrotsearch.randomizedtesting.rules.StatementAdapter.evaluate(StatementAdapter.java:36)
at org.apache.lucene.util.TestRuleStoreClassName$1.evaluate(TestRuleStoreClassName.java:41)
at com.carrotsearch.randomizedtesting.rules.NoShadowingOrOverridesOnMethodsRule$1.evaluate(NoShadowingOrOverridesOnMethodsRule.java:40)
at com.carrotsearch.randomizedtesting.rules.NoShadowingOrOverridesOnMethodsRule$1.evaluate(NoShadowingOrOverridesOnMethodsRule.java:40)
at com.carrotsearch.randomizedtesting.rules.StatementAdapter.evaluate(StatementAdapter.java:36)
at com.carrotsearch.randomizedtesting.rules.StatementAdapter.evaluate(StatementAdapter.java:36)
at com.carrotsearch.randomizedtesting.rules.StatementAdapter.evaluate(StatementAdapter.java:36)
at org.apache.lucene.util.TestRuleAssertionsRequired$1.evaluate(TestRuleAssertionsRequired.java:53)
at org.apache.lucene.util.TestRuleMarkFailure$1.evaluate(TestRuleMarkFailure.java:47)
at org.apache.lucene.util.TestRuleIgnoreAfterMaxFailures$1.evaluate(TestRuleIgnoreAfterMaxFailures.java:64)
at org.apache.lucene.util.TestRuleIgnoreTestSuites$1.evaluate(TestRuleIgnoreTestSuites.java:54)
at com.carrotsearch.randomizedtesting.rules.StatementAdapter.evaluate(StatementAdapter.java:36)
at com.carrotsearch.randomizedtesting.ThreadLeakControl$StatementRunner.run(ThreadLeakControl.java:368)
at java.lang.Thread.run(Thread.java:748)
FAILED: org.apache.solr.client.solrj.impl.CloudSolrClientTest.testRouting
Error Message:
Error from server at http://127.0.0.1:42231/solr/collection1_shard2_replica_n3: Expected mime type application/octet-stream but got text/html. <html> <head> <meta http-equiv="Content-Type" content="text/html;charset=utf-8"/> <title>Error 404 Can not find: /solr/collection1_shard2_replica_n3/update</title> </head> <body><h2>HTTP ERROR 404</h2> <p>Problem accessing /solr/collection1_shard2_replica_n3/update. Reason: <pre> Can not find: /solr/collection1_shard2_replica_n3/update</pre></p><hr><a href="http://eclipse.org/jetty">Powered by Jetty:// 9.4.11.v20180605</a><hr/> </body> </html>
Stack Trace:
org.apache.solr.client.solrj.impl.CloudSolrClient$RouteException: Error from server at http://127.0.0.1:42231/solr/collection1_shard2_replica_n3: Expected mime type application/octet-stream but got text/html. <html>
<head>
<meta http-equiv="Content-Type" content="text/html;charset=utf-8"/>
<title>Error 404 Can not find: /solr/collection1_shard2_replica_n3/update</title>
</head>
<body><h2>HTTP ERROR 404</h2>
<p>Problem accessing /solr/collection1_shard2_replica_n3/update. Reason:
<pre> Can not find: /solr/collection1_shard2_replica_n3/update</pre></p><hr><a href="http://eclipse.org/jetty">Powered by Jetty:// 9.4.11.v20180605</a><hr/>
</body>
</html>
at __randomizedtesting.SeedInfo.seed([F21F3742FF47ABF5:30A80B2AFC075B8D]:0)
at org.apache.solr.client.solrj.impl.CloudSolrClient.directUpdate(CloudSolrClient.java:551)
at org.apache.solr.client.solrj.impl.CloudSolrClient.sendRequest(CloudSolrClient.java:1016)
at org.apache.solr.client.solrj.impl.CloudSolrClient.requestWithRetryOnStaleState(CloudSolrClient.java:884)
at org.apache.solr.client.solrj.impl.CloudSolrClient.requestWithRetryOnStaleState(CloudSolrClient.java:949)
at org.apache.solr.client.solrj.impl.CloudSolrClient.requestWithRetryOnStaleState(CloudSolrClient.java:949)
at org.apache.solr.client.solrj.impl.CloudSolrClient.requestWithRetryOnStaleState(CloudSolrClient.java:949)
at org.apache.solr.client.solrj.impl.CloudSolrClient.requestWithRetryOnStaleState(CloudSolrClient.java:949)
at org.apache.solr.client.solrj.impl.CloudSolrClient.requestWithRetryOnStaleState(CloudSolrClient.java:949)
at org.apache.solr.client.solrj.impl.CloudSolrClient.request(CloudSolrClient.java:817)
at org.apache.solr.client.solrj.SolrRequest.process(SolrRequest.java:194)
at org.apache.solr.client.solrj.request.UpdateRequest.commit(UpdateRequest.java:237)
at org.apache.solr.client.solrj.impl.CloudSolrClientTest.testRouting(CloudSolrClientTest.java:269)
at sun.reflect.NativeMethodAccessorImpl.invoke0(Native Method)
at sun.reflect.NativeMethodAccessorImpl.invoke(NativeMethodAccessorImpl.java:62)
at sun.reflect.DelegatingMethodAccessorImpl.invoke(DelegatingMethodAccessorImpl.java:43)
at java.lang.reflect.Method.invoke(Method.java:498)
at com.carrotsearch.randomizedtesting.RandomizedRunner.invoke(RandomizedRunner.java:1742)
at com.carrotsearch.randomizedtesting.RandomizedRunner$8.evaluate(RandomizedRunner.java:935)
at com.carrotsearch.randomizedtesting.RandomizedRunner$9.evaluate(RandomizedRunner.java:971)
at com.carrotsearch.randomizedtesting.RandomizedRunner$10.evaluate(RandomizedRunner.java:985)
at org.junit.rules.ExpectedException$ExpectedExceptionStatement.evaluate(ExpectedException.java:110)
at com.carrotsearch.randomizedtesting.rules.SystemPropertiesRestoreRule$1.evaluate(SystemPropertiesRestoreRule.java:57)
at org.apache.lucene.util.TestRuleSetupTeardownChained$1.evaluate(TestRuleSetupTeardownChained.java:49)
at org.apache.lucene.util.AbstractBeforeAfterRule$1.evaluate(AbstractBeforeAfterRule.java:45)
at org.apache.lucene.util.TestRuleThreadAndTestName$1.evaluate(TestRuleThreadAndTestName.java:48)
at org.apache.lucene.util.TestRuleIgnoreAfterMaxFailures$1.evaluate(TestRuleIgnoreAfterMaxFailures.java:64)
at org.apache.lucene.util.TestRuleMarkFailure$1.evaluate(TestRuleMarkFailure.java:47)
at com.carrotsearch.randomizedtesting.rules.StatementAdapter.evaluate(StatementAdapter.java:36)
at com.carrotsearch.randomizedtesting.ThreadLeakControl$StatementRunner.run(ThreadLeakControl.java:368)
at com.carrotsearch.randomizedtesting.ThreadLeakControl.forkTimeoutingTask(ThreadLeakControl.java:817)
at com.carrotsearch.randomizedtesting.ThreadLeakControl$3.evaluate(ThreadLeakControl.java:468)
at com.carrotsearch.randomizedtesting.RandomizedRunner.runSingleTest(RandomizedRunner.java:944)
at com.carrotsearch.randomizedtesting.RandomizedRunner$5.evaluate(RandomizedRunner.java:830)
at com.carrotsearch.randomizedtesting.RandomizedRunner$6.evaluate(RandomizedRunner.java:880)
at com.carrotsearch.randomizedtesting.RandomizedRunner$7.evaluate(RandomizedRunner.java:891)
at com.carrotsearch.randomizedtesting.rules.StatementAdapter.evaluate(StatementAdapter.java:36)
at com.carrotsearch.randomizedtesting.rules.SystemPropertiesRestoreRule$1.evaluate(SystemPropertiesRestoreRule.java:57)
at org.apache.lucene.util.AbstractBeforeAfterRule$1.evaluate(AbstractBeforeAfterRule.java:45)
at com.carrotsearch.randomizedtesting.rules.StatementAdapter.evaluate(StatementAdapter.java:36)
at org.apache.lucene.util.TestRuleStoreClassName$1.evaluate(TestRuleStoreClassName.java:41)
at com.carrotsearch.randomizedtesting.rules.NoShadowingOrOverridesOnMethodsRule$1.evaluate(NoShadowingOrOverridesOnMethodsRule.java:40)
at com.carrotsearch.randomizedtesting.rules.NoShadowingOrOverridesOnMethodsRule$1.evaluate(NoShadowingOrOverridesOnMethodsRule.java:40)
at com.carrotsearch.randomizedtesting.rules.StatementAdapter.evaluate(StatementAdapter.java:36)
at com.carrotsearch.randomizedtesting.rules.StatementAdapter.evaluate(StatementAdapter.java:36)
at com.carrotsearch.randomizedtesting.rules.StatementAdapter.evaluate(StatementAdapter.java:36)
at org.apache.lucene.util.TestRuleAssertionsRequired$1.evaluate(TestRuleAssertionsRequired.java:53)
at org.apache.lucene.util.TestRuleMarkFailure$1.evaluate(TestRuleMarkFailure.java:47)
at org.apache.lucene.util.TestRuleIgnoreAfterMaxFailures$1.evaluate(TestRuleIgnoreAfterMaxFailures.java:64)
at org.apache.lucene.util.TestRuleIgnoreTestSuites$1.evaluate(TestRuleIgnoreTestSuites.java:54)
at com.carrotsearch.randomizedtesting.rules.StatementAdapter.evaluate(StatementAdapter.java:36)
at com.carrotsearch.randomizedtesting.ThreadLeakControl$StatementRunner.run(ThreadLeakControl.java:368)
at java.lang.Thread.run(Thread.java:748)
Caused by: org.apache.solr.client.solrj.impl.HttpSolrClient$RemoteSolrException: Error from server at http://127.0.0.1:42231/solr/collection1_shard2_replica_n3: Expected mime type application/octet-stream but got text/html. <html>
<head>
<meta http-equiv="Content-Type" content="text/html;charset=utf-8"/>
<title>Error 404 Can not find: /solr/collection1_shard2_replica_n3/update</title>
</head>
<body><h2>HTTP ERROR 404</h2>
<p>Problem accessing /solr/collection1_shard2_replica_n3/update. Reason:
<pre> Can not find: /solr/collection1_shard2_replica_n3/update</pre></p><hr><a href="http://eclipse.org/jetty">Powered by Jetty:// 9.4.11.v20180605</a><hr/>
</body>
</html>
at org.apache.solr.client.solrj.impl.HttpSolrClient.executeMethod(HttpSolrClient.java:607)
at org.apache.solr.client.solrj.impl.HttpSolrClient.request(HttpSolrClient.java:255)
at org.apache.solr.client.solrj.impl.HttpSolrClient.request(HttpSolrClient.java:244)
at org.apache.solr.client.solrj.impl.LBHttpSolrClient.doRequest(LBHttpSolrClient.java:483)
at org.apache.solr.client.solrj.impl.LBHttpSolrClient.request(LBHttpSolrClient.java:413)
at org.apache.solr.client.solrj.impl.CloudSolrClient.lambda$directUpdate$0(CloudSolrClient.java:528)
at java.util.concurrent.FutureTask.run(FutureTask.java:266)
at org.apache.solr.common.util.ExecutorUtil$MDCAwareThreadPoolExecutor.lambda$execute$0(ExecutorUtil.java:209)
at java.util.concurrent.ThreadPoolExecutor.runWorker(ThreadPoolExecutor.java:1149)
at java.util.concurrent.ThreadPoolExecutor$Worker.run(ThreadPoolExecutor.java:624)
... 1 more
Build Log:
[...truncated 16451 lines...]
[junit4] Suite: org.apache.solr.client.solrj.impl.CloudSolrClientTest
[junit4] 2> Creating dataDir: /home/jenkins/workspace/Lucene-Solr-7.x-Linux/solr/build/solr-solrj/test/J2/temp/solr.client.solrj.impl.CloudSolrClientTest_F21F3742FF47ABF5-001/init-core-data-001
[junit4] 1> 18:43:42.717 [Thread-132] ERROR org.apache.zookeeper.server.ZooKeeperServer - ZKShutdownHandler is not registered, so ZooKeeper server won't take any action on ERROR or SHUTDOWN server state changes
[junit4] 1> 18:43:42.827 [jetty-launcher-187-thread-2] ERROR org.apache.solr.util.StartupLoggingUtils - Missing Java Option solr.log.dir. Logging may be missing or incomplete.
[junit4] 1> 18:43:42.827 [jetty-launcher-187-thread-1] ERROR org.apache.solr.util.StartupLoggingUtils - Missing Java Option solr.log.dir. Logging may be missing or incomplete.
[junit4] 1> 18:43:42.827 [jetty-launcher-187-thread-3] ERROR org.apache.solr.util.StartupLoggingUtils - Missing Java Option solr.log.dir. Logging may be missing or incomplete.
[junit4] 1> -
[junit4] 1> replica:core_node2 rstate:active live:true
[junit4] 1> no one is recoverying
[junit4] 1> -
[junit4] 1> replica:core_node2 rstate:active live:true
[junit4] 1> replica:core_node4 rstate:down live:true
[junit4] 1> -
[junit4] 1> replica:core_node2 rstate:active live:true
[junit4] 1> replica:core_node4 rstate:recovering live:true
[junit4] 1> -
[junit4] 1> replica:core_node2 rstate:active live:true
[junit4] 1> replica:core_node4 rstate:active live:true
[junit4] 1> no one is recoverying
[junit4] 1> -
[junit4] 1> replica:core_node4 rstate:active live:true
[junit4] 1> no one is recoverying
[junit4] 1> 18:43:54.441 [TEST-CloudSolrClientTest.testRetryUpdatesWhenClusterStateIsStale-seed#[F21F3742FF47ABF5]] ERROR org.apache.solr.client.solrj.impl.CloudSolrClient - Request to collection [stale_state_test_col] failed due to (404) org.apache.solr.client.solrj.impl.HttpSolrClient$RemoteSolrException: Error from server at http://127.0.0.1:44569/solr/stale_state_test_col_shard1_replica_n1: Expected mime type application/octet-stream but got text/html. <html>
[junit4] 1> <head>
[junit4] 1> <meta http-equiv="Content-Type" content="text/html;charset=utf-8"/>
[junit4] 1> <title>Error 404 Can not find: /solr/stale_state_test_col_shard1_replica_n1/update</title>
[junit4] 1> </head>
[junit4] 1> <body><h2>HTTP ERROR 404</h2>
[junit4] 1> <p>Problem accessing /solr/stale_state_test_col_shard1_replica_n1/update. Reason:
[junit4] 1> <pre> Can not find: /solr/stale_state_test_col_shard1_replica_n1/update</pre></p><hr><a href="http://eclipse.org/jetty">Powered by Jetty:// 9.4.11.v20180605</a><hr/>
[junit4] 1>
[junit4] 1> </body>
[junit4] 1> </html>
[junit4] 1> , retry? 0
[junit4] 1> 18:44:28.706 [qtp6210481-852] ERROR org.apache.solr.handler.RequestHandlerBase - org.apache.solr.common.SolrException: Collection: boguscollectionname not found
[junit4] 1> at org.apache.solr.handler.admin.ClusterStatus.getClusterStatus(ClusterStatus.java:115)
[junit4] 1> at org.apache.solr.handler.admin.CollectionsHandler$CollectionOperation.lambda$static$22(CollectionsHandler.java:865)
[junit4] 1> at org.apache.solr.handler.admin.CollectionsHandler$CollectionOperation.execute(CollectionsHandler.java:1177)
[junit4] 1> at org.apache.solr.handler.admin.CollectionsHandler.invokeAction(CollectionsHandler.java:258)
[junit4] 1> at org.apache.solr.handler.admin.CollectionsHandler.handleRequestBody(CollectionsHandler.java:246)
[junit4] 1> at org.apache.solr.handler.RequestHandlerBase.handleRequest(RequestHandlerBase.java:199)
[junit4] 1> at org.apache.solr.servlet.HttpSolrCall.handleAdmin(HttpSolrCall.java:734)
[junit4] 1> at org.apache.solr.servlet.HttpSolrCall.handleAdminRequest(HttpSolrCall.java:715)
[junit4] 1> at org.apache.solr.servlet.HttpSolrCall.call(HttpSolrCall.java:496)
[junit4] 1> at org.apache.solr.servlet.SolrDispatchFilter.doFilter(SolrDispatchFilter.java:377)
[junit4] 1> at org.apache.solr.servlet.SolrDispatchFilter.doFilter(SolrDispatchFilter.java:323)
[junit4] 1> at org.eclipse.jetty.servlet.ServletHandler$CachedChain.doFilter(ServletHandler.java:1642)
[junit4] 1> at org.apache.solr.client.solrj.embedded.JettySolrRunner$DebugFilter.doFilter(JettySolrRunner.java:139)
[junit4] 1> at org.eclipse.jetty.servlet.ServletHandler$CachedChain.doFilter(ServletHandler.java:1642)
[junit4] 1> at org.eclipse.jetty.servlet.ServletHandler.doHandle(ServletHandler.java:533)
[junit4] 1> at org.eclipse.jetty.server.handler.ScopedHandler.nextHandle(ScopedHandler.java:255)
[junit4] 1> at org.eclipse.jetty.server.session.SessionHandler.doHandle(SessionHandler.java:1595)
[junit4] 1> at org.eclipse.jetty.server.handler.ScopedHandler.nextHandle(ScopedHandler.java:255)
[junit4] 1> at org.eclipse.jetty.server.handler.ContextHandler.doHandle(ContextHandler.java:1317)
[junit4] 1> at org.eclipse.jetty.server.handler.ScopedHandler.nextScope(ScopedHandler.java:203)
[junit4] 1> at org.eclipse.jetty.servlet.ServletHandler.doScope(ServletHandler.java:473)
[junit4] 1> at org.eclipse.jetty.server.session.SessionHandler.doScope(SessionHandler.java:1564)
[junit4] 1> at org.eclipse.jetty.server.handler.ScopedHandler.nextScope(ScopedHandler.java:201)
[junit4] 1> at org.eclipse.jetty.server.handler.ContextHandler.doScope(ContextHandler.java:1219)
[junit4] 1> at org.eclipse.jetty.server.handler.ScopedHandler.handle(ScopedHandler.java:144)
[junit4] 1> at org.eclipse.jetty.server.handler.gzip.GzipHandler.handle(GzipHandler.java:724)
[junit4] 1> at org.eclipse.jetty.server.handler.HandlerWrapper.handle(HandlerWrapper.java:132)
[junit4] 1> at org.eclipse.jetty.server.Server.handle(Server.java:531)
[junit4] 1> at org.eclipse.jetty.server.HttpChannel.handle(HttpChannel.java:352)
[junit4] 1> at org.eclipse.jetty.server.HttpConnection.onFillable(HttpConnection.java:260)
[junit4] 1> at org.eclipse.jetty.io.AbstractConnection$ReadCallback.succeeded(AbstractConnection.java:281)
[junit4] 1> at org.eclipse.jetty.io.FillInterest.fillable(FillInterest.java:102)
[junit4] 1> at org.eclipse.jetty.io.ChannelEndPoint$2.run(ChannelEndPoint.java:118)
[junit4] 1> at org.eclipse.jetty.util.thread.strategy.EatWhatYouKill.runTask(EatWhatYouKill.java:333)
[junit4] 1> at org.eclipse.jetty.util.thread.strategy.EatWhatYouKill.doProduce(EatWhatYouKill.java:310)
[junit4] 1> at org.eclipse.jetty.util.thread.strategy.EatWhatYouKill.tryProduce(EatWhatYouKill.java:168)
[junit4] 1> at org.eclipse.jetty.util.thread.strategy.EatWhatYouKill.run(EatWhatYouKill.java:126)
[junit4] 1> at org.eclipse.jetty.util.thread.ReservedThreadExecutor$ReservedThread.run(ReservedThreadExecutor.java:366)
[junit4] 1> at org.eclipse.jetty.util.thread.QueuedThreadPool.runJob(QueuedThreadPool.java:762)
[junit4] 1> at org.eclipse.jetty.util.thread.QueuedThreadPool$2.run(QueuedThreadPool.java:680)
[junit4] 1> at java.lang.Thread.run(Thread.java:748)
[junit4] 1>
[junit4] 1> 18:44:28.708 [qtp26263352-741] ERROR org.apache.solr.handler.RequestHandlerBase - org.apache.solr.common.SolrException: Collection: boguscollectionname not found
[junit4] 1> at org.apache.solr.handler.admin.ClusterStatus.getClusterStatus(ClusterStatus.java:115)
[junit4] 1> at org.apache.solr.handler.admin.CollectionsHandler$CollectionOperation.lambda$static$22(CollectionsHandler.java:865)
[junit4] 1> at org.apache.solr.handler.admin.CollectionsHandler$CollectionOperation.execute(CollectionsHandler.java:1177)
[junit4] 1> at org.apache.solr.handler.admin.CollectionsHandler.invokeAction(CollectionsHandler.java:258)
[junit4] 1> at org.apache.solr.handler.admin.CollectionsHandler.handleRequestBody(CollectionsHandler.java:246)
[junit4] 1> at org.apache.solr.handler.RequestHandlerBase.handleRequest(RequestHandlerBase.java:199)
[junit4] 1> at org.apache.solr.servlet.HttpSolrCall.handleAdmin(HttpSolrCall.java:734)
[junit4] 1> at org.apache.solr.servlet.HttpSolrCall.handleAdminRequest(HttpSolrCall.java:715)
[junit4] 1> at org.apache.solr.servlet.HttpSolrCall.call(HttpSolrCall.java:496)
[junit4] 1> at org.apache.solr.servlet.SolrDispatchFilter.doFilter(SolrDispatchFilter.java:377)
[junit4] 1> at org.apache.solr.servlet.SolrDispatchFilter.doFilter(SolrDispatchFilter.java:323)
[junit4] 1> at org.eclipse.jetty.servlet.ServletHandler$CachedChain.doFilter(ServletHandler.java:1642)
[junit4] 1> at org.apache.solr.client.solrj.embedded.JettySolrRunner$DebugFilter.doFilter(JettySolrRunner.java:139)
[junit4] 1> at org.eclipse.jetty.servlet.ServletHandler$CachedChain.doFilter(ServletHandler.java:1642)
[junit4] 1> at org.eclipse.jetty.servlet.ServletHandler.doHandle(ServletHandler.java:533)
[junit4] 1> at org.eclipse.jetty.server.handler.ScopedHandler.nextHandle(ScopedHandler.java:255)
[junit4] 1> at org.eclipse.jetty.server.session.SessionHandler.doHandle(SessionHandler.java:1595)
[junit4] 1> at org.eclipse.jetty.server.handler.ScopedHandler.nextHandle(ScopedHandler.java:255)
[junit4] 1> at org.eclipse.jetty.server.handler.ContextHandler.doHandle(ContextHandler.java:1317)
[junit4] 1> at org.eclipse.jetty.server.handler.ScopedHandler.nextScope(ScopedHandler.java:203)
[junit4] 1> at org.eclipse.jetty.servlet.ServletHandler.doScope(ServletHandler.java:473)
[junit4] 1> at org.eclipse.jetty.server.session.SessionHandler.doScope(SessionHandler.java:1564)
[junit4] 1> at org.eclipse.jetty.server.handler.ScopedHandler.nextScope(ScopedHandler.java:201)
[junit4] 1> at org.eclipse.jetty.server.handler.ContextHandler.doScope(ContextHandler.java:1219)
[junit4] 1> at org.eclipse.jetty.server.handler.ScopedHandler.handle(ScopedHandler.java:144)
[junit4] 1> at org.eclipse.jetty.server.handler.gzip.GzipHandler.handle(GzipHandler.java:724)
[junit4] 1> at org.eclipse.jetty.server.handler.HandlerWrapper.handle(HandlerWrapper.java:132)
[junit4] 1> at org.eclipse.jetty.server.Server.handle(Server.java:531)
[junit4] 1> at org.eclipse.jetty.server.HttpChannel.handle(HttpChannel.java:352)
[junit4] 1> at org.eclipse.jetty.server.HttpConnection.onFillable(HttpConnection.java:260)
[junit4] 1> at org.eclipse.jetty.io.AbstractConnection$ReadCallback.succeeded(AbstractConnection.java:281)
[junit4] 1> at org.eclipse.jetty.io.FillInterest.fillable(FillInterest.java:102)
[junit4] 1> at org.eclipse.jetty.io.ChannelEndPoint$2.run(ChannelEndPoint.java:118)
[junit4] 1> at org.eclipse.jetty.util.thread.strategy.EatWhatYouKill.runTask(EatWhatYouKill.java:333)
[junit4] 1> at org.eclipse.jetty.util.thread.strategy.EatWhatYouKill.doProduce(EatWhatYouKill.java:310)
[junit4] 1> at org.eclipse.jetty.util.thread.strategy.EatWhatYouKill.tryProduce(EatWhatYouKill.java:168)
[junit4] 1> at org.eclipse.jetty.util.thread.strategy.EatWhatYouKill.run(EatWhatYouKill.java:126)
[junit4] 1> at org.eclipse.jetty.util.thread.ReservedThreadExecutor$ReservedThread.run(ReservedThreadExecutor.java:366)
[junit4] 1> at org.eclipse.jetty.util.thread.QueuedThreadPool.runJob(QueuedThreadPool.java:762)
[junit4] 1> at org.eclipse.jetty.util.thread.QueuedThreadPool$2.run(QueuedThreadPool.java:680)
[junit4] 1> at java.lang.Thread.run(Thread.java:748)
[junit4] 1>
[junit4] 1> 18:44:28.710 [qtp17595679-747] ERROR org.apache.solr.handler.RequestHandlerBase - org.apache.solr.common.SolrException: Collection: boguscollectionname not found
[junit4] 1> at org.apache.solr.handler.admin.ClusterStatus.getClusterStatus(ClusterStatus.java:115)
[junit4] 1> at org.apache.solr.handler.admin.CollectionsHandler$CollectionOperation.lambda$static$22(CollectionsHandler.java:865)
[junit4] 1> at org.apache.solr.handler.admin.CollectionsHandler$CollectionOperation.execute(CollectionsHandler.java:1177)
[junit4] 1> at org.apache.solr.handler.admin.CollectionsHandler.invokeAction(CollectionsHandler.java:258)
[junit4] 1> at org.apache.solr.handler.admin.CollectionsHandler.handleRequestBody(CollectionsHandler.java:246)
[junit4] 1> at org.apache.solr.handler.RequestHandlerBase.handleRequest(RequestHandlerBase.java:199)
[junit4] 1> at org.apache.solr.servlet.HttpSolrCall.handleAdmin(HttpSolrCall.java:734)
[junit4] 1> at org.apache.solr.servlet.HttpSolrCall.handleAdminRequest(HttpSolrCall.java:715)
[junit4] 1> at org.apache.solr.servlet.HttpSolrCall.call(HttpSolrCall.java:496)
[junit4] 1> at org.apache.solr.servlet.SolrDispatchFilter.doFilter(SolrDispatchFilter.java:377)
[junit4] 1> at org.apache.solr.servlet.SolrDispatchFilter.doFilter(SolrDispatchFilter.java:323)
[junit4] 1> at org.eclipse.jetty.servlet.ServletHandler$CachedChain.doFilter(ServletHandler.java:1642)
[junit4] 1> at org.apache.solr.client.solrj.embedded.JettySolrRunner$DebugFilter.doFilter(JettySolrRunner.java:139)
[junit4] 1> at org.eclipse.jetty.servlet.ServletHandler$CachedChain.doFilter(ServletHandler.java:1642)
[junit4] 1> at org.eclipse.jetty.servlet.ServletHandler.doHandle(ServletHandler.java:533)
[junit4] 1> at org.eclipse.jetty.server.handler.ScopedHandler.nextHandle(ScopedHandler.java:255)
[junit4] 1> at org.eclipse.jetty.server.session.SessionHandler.doHandle(SessionHandler.java:1595)
[junit4] 1> at org.eclipse.jetty.server.handler.ScopedHandler.nextHandle(ScopedHandler.java:255)
[junit4] 1> at org.eclipse.jetty.server.handler.ContextHandler.doHandle(ContextHandler.java:1317)
[junit4] 1> at org.eclipse.jetty.server.handler.ScopedHandler.nextScope(ScopedHandler.java:203)
[junit4] 1> at org.eclipse.jetty.servlet.ServletHandler.doScope(ServletHandler.java:473)
[junit4] 1> at org.eclipse.jetty.server.session.SessionHandler.doScope(SessionHandler.java:1564)
[junit4] 1> at org.eclipse.jetty.server.handler.ScopedHandler.nextScope(ScopedHandler.java:201)
[junit4] 1> at org.eclipse.jetty.server.handler.ContextHandler.doScope(ContextHandler.java:1219)
[junit4] 1> at org.eclipse.jetty.server.handler.ScopedHandler.handle(ScopedHandler.java:144)
[junit4] 1> at org.eclipse.jetty.server.handler.gzip.GzipHandler.handle(GzipHandler.java:724)
[junit4] 1> at org.eclipse.jetty.server.handler.HandlerWrapper.handle(HandlerWrapper.java:132)
[junit4] 1> at org.eclipse.jetty.server.Server.handle(Server.java:531)
[junit4] 1> at org.eclipse.jetty.server.HttpChannel.handle(HttpChannel.java:352)
[junit4] 1> at org.eclipse.jetty.server.HttpConnection.onFillable(HttpConnection.java:260)
[junit4] 1> at org.eclipse.jetty.io.AbstractConnection$ReadCallback.succeeded(AbstractConnection.java:281)
[junit4] 1> at org.eclipse.jetty.io.FillInterest.fillable(FillInterest.java:102)
[junit4] 1> at org.eclipse.jetty.io.ChannelEndPoint$2.run(ChannelEndPoint.java:118)
[junit4] 1> at org.eclipse.jetty.util.thread.strategy.EatWhatYouKill.runTask(EatWhatYouKill.java:333)
[junit4] 1> at org.eclipse.jetty.util.thread.strategy.EatWhatYouKill.doProduce(EatWhatYouKill.java:310)
[junit4] 1> at org.eclipse.jetty.util.thread.strategy.EatWhatYouKill.tryProduce(EatWhatYouKill.java:168)
[junit4] 1> at org.eclipse.jetty.util.thread.strategy.EatWhatYouKill.run(EatWhatYouKill.java:126)
[junit4] 1> at org.eclipse.jetty.util.thread.ReservedThreadExecutor$ReservedThread.run(ReservedThreadExecutor.java:366)
[junit4] 1> at org.eclipse.jetty.util.thread.QueuedThreadPool.runJob(QueuedThreadPool.java:762)
[junit4] 1> at org.eclipse.jetty.util.thread.QueuedThreadPool$2.run(QueuedThreadPool.java:680)
[junit4] 1> at java.lang.Thread.run(Thread.java:748)
[junit4] 1>
[junit4] 2> NOTE: reproduce with: ant test -Dtestcase=CloudSolrClientTest -Dtests.method=testCollectionDoesntExist -Dtests.seed=F21F3742FF47ABF5 -Dtests.multiplier=3 -Dtests.slow=true -Dtests.locale=tr-TR -Dtests.timezone=PRC -Dtests.asserts=true -Dtests.file.encoding=US-ASCII
[junit4] ERROR 1.55s J2 | CloudSolrClientTest.testCollectionDoesntExist <<<
[junit4] > Throwable #1: java.lang.RuntimeException: Tried fetching cluster state using the node names we knew of, i.e. [127.0.0.1:44569_solr, 127.0.0.1:42231_solr, 127.0.0.1:39915_solr]. However, succeeded in obtaining the cluster state from none of them.If you think your Solr cluster is up and is accessible, you could try re-creating a new CloudSolrClient using working solrUrl(s) or zkHost(s).
[junit4] > at __randomizedtesting.SeedInfo.seed([F21F3742FF47ABF5:90BC29ECFDC5CFE5]:0)
[junit4] > at org.apache.solr.client.solrj.impl.HttpClusterStateProvider.getState(HttpClusterStateProvider.java:108)
[junit4] > at org.apache.solr.client.solrj.impl.CloudSolrClient.resolveAliases(CloudSolrClient.java:1115)
[junit4] > at org.apache.solr.client.solrj.impl.CloudSolrClient.requestWithRetryOnStaleState(CloudSolrClient.java:844)
[junit4] > at org.apache.solr.client.solrj.impl.CloudSolrClient.request(CloudSolrClient.java:817)
[junit4] > at org.apache.solr.client.solrj.SolrRequest.process(SolrRequest.java:194)
[junit4] > at org.apache.solr.client.solrj.SolrClient.add(SolrClient.java:177)
[junit4] > at org.apache.solr.client.solrj.SolrClient.add(SolrClient.java:138)
[junit4] > at org.apache.solr.client.solrj.impl.CloudSolrClientTest.testCollectionDoesntExist(CloudSolrClientTest.java:779)
[junit4] > at java.lang.Thread.run(Thread.java:748)
[junit4] 1> 18:44:28.753 [TEST-CloudSolrClientTest.testShutdown-seed#[F21F3742FF47ABF5]-SendThread(ff01::114:33332)] ERROR org.apache.zookeeper.ClientCnxnSocketNIO - Unable to open socket to ff01::114/ff01:0:0:0:0:0:0:114:33332
[junit4] 1> 18:44:29.854 [TEST-CloudSolrClientTest.testShutdown-seed#[F21F3742FF47ABF5]-SendThread(ff01::114:33332)] ERROR org.apache.zookeeper.ClientCnxnSocketNIO - Unable to open socket to ff01::114/ff01:0:0:0:0:0:0:114:33332
[junit4] 1> 18:44:32.846 [TEST-CloudSolrClientTest.testRouting-seed#[F21F3742FF47ABF5]] ERROR org.apache.solr.client.solrj.impl.CloudSolrClient - Request to collection [collection1] failed due to (404) org.apache.solr.client.solrj.impl.HttpSolrClient$RemoteSolrException: Error from server at http://127.0.0.1:42231/solr/collection1_shard2_replica_n3: Expected mime type application/octet-stream but got text/html. <html>
[junit4] 1> <head>
[junit4] 1> <meta http-equiv="Content-Type" content="text/html;charset=utf-8"/>
[junit4] 1> <title>Error 404 Can not find: /solr/collection1_shard2_replica_n3/update</title>
[junit4] 1> </head>
[junit4] 1> <body><h2>HTTP ERROR 404</h2>
[junit4] 1> <p>Problem accessing /solr/collection1_shard2_replica_n3/update. Reason:
[junit4] 1> <pre> Can not find: /solr/collection1_shard2_replica_n3/update</pre></p><hr><a href="http://eclipse.org/jetty">Powered by Jetty:// 9.4.11.v20180605</a><hr/>
[junit4] 1>
[junit4] 1> </body>
[junit4] 1> </html>
[junit4] 1> , retry? 0
[junit4] 1> 18:44:32.850 [TEST-CloudSolrClientTest.testRouting-seed#[F21F3742FF47ABF5]] ERROR org.apache.solr.client.solrj.impl.CloudSolrClient - Request to collection [collection1] failed due to (404) org.apache.solr.client.solrj.impl.HttpSolrClient$RemoteSolrException: Error from server at http://127.0.0.1:42231/solr/collection1_shard2_replica_n3: Expected mime type application/octet-stream but got text/html. <html>
[junit4] 1> <head>
[junit4] 1> <meta http-equiv="Content-Type" content="text/html;charset=utf-8"/>
[junit4] 1> <title>Error 404 Can not find: /solr/collection1_shard2_replica_n3/update</title>
[junit4] 1> </head>
[junit4] 1> <body><h2>HTTP ERROR 404</h2>
[junit4] 1> <p>Problem accessing /solr/collection1_shard2_replica_n3/update. Reason:
[junit4] 1> <pre> Can not find: /solr/collection1_shard2_replica_n3/update</pre></p><hr><a href="http://eclipse.org/jetty">Powered by Jetty:// 9.4.11.v20180605</a><hr/>
[junit4] 1>
[junit4] 1> </body>
[junit4] 1> </html>
[junit4] 1> , retry? 1
[junit4] 1> 18:44:32.852 [TEST-CloudSolrClientTest.testRouting-seed#[F21F3742FF47ABF5]] ERROR org.apache.solr.client.solrj.impl.CloudSolrClient - Request to collection [collection1] failed due to (404) org.apache.solr.client.solrj.impl.HttpSolrClient$RemoteSolrException: Error from server at http://127.0.0.1:42231/solr/collection1_shard2_replica_n3: Expected mime type application/octet-stream but got text/html. <html>
[junit4] 1> <head>
[junit4] 1> <meta http-equiv="Content-Type" content="text/html;charset=utf-8"/>
[junit4] 1> <title>Error 404 Can not find: /solr/collection1_shard2_replica_n3/update</title>
[junit4] 1> </head>
[junit4] 1> <body><h2>HTTP ERROR 404</h2>
[junit4] 1> <p>Problem accessing /solr/collection1_shard2_replica_n3/update. Reason:
[junit4] 1> <pre> Can not find: /solr/collection1_shard2_replica_n3/update</pre></p><hr><a href="http://eclipse.org/jetty">Powered by Jetty:// 9.4.11.v20180605</a><hr/>
[junit4] 1>
[junit4] 1> </body>
[junit4] 1> </html>
[junit4] 1> , retry? 2
[junit4] 1> 18:44:32.856 [TEST-CloudSolrClientTest.testRouting-seed#[F21F3742FF47ABF5]] ERROR org.apache.solr.client.solrj.impl.CloudSolrClient - Request to collection [collection1] failed due to (404) org.apache.solr.client.solrj.impl.HttpSolrClient$RemoteSolrException: Error from server at http://127.0.0.1:42231/solr/collection1_shard2_replica_n3: Expected mime type application/octet-stream but got text/html. <html>
[junit4] 1> <head>
[junit4] 1> <meta http-equiv="Content-Type" content="text/html;charset=utf-8"/>
[junit4] 1> <title>Error 404 Can not find: /solr/collection1_shard2_replica_n3/update</title>
[junit4] 1> </head>
[junit4] 1> <body><h2>HTTP ERROR 404</h2>
[junit4] 1> <p>Problem accessing /solr/collection1_shard2_replica_n3/update. Reason:
[junit4] 1> <pre> Can not find: /solr/collection1_shard2_replica_n3/update</pre></p><hr><a href="http://eclipse.org/jetty">Powered by Jetty:// 9.4.11.v20180605</a><hr/>
[junit4] 1>
[junit4] 1> </body>
[junit4] 1> </html>
[junit4] 1> , retry? 3
[junit4] 1> 18:44:32.858 [TEST-CloudSolrClientTest.testRouting-seed#[F21F3742FF47ABF5]] ERROR org.apache.solr.client.solrj.impl.CloudSolrClient - Request to collection [collection1] failed due to (404) org.apache.solr.client.solrj.impl.HttpSolrClient$RemoteSolrException: Error from server at http://127.0.0.1:42231/solr/collection1_shard2_replica_n3: Expected mime type application/octet-stream but got text/html. <html>
[junit4] 1> <head>
[junit4] 1> <meta http-equiv="Content-Type" content="text/html;charset=utf-8"/>
[junit4] 1> <title>Error 404 Can not find: /solr/collection1_shard2_replica_n3/update</title>
[junit4] 1> </head>
[junit4] 1> <body><h2>HTTP ERROR 404</h2>
[junit4] 1> <p>Problem accessing /solr/collection1_shard2_replica_n3/update. Reason:
[junit4] 1> <pre> Can not find: /solr/collection1_shard2_replica_n3/update</pre></p><hr><a href="http://eclipse.org/jetty">Powered by Jetty:// 9.4.11.v20180605</a><hr/>
[junit4] 1>
[junit4] 1> </body>
[junit4] 1> </html>
[junit4] 1> , retry? 4
[junit4] 1> 18:44:32.860 [TEST-CloudSolrClientTest.testRouting-seed#[F21F3742FF47ABF5]] ERROR org.apache.solr.client.solrj.impl.CloudSolrClient - Request to collection [collection1] failed due to (404) org.apache.solr.client.solrj.impl.HttpSolrClient$RemoteSolrException: Error from server at http://127.0.0.1:42231/solr/collection1_shard2_replica_n3: Expected mime type application/octet-stream but got text/html. <html>
[junit4] 1> <head>
[junit4] 1> <meta http-equiv="Content-Type" content="text/html;charset=utf-8"/>
[junit4] 1> <title>Error 404 Can not find: /solr/collection1_shard2_replica_n3/update</title>
[junit4] 1> </head>
[junit4] 1> <body><h2>HTTP ERROR 404</h2>
[junit4] 1> <p>Problem accessing /solr/collection1_shard2_replica_n3/update. Reason:
[junit4] 1> <pre> Can not find: /solr/collection1_shard2_replica_n3/update</pre></p><hr><a href="http://eclipse.org/jetty">Powered by Jetty:// 9.4.11.v20180605</a><hr/>
[junit4] 1>
[junit4] 1> </body>
[junit4] 1> </html>
[junit4] 1> , retry? 5
[junit4] 2> NOTE: reproduce with: ant test -Dtestcase=CloudSolrClientTest -Dtests.method=testRouting -Dtests.seed=F21F3742FF47ABF5 -Dtests.multiplier=3 -Dtests.slow=true -Dtests.locale=tr-TR -Dtests.timezone=PRC -Dtests.asserts=true -Dtests.file.encoding=US-ASCII
[junit4] ERROR 2.87s J2 | CloudSolrClientTest.testRouting <<<
[junit4] > Throwable #1: org.apache.solr.client.solrj.impl.CloudSolrClient$RouteException: Error from server at http://127.0.0.1:42231/solr/collection1_shard2_replica_n3: Expected mime type application/octet-stream but got text/html. <html>
[junit4] > <head>
[junit4] > <meta http-equiv="Content-Type" content="text/html;charset=utf-8"/>
[junit4] > <title>Error 404 Can not find: /solr/collection1_shard2_replica_n3/update</title>
[junit4] > </head>
[junit4] > <body><h2>HTTP ERROR 404</h2>
[junit4] > <p>Problem accessing /solr/collection1_shard2_replica_n3/update. Reason:
[junit4] > <pre> Can not find: /solr/collection1_shard2_replica_n3/update</pre></p><hr><a href="http://eclipse.org/jetty">Powered by Jetty:// 9.4.11.v20180605</a><hr/>
[junit4] > </body>
[junit4] > </html>
[junit4] > at __randomizedtesting.SeedInfo.seed([F21F3742FF47ABF5:30A80B2AFC075B8D]:0)
[junit4] > at org.apache.solr.client.solrj.impl.CloudSolrClient.directUpdate(CloudSolrClient.java:551)
[junit4] > at org.apache.solr.client.solrj.impl.CloudSolrClient.sendRequest(CloudSolrClient.java:1016)
[junit4] > at org.apache.solr.client.solrj.impl.CloudSolrClient.requestWithRetryOnStaleState(CloudSolrClient.java:884)
[junit4] > at org.apache.solr.client.solrj.impl.CloudSolrClient.requestWithRetryOnStaleState(CloudSolrClient.java:949)
[junit4] > at org.apache.solr.client.solrj.impl.CloudSolrClient.requestWithRetryOnStaleState(CloudSolrClient.java:949)
[junit4] > at org.apache.solr.client.solrj.impl.CloudSolrClient.requestWithRetryOnStaleState(CloudSolrClient.java:949)
[junit4] > at org.apache.solr.client.solrj.impl.CloudSolrClient.requestWithRetryOnStaleState(CloudSolrClient.java:949)
[junit4] > at org.apache.solr.client.solrj.impl.CloudSolrClient.requestWithRetryOnStaleState(CloudSolrClient.java:949)
[junit4] > at org.apache.solr.client.solrj.impl.CloudSolrClient.request(CloudSolrClient.java:817)
[junit4] > at org.apache.solr.client.solrj.SolrRequest.process(SolrRequest.java:194)
[junit4] > at org.apache.solr.client.solrj.request.UpdateRequest.commit(UpdateRequest.java:237)
[junit4] > at org.apache.solr.client.solrj.impl.CloudSolrClientTest.testRouting(CloudSolrClientTest.java:269)
[junit4] > at java.lang.Thread.run(Thread.java:748)
[junit4] > Caused by: org.apache.solr.client.solrj.impl.HttpSolrClient$RemoteSolrException: Error from server at http://127.0.0.1:42231/solr/collection1_shard2_replica_n3: Expected mime type application/octet-stream but got text/html. <html>
[junit4] > <head>
[junit4] > <meta http-equiv="Content-Type" content="text/html;charset=utf-8"/>
[junit4] > <title>Error 404 Can not find: /solr/collection1_shard2_replica_n3/update</title>
[junit4] > </head>
[junit4] > <body><h2>HTTP ERROR 404</h2>
[junit4] > <p>Problem accessing /solr/collection1_shard2_replica_n3/update. Reason:
[junit4] > <pre> Can not find: /solr/collection1_shard2_replica_n3/update</pre></p><hr><a href="http://eclipse.org/jetty">Powered by Jetty:// 9.4.11.v20180605</a><hr/>
[junit4] > </body>
[junit4] > </html>
[junit4] > at org.apache.solr.client.solrj.impl.HttpSolrClient.executeMethod(HttpSolrClient.java:607)
[junit4] > at org.apache.solr.client.solrj.impl.HttpSolrClient.request(HttpSolrClient.java:255)
[junit4] > at org.apache.solr.client.solrj.impl.HttpSolrClient.request(HttpSolrClient.java:244)
[junit4] > at org.apache.solr.client.solrj.impl.LBHttpSolrClient.doRequest(LBHttpSolrClient.java:483)
[junit4] > at org.apache.solr.client.solrj.impl.LBHttpSolrClient.request(LBHttpSolrClient.java:413)
[junit4] > at org.apache.solr.client.solrj.impl.CloudSolrClient.lambda$directUpdate$0(CloudSolrClient.java:528)
[junit4] > at java.util.concurrent.FutureTask.run(FutureTask.java:266)
[junit4] > at org.apache.solr.common.util.ExecutorUtil$MDCAwareThreadPoolExecutor.lambda$execute$0(ExecutorUtil.java:209)
[junit4] > at java.util.concurrent.ThreadPoolExecutor.runWorker(ThreadPoolExecutor.java:1149)
[junit4] > at java.util.concurrent.ThreadPoolExecutor$Worker.run(ThreadPoolExecutor.java:624)
[junit4] > ... 1 more
[junit4] 1> -
[junit4] 1> replica:core_node3 rstate:active live:true
[junit4] 1> replica:core_node5 rstate:active live:true
[junit4] 1> replica:core_node6 rstate:active live:true
[junit4] 1> no one is recoverying
[junit4] 1> 18:44:45.199 [qtp17595679-857] ERROR org.apache.solr.handler.RequestHandlerBase - org.apache.solr.common.SolrException: Unknown action: foobar
[junit4] 1> at org.apache.solr.handler.admin.ConfigSetsHandler.handleRequestBody(ConfigSetsHandler.java:109)
[junit4] 1> at org.apache.solr.handler.RequestHandlerBase.handleRequest(RequestHandlerBase.java:199)
[junit4] 1> at org.apache.solr.servlet.HttpSolrCall.handleAdmin(HttpSolrCall.java:734)
[junit4] 1> at org.apache.solr.servlet.HttpSolrCall.handleAdminRequest(HttpSolrCall.java:715)
[junit4] 1> at org.apache.solr.servlet.HttpSolrCall.call(HttpSolrCall.java:496)
[junit4] 1> at org.apache.solr.servlet.SolrDispatchFilter.doFilter(SolrDispatchFilter.java:377)
[junit4] 1> at org.apache.solr.servlet.SolrDispatchFilter.doFilter(SolrDispatchFilter.java:323)
[junit4] 1> at org.eclipse.jetty.servlet.ServletHandler$CachedChain.doFilter(ServletHandler.java:1642)
[junit4] 1> at org.apache.solr.client.solrj.embedded.JettySolrRunner$DebugFilter.doFilter(JettySolrRunner.java:139)
[junit4] 1> at org.eclipse.jetty.servlet.ServletHandler$CachedChain.doFilter(ServletHandler.java:1642)
[junit4] 1> at org.eclipse.jetty.servlet.ServletHandler.doHandle(ServletHandler.java:533)
[junit4] 1> at org.eclipse.jetty.server.handler.ScopedHandler.nextHandle(ScopedHandler.java:255)
[junit4] 1> at org.eclipse.jetty.server.session.SessionHandler.doHandle(SessionHandler.java:1595)
[junit4] 1> at org.eclipse.jetty.server.handler.ScopedHandler.nextHandle(ScopedHandler.java:255)
[junit4] 1> at org.eclipse.jetty.server.handler.ContextHandler.doHandle(ContextHandler.java:1317)
[junit4] 1> at org.eclipse.jetty.server.handler.ScopedHandler.nextScope(ScopedHandler.java:203)
[junit4] 1> at org.eclipse.jetty.servlet.ServletHandler.doScope(ServletHandler.java:473)
[junit4] 1> at org.eclipse.jetty.server.session.SessionHandler.doScope(SessionHandler.java:1564)
[junit4] 1> at org.eclipse.jetty.server.handler.ScopedHandler.nextScope(ScopedHandler.java:201)
[junit4] 1> at org.eclipse.jetty.server.handler.ContextHandler.doScope(ContextHandler.java:1219)
[junit4] 1> at org.eclipse.jetty.server.handler.ScopedHandler.handle(ScopedHandler.java:144)
[junit4] 1> at org.eclipse.jetty.server.handler.gzip.GzipHandler.handle(GzipHandler.java:724)
[junit4] 1> at org.eclipse.jetty.server.handler.HandlerWrapper.handle(HandlerWrapper.java:132)
[junit4] 1> at org.eclipse.jetty.server.Server.handle(Server.java:531)
[junit4] 1> at org.eclipse.jetty.server.HttpChannel.handle(HttpChannel.java:352)
[junit4] 1> at org.eclipse.jetty.server.HttpConnection.onFillable(HttpConnection.java:260)
[junit4] 1> at org.eclipse.jetty.io.AbstractConnection$ReadCallback.succeeded(AbstractConnection.java:281)
[junit4] 1> at org.eclipse.jetty.io.FillInterest.fillable(FillInterest.java:102)
[junit4] 1> at org.eclipse.jetty.io.ChannelEndPoint$2.run(ChannelEndPoint.java:118)
[junit4] 1> at org.eclipse.jetty.util.thread.strategy.EatWhatYouKill.runTask(EatWhatYouKill.java:333)
[junit4] 1> at org.eclipse.jetty.util.thread.strategy.EatWhatYouKill.doProduce(EatWhatYouKill.java:310)
[junit4] 1> at org.eclipse.jetty.util.thread.strategy.EatWhatYouKill.tryProduce(EatWhatYouKill.java:168)
[junit4] 1> at org.eclipse.jetty.util.thread.strategy.EatWhatYouKill.run(EatWhatYouKill.java:126)
[junit4] 1> at org.eclipse.jetty.util.thread.ReservedThreadExecutor$ReservedThread.run(ReservedThreadExecutor.java:366)
[junit4] 1> at org.eclipse.jetty.util.thread.QueuedThreadPool.runJob(QueuedThreadPool.java:762)
[junit4] 1> at org.eclipse.jetty.util.thread.QueuedThreadPool$2.run(QueuedThreadPool.java:680)
[junit4] 1> at java.lang.Thread.run(Thread.java:748)
[junit4] 1>
[junit4] 1> 18:44:45.214 [qtp17595679-861] ERROR org.apache.solr.handler.RequestHandlerBase - org.apache.solr.common.SolrException: Unknown action: foobar
[junit4] 1> at org.apache.solr.handler.admin.CollectionsHandler.handleRequestBody(CollectionsHandler.java:241)
[junit4] 1> at org.apache.solr.handler.RequestHandlerBase.handleRequest(RequestHandlerBase.java:199)
[junit4] 1> at org.apache.solr.servlet.HttpSolrCall.handleAdmin(HttpSolrCall.java:734)
[junit4] 1> at org.apache.solr.servlet.HttpSolrCall.handleAdminRequest(HttpSolrCall.java:715)
[junit4] 1> at org.apache.solr.servlet.HttpSolrCall.call(HttpSolrCall.java:496)
[junit4] 1> at org.apache.solr.servlet.SolrDispatchFilter.doFilter(SolrDispatchFilter.java:377)
[junit4] 1> at org.apache.solr.servlet.SolrDispatchFilter.doFilter(SolrDispatchFilter.java:323)
[junit4] 1> at org.eclipse.jetty.servlet.ServletHandler$CachedChain.doFilter(ServletHandler.java:1642)
[junit4] 1> at org.apache.solr.client.solrj.embedded.JettySolrRunner$DebugFilter.doFilter(JettySolrRunner.java:139)
[junit4] 1> at org.eclipse.jetty.servlet.ServletHandler$CachedChain.doFilter(ServletHandler.java:1642)
[junit4] 1> at org.eclipse.jetty.servlet.ServletHandler.doHandle(ServletHandler.java:533)
[junit4] 1> at org.eclipse.jetty.server.handler.ScopedHandler.nextHandle(ScopedHandler.java:255)
[junit4] 1> at org.eclipse.jetty.server.session.SessionHandler.doHandle(SessionHandler.java:1595)
[junit4] 1> at org.eclipse.jetty.server.handler.ScopedHandler.nextHandle(ScopedHandler.java:255)
[junit4] 1> at org.eclipse.jetty.server.handler.ContextHandler.doHandle(ContextHandler.java:1317)
[junit4] 1> at org.eclipse.jetty.server.handler.ScopedHandler.nextScope(ScopedHandler.java:203)
[junit4] 1> at org.eclipse.jetty.servlet.ServletHandler.doScope(ServletHandler.java:473)
[junit4] 1> at org.eclipse.jetty.server.session.SessionHandler.doScope(SessionHandler.java:1564)
[junit4] 1> at org.eclipse.jetty.server.handler.ScopedHandler.nextScope(ScopedHandler.java:201)
[junit4] 1> at org.eclipse.jetty.server.handler.ContextHandler.doScope(ContextHandler.java:1219)
[junit4] 1> at org.eclipse.jetty.server.handler.ScopedHandler.handle(ScopedHandler.java:144)
[junit4] 1> at org.eclipse.jetty.server.handler.gzip.GzipHandler.handle(GzipHandler.java:724)
[junit4] 1> at org.eclipse.jetty.server.handler.HandlerWrapper.handle(HandlerWrapper.java:132)
[junit4] 1> at org.eclipse.jetty.server.Server.handle(Server.java:531)
[junit4] 1> at org.eclipse.jetty.server.HttpChannel.handle(HttpChannel.java:352)
[junit4] 1> at org.eclipse.jetty.server.HttpConnection.onFillable(HttpConnection.java:260)
[junit4] 1> at org.eclipse.jetty.io.AbstractConnection$ReadCallback.succeeded(AbstractConnection.java:281)
[junit4] 1> at org.eclipse.jetty.io.FillInterest.fillable(FillInterest.java:102)
[junit4] 1> at org.eclipse.jetty.io.ChannelEndPoint$2.run(ChannelEndPoint.java:118)
[junit4] 1> at org.eclipse.jetty.util.thread.strategy.EatWhatYouKill.runTask(EatWhatYouKill.java:333)
[junit4] 1> at org.eclipse.jetty.util.thread.strategy.EatWhatYouKill.doProduce(EatWhatYouKill.java:310)
[junit4] 1> at org.eclipse.jetty.util.thread.strategy.EatWhatYouKill.tryProduce(EatWhatYouKill.java:168)
[junit4] 1> at org.eclipse.jetty.util.thread.strategy.EatWhatYouKill.run(EatWhatYouKill.java:126)
[junit4] 1> at org.eclipse.jetty.util.thread.ReservedThreadExecutor$ReservedThread.run(ReservedThreadExecutor.java:366)
[junit4] 1> at org.eclipse.jetty.util.thread.QueuedThreadPool.runJob(QueuedThreadPool.java:762)
[junit4] 1> at org.eclipse.jetty.util.thread.QueuedThreadPool$2.run(QueuedThreadPool.java:680)
[junit4] 1> at java.lang.Thread.run(Thread.java:748)
[junit4] 1>
[junit4] 1> 18:44:45.226 [qtp17595679-857] ERROR org.apache.solr.handler.RequestHandlerBase - org.apache.solr.common.SolrException: Unsupported operation: foobar
[junit4] 1> at org.apache.solr.handler.admin.CoreAdminHandler.handleCustomAction(CoreAdminHandler.java:220)
[junit4] 1> at org.apache.solr.handler.admin.CoreAdminHandler.handleRequestBody(CoreAdminHandler.java:169)
[junit4] 1> at org.apache.solr.handler.RequestHandlerBase.handleRequest(RequestHandlerBase.java:199)
[junit4] 1> at org.apache.solr.servlet.HttpSolrCall.handleAdmin(HttpSolrCall.java:734)
[junit4] 1> at org.apache.solr.servlet.HttpSolrCall.handleAdminRequest(HttpSolrCall.java:715)
[junit4] 1> at org.apache.solr.servlet.HttpSolrCall.call(HttpSolrCall.java:496)
[junit4] 1> at org.apache.solr.servlet.SolrDispatchFilter.doFilter(SolrDispatchFilter.java:377)
[junit4] 1> at org.apache.solr.servlet.SolrDispatchFilter.doFilter(SolrDispatchFilter.java:323)
[junit4] 1> at org.eclipse.jetty.servlet.ServletHandler$CachedChain.doFilter(ServletHandler.java:1642)
[junit4] 1> at org.apache.solr.client.solrj.embedded.JettySolrRunner$DebugFilter.doFilter(JettySolrRunner.java:139)
[junit4] 1> at org.eclipse.jetty.servlet.ServletHandler$CachedChain.doFilter(ServletHandler.java:1642)
[junit4] 1> at org.eclipse.jetty.servlet.ServletHandler.doHandle(ServletHandler.java:533)
[junit4] 1> at org.eclipse.jetty.server.handler.ScopedHandler.nextHandle(ScopedHandler.java:255)
[junit4] 1> at org.eclipse.jetty.server.session.SessionHandler.doHandle(SessionHandler.java:1595)
[junit4] 1> at org.eclipse.jetty.server.handler.ScopedHandler.nextHandle(ScopedHandler.java:255)
[junit4] 1> at org.eclipse.jetty.server.handler.ContextHandler.doHandle(ContextHandler.java:1317)
[junit4] 1> at org.eclipse.jetty.server.handler.ScopedHandler.nextScope(ScopedHandler.java:203)
[junit4] 1> at org.eclipse.jetty.servlet.ServletHandler.doScope(ServletHandler.java:473)
[junit4] 1> at org.eclipse.jetty.server.session.SessionHandler.doScope(SessionHandler.java:1564)
[junit4] 1> at org.eclipse.jetty.server.handler.ScopedHandler.nextScope(ScopedHandler.java:201)
[junit4] 1> at org.eclipse.jetty.server.handler.ContextHandler.doScope(ContextHandler.java:1219)
[junit4] 1> at org.eclipse.jetty.server.handler.ScopedHandler.handle(ScopedHandler.java:144)
[junit4] 1> at org.eclipse.jetty.server.handler.gzip.GzipHandler.handle(GzipHandler.java:724)
[junit4] 1> at org.eclipse.jetty.server.handler.HandlerWrapper.handle(HandlerWrapper.java:132)
[junit4] 1> at org.eclipse.jetty.server.Server.handle(Server.java:531)
[junit4] 1> at org.eclipse.jetty.server.HttpChannel.handle(HttpChannel.java:352)
[junit4] 1> at org.eclipse.jetty.server.HttpConnection.onFillable(HttpConnection.java:260)
[junit4] 1> at org.eclipse.jetty.io.AbstractConnection$ReadCallback.succeeded(AbstractConnection.java:281)
[junit4] 1> at org.eclipse.jetty.io.FillInterest.fillable(FillInterest.java:102)
[junit4] 1> at org.eclipse.jetty.io.ChannelEndPoint$2.run(ChannelEndPoint.java:118)
[junit4] 1> at org.eclipse.jetty.util.thread.strategy.EatWhatYouKill.runTask(EatWhatYouKill.java:333)
[junit4] 1> at org.eclipse.jetty.util.thread.strategy.EatWhatYouKill.doProduce(EatWhatYouKill.java:310)
[junit4] 1> at org.eclipse.jetty.util.thread.strategy.EatWhatYouKill.tryProduce(EatWhatYouKill.java:168)
[junit4] 1> at org.eclipse.jetty.util.thread.strategy.EatWhatYouKill.run(EatWhatYouKill.java:126)
[junit4] 1> at org.eclipse.jetty.util.thread.ReservedThreadExecutor$ReservedThread.run(ReservedThreadExecutor.java:366)
[junit4] 1> at org.eclipse.jetty.util.thread.QueuedThreadPool.runJob(QueuedThreadPool.java:762)
[junit4] 1> at org.eclipse.jetty.util.thread.QueuedThreadPool$2.run(QueuedThreadPool.java:680)
[junit4] 1> at java.lang.Thread.run(Thread.java:748)
[junit4] 1>
[junit4] 1> 18:44:45.276 [SUITE-CloudSolrClientTest-seed#[F21F3742FF47ABF5]-worker] ERROR org.apache.zookeeper.server.ZooKeeperServer - ZKShutdownHandler is not registered, so ZooKeeper server won't take any action on ERROR or SHUTDOWN server state changes
[junit4] 2> NOTE: leaving temporary files on disk at: /home/jenkins/workspace/Lucene-Solr-7.x-Linux/solr/build/solr-solrj/test/J2/temp/solr.client.solrj.impl.CloudSolrClientTest_F21F3742FF47ABF5-001
[junit4] 2> Nov 07, 2018 6:44:45 PM com.carrotsearch.randomizedtesting.ThreadLeakControl checkThreadLeaks
[junit4] 2> WARNING: Will linger awaiting termination of 7 leaked thread(s).
[junit4] 2> NOTE: test params are: codec=Asserting(Lucene70): {_version_=PostingsFormat(name=Memory), multiDefault=PostingsFormat(name=LuceneVarGapFixedInterval), a_t=PostingsFormat(name=LuceneVarGapFixedInterval), title_s=PostingsFormat(name=LuceneVarGapFixedInterval), intDefault=PostingsFormat(name=Memory), id=Lucene50(blocksize=128), text=PostingsFormat(name=Memory), timestamp=PostingsFormat(name=LuceneVarGapFixedInterval)}, docValues:{_version_=DocValuesFormat(name=Direct), multiDefault=DocValuesFormat(name=Asserting), a_t=DocValuesFormat(name=Asserting), title_s=DocValuesFormat(name=Asserting), intDefault=DocValuesFormat(name=Direct), id=DocValuesFormat(name=Lucene70), text=DocValuesFormat(name=Memory), timestamp=DocValuesFormat(name=Asserting)}, maxPointsInLeafNode=16, maxMBSortInHeap=7.687861144723305, sim=RandomSimilarity(queryNorm=false): {}, locale=tr-TR, timezone=PRC
[junit4] 2> NOTE: Linux 4.15.0-38-generic i386/Oracle Corporation 1.8.0_172 (32-bit)/cpus=8,threads=1,free=26054952,total=170287104
[junit4] 2> NOTE: All tests run in this JVM: [JdbcDriverTest, HyperbolicTangentEvaluatorTest, ClientUtilsTest, StreamExpressionParserTest, EmpiricalDistributionEvaluatorTest, CloudSolrClientCacheTest, ArcSineEvaluatorTest, TestV2Request, NaturalLogEvaluatorTest, GreaterThanEvaluatorTest, TestJavaBinCodec, HttpSolrClientSSLAuthConPoolTest, SolrExampleStreamingTest, RawValueEvaluatorTest, SolrSchemalessExampleTest, SolrExampleXMLTest, SolrZkClientTest, QueryResponseTest, CloudSolrClientTest]
[junit4] Completed [99/162 (1!)] on J2 in 63.15s, 16 tests, 2 errors <<< FAILURES!
[...truncated 44135 lines...]
[repro] Jenkins log URL: https://jenkins.thetaphi.de/job/Lucene-Solr-7.x-Linux/3052/consoleText
[repro] Revision: b650e9890e75b5007c9291f41abac1466d4ee526
[repro] Ant options: "-Dargs=-server -XX:+UseSerialGC"
[repro] Repro line: ant test -Dtestcase=CloudSolrClientTest -Dtests.method=testCollectionDoesntExist -Dtests.seed=F21F3742FF47ABF5 -Dtests.multiplier=3 -Dtests.slow=true -Dtests.locale=tr-TR -Dtests.timezone=PRC -Dtests.asserts=true -Dtests.file.encoding=US-ASCII
[repro] Repro line: ant test -Dtestcase=CloudSolrClientTest -Dtests.method=testRouting -Dtests.seed=F21F3742FF47ABF5 -Dtests.multiplier=3 -Dtests.slow=true -Dtests.locale=tr-TR -Dtests.timezone=PRC -Dtests.asserts=true -Dtests.file.encoding=US-ASCII
[repro] ant clean
[...truncated 6 lines...]
[repro] Test suites by module:
[repro] solr/solrj
[repro] CloudSolrClientTest
[repro] ant compile-test
[...truncated 2716 lines...]
[repro] ant test-nocompile -Dtests.dups=5 -Dtests.maxfailures=5 -Dtests.class="*.CloudSolrClientTest" -Dtests.showOutput=onerror "-Dargs=-server -XX:+UseSerialGC" -Dtests.seed=F21F3742FF47ABF5 -Dtests.multiplier=3 -Dtests.slow=true -Dtests.locale=tr-TR -Dtests.timezone=PRC -Dtests.asserts=true -Dtests.file.encoding=US-ASCII
[...truncated 32 lines...]
[junit4] Suite: org.apache.solr.client.solrj.impl.CloudSolrClientTest
[junit4] 2> ERROR StatusLogger No Log4j 2 configuration file found. Using default configuration (logging only errors to the console), or user programmatically provided configurations. Set system property 'log4j2.debug' to show Log4j 2 internal initialization logging. See https://logging.apache.org/log4j/2.x/manual/configuration.html for instructions on how to configure Log4j 2
[junit4] 2> Creating dataDir: /home/jenkins/workspace/Lucene-Solr-7.x-Linux/solr/build/solr-solrj/test/J2/temp/solr.client.solrj.impl.CloudSolrClientTest_F21F3742FF47ABF5-001/init-core-data-001
[junit4] 1> 18:53:13.463 [Thread-1] ERROR org.apache.zookeeper.server.ZooKeeperServer - ZKShutdownHandler is not registered, so ZooKeeper server won't take any action on ERROR or SHUTDOWN server state changes
[junit4] 1> 18:53:14.060 [jetty-launcher-1-thread-3] ERROR org.apache.solr.util.StartupLoggingUtils - Missing Java Option solr.log.dir. Logging may be missing or incomplete.
[junit4] 1> 18:53:14.060 [jetty-launcher-1-thread-1] ERROR org.apache.solr.util.StartupLoggingUtils - Missing Java Option solr.log.dir. Logging may be missing or incomplete.
[junit4] 1> 18:53:14.060 [jetty-launcher-1-thread-2] ERROR org.apache.solr.util.StartupLoggingUtils - Missing Java Option solr.log.dir. Logging may be missing or incomplete.
[junit4] OK 9.03s J2 | CloudSolrClientTest.preferLocalShardsTest
[junit4] 1> -
[junit4] 1> replica:core_node2 rstate:active live:true
[junit4] 1> no one is recoverying
[junit4] 1> -
[junit4] 1> replica:core_node2 rstate:active live:true
[junit4] 1> replica:core_node4 rstate:down live:true
[junit4] 1> -
[junit4] 1> replica:core_node2 rstate:active live:true
[junit4] 1> replica:core_node4 rstate:recovering live:true
[junit4] 1> -
[junit4] 1> replica:core_node2 rstate:active live:true
[junit4] 1> replica:core_node4 rstate:active live:true
[junit4] 1> no one is recoverying
[junit4] 1> -
[junit4] 1> replica:core_node4 rstate:active live:true
[junit4] 1> no one is recoverying
[junit4] 1> 18:53:34.701 [TEST-CloudSolrClientTest.testRetryUpdatesWhenClusterStateIsStale-seed#[F21F3742FF47ABF5]] ERROR org.apache.solr.client.solrj.impl.CloudSolrClient - Request to collection [stale_state_test_col] failed due to (404) org.apache.solr.client.solrj.impl.HttpSolrClient$RemoteSolrException: Error from server at http://127.0.0.1:36737/solr/stale_state_test_col_shard1_replica_n1: Expected mime type application/octet-stream but got text/html. <html>
[junit4] 1> <head>
[junit4] 1> <meta http-equiv="Content-Type" content="text/html;charset=utf-8"/>
[junit4] 1> <title>Error 404 Can not find: /solr/stale_state_test_col_shard1_replica_n1/update</title>
[junit4] 1> </head>
[junit4] 1> <body><h2>HTTP ERROR 404</h2>
[junit4] 1> <p>Problem accessing /solr/stale_state_test_col_shard1_replica_n1/update. Reason:
[junit4] 1> <pre> Can not find: /solr/stale_state_test_col_shard1_replica_n1/update</pre></p><hr><a href="http://eclipse.org/jetty">Powered by Jetty:// 9.4.11.v20180605</a><hr/>
[junit4] 1>
[junit4] 1> </body>
[junit4] 1> </html>
[junit4] 1> , retry? 0
[junit4] OK 8.84s J2 | CloudSolrClientTest.testRetryUpdatesWhenClusterStateIsStale
[junit4] OK 0.78s J2 | CloudSolrClientTest.customHttpClientTest
[junit4] OK 3.10s J2 | CloudSolrClientTest.testOverwriteOption
[junit4] OK 3.67s J2 | CloudSolrClientTest.testParallelUpdateQTime
[junit4] OK 6.13s J2 | CloudSolrClientTest.testAliasHandling
[junit4] OK 4.51s J2 | CloudSolrClientTest.stateVersionParamTest
[junit4] OK 3.64s J2 | CloudSolrClientTest.testVersionsAreReturned
[junit4] OK 3.55s J2 | CloudSolrClientTest.testInitializationWithSolrUrls
[junit4] OK 3.94s J2 | CloudSolrClientTest.checkCollectionParameters
[junit4] 1> 18:54:07.951 [qtp27968274-131] ERROR org.apache.solr.handler.RequestHandlerBase - org.apache.solr.common.SolrException: Collection: boguscollectionname not found
[junit4] 1> at org.apache.solr.handler.admin.ClusterStatus.getClusterStatus(ClusterStatus.java:115)
[junit4] 1> at org.apache.solr.handler.admin.CollectionsHandler$CollectionOperation.lambda$static$22(CollectionsHandler.java:865)
[junit4] 1> at org.apache.solr.handler.admin.CollectionsHandler$CollectionOperation.execute(CollectionsHandler.java:1177)
[junit4] 1> at org.apache.solr.handler.admin.CollectionsHandler.invokeAction(CollectionsHandler.java:258)
[junit4] 1> at org.apache.solr.handler.admin.CollectionsHandler.handleRequestBody(CollectionsHandler.java:246)
[junit4] 1> at org.apache.solr.handler.RequestHandlerBase.handleRequest(RequestHandlerBase.java:199)
[junit4] 1> at org.apache.solr.servlet.HttpSolrCall.handleAdmin(HttpSolrCall.java:734)
[junit4] 1> at org.apache.solr.servlet.HttpSolrCall.handleAdminRequest(HttpSolrCall.java:715)
[junit4] 1> at org.apache.solr.servlet.HttpSolrCall.call(HttpSolrCall.java:496)
[junit4] 1> at org.apache.solr.servlet.SolrDispatchFilter.doFilter(SolrDispatchFilter.java:377)
[junit4] 1> at org.apache.solr.servlet.SolrDispatchFilter.doFilter(SolrDispatchFilter.java:323)
[junit4] 1> at org.eclipse.jetty.servlet.ServletHandler$CachedChain.doFilter(ServletHandler.java:1642)
[junit4] 1> at org.apache.solr.client.solrj.embedded.JettySolrRunner$DebugFilter.doFilter(JettySolrRunner.java:139)
[junit4] 1> at org.eclipse.jetty.servlet.ServletHandler$CachedChain.doFilter(ServletHandler.java:1642)
[junit4] 1> at org.eclipse.jetty.servlet.ServletHandler.doHandle(ServletHandler.java:533)
[junit4] 1> at org.eclipse.jetty.server.handler.ScopedHandler.nextHandle(ScopedHandler.java:255)
[junit4] 1> at org.eclipse.jetty.server.session.SessionHandler.doHandle(SessionHandler.java:1595)
[junit4] 1> at org.eclipse.jetty.server.handler.ScopedHandler.nextHandle(ScopedHandler.java:255)
[junit4] 1> at org.eclipse.jetty.server.handler.ContextHandler.doHandle(ContextHandler.java:1317)
[junit4] 1> at org.eclipse.jetty.server.handler.ScopedHandler.nextScope(ScopedHandler.java:203)
[junit4] 1> at org.eclipse.jetty.servlet.ServletHandler.doScope(ServletHandler.java:473)
[junit4] 1> at org.eclipse.jetty.server.session.SessionHandler.doScope(SessionHandler.java:1564)
[junit4] 1> at org.eclipse.jetty.server.handler.ScopedHandler.nextScope(ScopedHandler.java:201)
[junit4] 1> at org.eclipse.jetty.server.handler.ContextHandler.doScope(ContextHandler.java:1219)
[junit4] 1> at org.eclipse.jetty.server.handler.ScopedHandler.handle(ScopedHandler.java:144)
[junit4] 1> at org.eclipse.jetty.server.handler.gzip.GzipHandler.handle(GzipHandler.java:724)
[junit4] 1> at org.eclipse.jetty.server.handler.HandlerWrapper.handle(HandlerWrapper.java:132)
[junit4] 1> at org.eclipse.jetty.server.Server.handle(Server.java:531)
[junit4] 1> at org.eclipse.jetty.server.HttpChannel.handle(HttpChannel.java:352)
[junit4] 1> at org.eclipse.jetty.server.HttpConnection.onFillable(HttpConnection.java:260)
[junit4] 1> at org.eclipse.jetty.io.AbstractConnection$ReadCallback.succeeded(AbstractConnection.java:281)
[junit4] 1> at org.eclipse.jetty.io.FillInterest.fillable(FillInterest.java:102)
[junit4] 1> at org.eclipse.jetty.io.ChannelEndPoint$2.run(ChannelEndPoint.java:118)
[junit4] 1> at org.eclipse.jetty.util.thread.strategy.EatWhatYouKill.runTask(EatWhatYouKill.java:333)
[junit4] 1> at org.eclipse.jetty.util.thread.strategy.EatWhatYouKill.doProduce(EatWhatYouKill.java:310)
[junit4] 1> at org.eclipse.jetty.util.thread.strategy.EatWhatYouKill.tryProduce(EatWhatYouKill.java:168)
[junit4] 1> at org.eclipse.jetty.util.thread.strategy.EatWhatYouKill.run(EatWhatYouKill.java:126)
[junit4] 1> at org.eclipse.jetty.util.thread.ReservedThreadExecutor$ReservedThread.run(ReservedThreadExecutor.java:366)
[junit4] 1> at org.eclipse.jetty.util.thread.QueuedThreadPool.runJob(QueuedThreadPool.java:762)
[junit4] 1> at org.eclipse.jetty.util.thread.QueuedThreadPool$2.run(QueuedThreadPool.java:680)
[junit4] 1> at java.lang.Thread.run(Thread.java:748)
[junit4] 1>
[junit4] 1> 18:54:07.954 [qtp1467485-154] ERROR org.apache.solr.handler.RequestHandlerBase - org.apache.solr.common.SolrException: Collection: boguscollectionname not found
[junit4] 1> at org.apache.solr.handler.admin.ClusterStatus.getClusterStatus(ClusterStatus.java:115)
[junit4] 1> at org.apache.solr.handler.admin.CollectionsHandler$CollectionOperation.lambda$static$22(CollectionsHandler.java:865)
[junit4] 1> at org.apache.solr.handler.admin.CollectionsHandler$CollectionOperation.execute(CollectionsHandler.java:1177)
[junit4] 1> at org.apache.solr.handler.admin.CollectionsHandler.invokeAction(CollectionsHandler.java:258)
[junit4] 1> at org.apache.solr.handler.admin.CollectionsHandler.handleRequestBody(CollectionsHandler.java:246)
[junit4] 1> at org.apache.solr.handler.RequestHandlerBase.handleRequest(RequestHandlerBase.java:199)
[junit4] 1> at org.apache.solr.servlet.HttpSolrCall.handleAdmin(HttpSolrCall.java:734)
[junit4] 1> at org.apache.solr.servlet.HttpSolrCall.handleAdminRequest(HttpSolrCall.java:715)
[junit4] 1> at org.apache.solr.servlet.HttpSolrCall.call(HttpSolrCall.java:496)
[junit4] 1> at org.apache.solr.servlet.SolrDispatchFilter.doFilter(SolrDispatchFilter.java:377)
[junit4] 1> at org.apache.solr.servlet.SolrDispatchFilter.doFilter(SolrDispatchFilter.java:323)
[junit4] 1> at org.eclipse.jetty.servlet.ServletHandler$CachedChain.doFilter(ServletHandler.java:1642)
[junit4] 1> at org.apache.solr.client.solrj.embedded.JettySolrRunner$DebugFilter.doFilter(JettySolrRunner.java:139)
[junit4] 1> at org.eclipse.jetty.servlet.ServletHandler$CachedChain.doFilter(ServletHandler.java:1642)
[junit4] 1> at org.eclipse.jetty.servlet.ServletHandler.doHandle(ServletHandler.java:533)
[junit4] 1> at org.eclipse.jetty.server.handler.ScopedHandler.nextHandle(ScopedHandler.java:255)
[junit4] 1> at org.eclipse.jetty.server.session.SessionHandler.doHandle(SessionHandler.java:1595)
[junit4] 1> at org.eclipse.jetty.server.handler.ScopedHandler.nextHandle(ScopedHandler.java:255)
[junit4] 1> at org.eclipse.jetty.server.handler.ContextHandler.doHandle(ContextHandler.java:1317)
[junit4] 1> at org.eclipse.jetty.server.handler.ScopedHandler.nextScope(ScopedHandler.java:203)
[junit4] 1> at org.eclipse.jetty.servlet.ServletHandler.doScope(ServletHandler.java:473)
[junit4] 1> at org.eclipse.jetty.server.session.SessionHandler.doScope(SessionHandler.java:1564)
[junit4] 1> at org.eclipse.jetty.server.handler.ScopedHandler.nextScope(ScopedHandler.java:201)
[junit4] 1> at org.eclipse.jetty.server.handler.ContextHandler.doScope(ContextHandler.java:1219)
[junit4] 1> at org.eclipse.jetty.server.handler.ScopedHandler.handle(ScopedHandler.java:144)
[junit4] 1> at org.eclipse.jetty.server.handler.gzip.GzipHandler.handle(GzipHandler.java:724)
[junit4] 1> at org.eclipse.jetty.server.handler.HandlerWrapper.handle(HandlerWrapper.java:132)
[junit4] 1> at org.eclipse.jetty.server.Server.handle(Server.java:531)
[junit4] 1> at org.eclipse.jetty.server.HttpChannel.handle(HttpChannel.java:352)
[junit4] 1> at org.eclipse.jetty.server.HttpConnection.onFillable(HttpConnection.java:260)
[junit4] 1> at org.eclipse.jetty.io.AbstractConnection$ReadCallback.succeeded(AbstractConnection.java:281)
[junit4] 1> at org.eclipse.jetty.io.FillInterest.fillable(FillInterest.java:102)
[junit4] 1> at org.eclipse.jetty.io.ChannelEndPoint$2.run(ChannelEndPoint.java:118)
[junit4] 1> at org.eclipse.jetty.util.thread.strategy.EatWhatYouKill.runTask(EatWhatYouKill.java:333)
[junit4] 1> at org.eclipse.jetty.util.thread.strategy.EatWhatYouKill.doProduce(EatWhatYouKill.java:310)
[junit4] 1> at org.eclipse.jetty.util.thread.strategy.EatWhatYouKill.tryProduce(EatWhatYouKill.java:168)
[junit4] 1> at org.eclipse.jetty.util.thread.strategy.EatWhatYouKill.run(EatWhatYouKill.java:126)
[junit4] 1> at org.eclipse.jetty.util.thread.ReservedThreadExecutor$ReservedThread.run(ReservedThreadExecutor.java:366)
[junit4] 1> at org.eclipse.jetty.util.thread.QueuedThreadPool.runJob(QueuedThreadPool.java:762)
[junit4] 1> at org.eclipse.jetty.util.thread.QueuedThreadPool$2.run(QueuedThreadPool.java:680)
[junit4] 1> at java.lang.Thread.run(Thread.java:748)
[junit4] 1>
[junit4] 1> 18:54:07.960 [qtp32815541-148] ERROR org.apache.solr.handler.RequestHandlerBase - org.apache.solr.common.SolrException: Collection: boguscollectionname not found
[junit4] 1> at org.apache.solr.handler.admin.ClusterStatus.getClusterStatus(ClusterStatus.java:115)
[junit4] 1> at org.apache.solr.handler.admin.CollectionsHandler$CollectionOperation.lambda$static$22(CollectionsHandler.java:865)
[junit4] 1> at org.apache.solr.handler.admin.CollectionsHandler$CollectionOperation.execute(CollectionsHandler.java:1177)
[junit4] 1> at org.apache.solr.handler.admin.CollectionsHandler.invokeAction(CollectionsHandler.java:258)
[junit4] 1> at org.apache.solr.handler.admin.CollectionsHandler.handleRequestBody(CollectionsHandler.java:246)
[junit4] 1> at org.apache.solr.handler.RequestHandlerBase.handleRequest(RequestHandlerBase.java:199)
[junit4] 1> at org.apache.solr.servlet.HttpSolrCall.handleAdmin(HttpSolrCall.java:734)
[junit4] 1> at org.apache.solr.servlet.HttpSolrCall.handleAdminRequest(HttpSolrCall.java:715)
[junit4] 1> at org.apache.solr.servlet.HttpSolrCall.call(HttpSolrCall.java:496)
[junit4] 1> at org.apache.solr.servlet.SolrDispatchFilter.doFilter(SolrDispatchFilter.java:377)
[junit4] 1> at org.apache.solr.servlet.SolrDispatchFilter.doFilter(SolrDispatchFilter.java:323)
[junit4] 1> at org.eclipse.jetty.servlet.ServletHandler$CachedChain.doFilter(ServletHandler.java:1642)
[junit4] 1> at org.apache.solr.client.solrj.embedded.JettySolrRunner$DebugFilter.doFilter(JettySolrRunner.java:139)
[junit4] 1> at org.eclipse.jetty.servlet.ServletHandler$CachedChain.doFilter(ServletHandler.java:1642)
[junit4] 1> at org.eclipse.jetty.serv
[...truncated too long message...]
.eclipse.jetty.servlet.ServletHandler.doScope(ServletHandler.java:473)
[junit4] 1> at org.eclipse.jetty.server.session.SessionHandler.doScope(SessionHandler.java:1564)
[junit4] 1> at org.eclipse.jetty.server.handler.ScopedHandler.nextScope(ScopedHandler.java:201)
[junit4] 1> at org.eclipse.jetty.server.handler.ContextHandler.doScope(ContextHandler.java:1219)
[junit4] 1> at org.eclipse.jetty.server.handler.ScopedHandler.handle(ScopedHandler.java:144)
[junit4] 1> at org.eclipse.jetty.server.handler.gzip.GzipHandler.handle(GzipHandler.java:724)
[junit4] 1> at org.eclipse.jetty.server.handler.HandlerWrapper.handle(HandlerWrapper.java:132)
[junit4] 1> at org.eclipse.jetty.server.Server.handle(Server.java:531)
[junit4] 1> at org.eclipse.jetty.server.HttpChannel.handle(HttpChannel.java:352)
[junit4] 1> at org.eclipse.jetty.server.HttpConnection.onFillable(HttpConnection.java:260)
[junit4] 1> at org.eclipse.jetty.io.AbstractConnection$ReadCallback.succeeded(AbstractConnection.java:281)
[junit4] 1> at org.eclipse.jetty.io.FillInterest.fillable(FillInterest.java:102)
[junit4] 1> at org.eclipse.jetty.io.ChannelEndPoint$2.run(ChannelEndPoint.java:118)
[junit4] 1> at org.eclipse.jetty.util.thread.strategy.EatWhatYouKill.runTask(EatWhatYouKill.java:333)
[junit4] 1> at org.eclipse.jetty.util.thread.strategy.EatWhatYouKill.doProduce(EatWhatYouKill.java:310)
[junit4] 1> at org.eclipse.jetty.util.thread.strategy.EatWhatYouKill.tryProduce(EatWhatYouKill.java:168)
[junit4] 1> at org.eclipse.jetty.util.thread.strategy.EatWhatYouKill.run(EatWhatYouKill.java:126)
[junit4] 1> at org.eclipse.jetty.util.thread.ReservedThreadExecutor$ReservedThread.run(ReservedThreadExecutor.java:366)
[junit4] 1> at org.eclipse.jetty.util.thread.QueuedThreadPool.runJob(QueuedThreadPool.java:762)
[junit4] 1> at org.eclipse.jetty.util.thread.QueuedThreadPool$2.run(QueuedThreadPool.java:680)
[junit4] 1> at java.lang.Thread.run(Thread.java:748)
[junit4] 1>
[junit4] 1> 18:55:28.724 [qtp28949888-647] ERROR org.apache.solr.handler.RequestHandlerBase - org.apache.solr.common.SolrException: Unsupported operation: foobar
[junit4] 1> at org.apache.solr.handler.admin.CoreAdminHandler.handleCustomAction(CoreAdminHandler.java:220)
[junit4] 1> at org.apache.solr.handler.admin.CoreAdminHandler.handleRequestBody(CoreAdminHandler.java:169)
[junit4] 1> at org.apache.solr.handler.RequestHandlerBase.handleRequest(RequestHandlerBase.java:199)
[junit4] 1> at org.apache.solr.servlet.HttpSolrCall.handleAdmin(HttpSolrCall.java:734)
[junit4] 1> at org.apache.solr.servlet.HttpSolrCall.handleAdminRequest(HttpSolrCall.java:715)
[junit4] 1> at org.apache.solr.servlet.HttpSolrCall.call(HttpSolrCall.java:496)
[junit4] 1> at org.apache.solr.servlet.SolrDispatchFilter.doFilter(SolrDispatchFilter.java:377)
[junit4] 1> at org.apache.solr.servlet.SolrDispatchFilter.doFilter(SolrDispatchFilter.java:323)
[junit4] 1> at org.eclipse.jetty.servlet.ServletHandler$CachedChain.doFilter(ServletHandler.java:1642)
[junit4] 1> at org.apache.solr.client.solrj.embedded.JettySolrRunner$DebugFilter.doFilter(JettySolrRunner.java:139)
[junit4] 1> at org.eclipse.jetty.servlet.ServletHandler$CachedChain.doFilter(ServletHandler.java:1642)
[junit4] 1> at org.eclipse.jetty.servlet.ServletHandler.doHandle(ServletHandler.java:533)
[junit4] 1> at org.eclipse.jetty.server.handler.ScopedHandler.nextHandle(ScopedHandler.java:255)
[junit4] 1> at org.eclipse.jetty.server.session.SessionHandler.doHandle(SessionHandler.java:1595)
[junit4] 1> at org.eclipse.jetty.server.handler.ScopedHandler.nextHandle(ScopedHandler.java:255)
[junit4] 1> at org.eclipse.jetty.server.handler.ContextHandler.doHandle(ContextHandler.java:1317)
[junit4] 1> at org.eclipse.jetty.server.handler.ScopedHandler.nextScope(ScopedHandler.java:203)
[junit4] 1> at org.eclipse.jetty.servlet.ServletHandler.doScope(ServletHandler.java:473)
[junit4] 1> at org.eclipse.jetty.server.session.SessionHandler.doScope(SessionHandler.java:1564)
[junit4] 1> at org.eclipse.jetty.server.handler.ScopedHandler.nextScope(ScopedHandler.java:201)
[junit4] 1> at org.eclipse.jetty.server.handler.ContextHandler.doScope(ContextHandler.java:1219)
[junit4] 1> at org.eclipse.jetty.server.handler.ScopedHandler.handle(ScopedHandler.java:144)
[junit4] 1> at org.eclipse.jetty.server.handler.gzip.GzipHandler.handle(GzipHandler.java:724)
[junit4] 1> at org.eclipse.jetty.server.handler.HandlerWrapper.handle(HandlerWrapper.java:132)
[junit4] 1> at org.eclipse.jetty.server.Server.handle(Server.java:531)
[junit4] 1> at org.eclipse.jetty.server.HttpChannel.handle(HttpChannel.java:352)
[junit4] 1> at org.eclipse.jetty.server.HttpConnection.onFillable(HttpConnection.java:260)
[junit4] 1> at org.eclipse.jetty.io.AbstractConnection$ReadCallback.succeeded(AbstractConnection.java:281)
[junit4] 1> at org.eclipse.jetty.io.FillInterest.fillable(FillInterest.java:102)
[junit4] 1> at org.eclipse.jetty.io.ChannelEndPoint$2.run(ChannelEndPoint.java:118)
[junit4] 1> at org.eclipse.jetty.util.thread.strategy.EatWhatYouKill.runTask(EatWhatYouKill.java:333)
[junit4] 1> at org.eclipse.jetty.util.thread.strategy.EatWhatYouKill.doProduce(EatWhatYouKill.java:310)
[junit4] 1> at org.eclipse.jetty.util.thread.strategy.EatWhatYouKill.tryProduce(EatWhatYouKill.java:168)
[junit4] 1> at org.eclipse.jetty.util.thread.strategy.EatWhatYouKill.run(EatWhatYouKill.java:126)
[junit4] 1> at org.eclipse.jetty.util.thread.ReservedThreadExecutor$ReservedThread.run(ReservedThreadExecutor.java:366)
[junit4] 1> at org.eclipse.jetty.util.thread.QueuedThreadPool.runJob(QueuedThreadPool.java:762)
[junit4] 1> at org.eclipse.jetty.util.thread.QueuedThreadPool$2.run(QueuedThreadPool.java:680)
[junit4] 1> at java.lang.Thread.run(Thread.java:748)
[junit4] 1>
[junit4] OK 4.92s J1 | CloudSolrClientTest.testNonRetryableRequests
[junit4] 1> 18:55:30.275 [SUITE-CloudSolrClientTest-seed#[F21F3742FF47ABF5]-worker] ERROR org.apache.zookeeper.server.ZooKeeperServer - ZKShutdownHandler is not registered, so ZooKeeper server won't take any action on ERROR or SHUTDOWN server state changes
[junit4] 2> NOTE: leaving temporary files on disk at: /home/jenkins/workspace/Lucene-Solr-7.x-Linux/solr/build/solr-solrj/test/J1/temp/solr.client.solrj.impl.CloudSolrClientTest_F21F3742FF47ABF5-002
[junit4] 2> Nov 07, 2018 6:55:30 PM com.carrotsearch.randomizedtesting.ThreadLeakControl checkThreadLeaks
[junit4] 2> WARNING: Will linger awaiting termination of 1 leaked thread(s).
[junit4] 2> NOTE: test params are: codec=Asserting(Lucene70): {_version_=PostingsFormat(name=Memory), multiDefault=PostingsFormat(name=LuceneVarGapFixedInterval), a_t=PostingsFormat(name=LuceneVarGapFixedInterval), title_s=PostingsFormat(name=LuceneVarGapFixedInterval), intDefault=PostingsFormat(name=Memory), id=Lucene50(blocksize=128), text=PostingsFormat(name=Memory), timestamp=PostingsFormat(name=LuceneVarGapFixedInterval)}, docValues:{_version_=DocValuesFormat(name=Direct), multiDefault=DocValuesFormat(name=Asserting), a_t=DocValuesFormat(name=Asserting), title_s=DocValuesFormat(name=Asserting), intDefault=DocValuesFormat(name=Direct), id=DocValuesFormat(name=Lucene70), text=DocValuesFormat(name=Memory), timestamp=DocValuesFormat(name=Asserting)}, maxPointsInLeafNode=16, maxMBSortInHeap=7.687861144723305, sim=RandomSimilarity(queryNorm=false): {}, locale=tr-TR, timezone=PRC
[junit4] 2> NOTE: Linux 4.15.0-38-generic i386/Oracle Corporation 1.8.0_172 (32-bit)/cpus=8,threads=1,free=58545288,total=179716096
[junit4] 2> NOTE: All tests run in this JVM: [CloudSolrClientTest, CloudSolrClientTest]
[junit4] Completed [5/5 (5!)] on J1 in 63.74s, 16 tests, 1 error <<< FAILURES!
[...truncated 15 lines...]
BUILD FAILED
/home/jenkins/workspace/Lucene-Solr-7.x-Linux/lucene/common-build.xml:1567: The following error occurred while executing this line:
/home/jenkins/workspace/Lucene-Solr-7.x-Linux/lucene/common-build.xml:1092: There were test failures: 5 suites, 80 tests, 5 errors [seed: F21F3742FF47ABF5]
Total time: 2 minutes 21 seconds
[repro] Setting last failure code to 256
[repro] Failures:
[repro] 5/5 failed: org.apache.solr.client.solrj.impl.CloudSolrClientTest
[repro] Exiting with code 256
+ mv lucene/build lucene/build.repro
+ mv solr/build solr/build.repro
+ mv lucene/build.orig lucene/build
+ mv solr/build.orig solr/build
Archiving artifacts
Setting ANT_1_8_2_HOME=/var/lib/jenkins/tools/hudson.tasks.Ant_AntInstallation/ANT_1.8.2
[WARNINGS] Parsing warnings in console log with parser Java Compiler (javac)
Setting ANT_1_8_2_HOME=/var/lib/jenkins/tools/hudson.tasks.Ant_AntInstallation/ANT_1.8.2
Setting ANT_1_8_2_HOME=/var/lib/jenkins/tools/hudson.tasks.Ant_AntInstallation/ANT_1.8.2
<Git Blamer> Using GitBlamer to create author and commit information for all warnings.
<Git Blamer> GIT_COMMIT=b650e9890e75b5007c9291f41abac1466d4ee526, workspace=/var/lib/jenkins/workspace/Lucene-Solr-7.x-Linux
[WARNINGS] Computing warning deltas based on reference build #3051
Recording test results
Setting ANT_1_8_2_HOME=/var/lib/jenkins/tools/hudson.tasks.Ant_AntInstallation/ANT_1.8.2
Build step 'Publish JUnit test result report' changed build result to UNSTABLE
Email was triggered for: Unstable (Test Failures)
Sending email for trigger: Unstable (Test Failures)
Setting ANT_1_8_2_HOME=/var/lib/jenkins/tools/hudson.tasks.Ant_AntInstallation/ANT_1.8.2
Setting ANT_1_8_2_HOME=/var/lib/jenkins/tools/hudson.tasks.Ant_AntInstallation/ANT_1.8.2
Setting ANT_1_8_2_HOME=/var/lib/jenkins/tools/hudson.tasks.Ant_AntInstallation/ANT_1.8.2
Setting ANT_1_8_2_HOME=/var/lib/jenkins/tools/hudson.tasks.Ant_AntInstallation/ANT_1.8.2