You are viewing a plain text version of this content. The canonical link for it is here.
Posted to dev@lucene.apache.org by Policeman Jenkins Server <je...@thetaphi.de> on 2016/08/06 01:35:32 UTC
[JENKINS] Lucene-Solr-master-MacOSX (64bit/jdk1.8.0) - Build # 3456
- Unstable!
Build: http://jenkins.thetaphi.de/job/Lucene-Solr-master-MacOSX/3456/
Java: 64bit/jdk1.8.0 -XX:-UseCompressedOops -XX:+UseG1GC
1 tests failed.
FAILED: org.apache.solr.handler.TestReplicationHandler.doTestIndexAndConfigAliasReplication
Error Message:
[/Users/jenkins/workspace/Lucene-Solr-master-MacOSX/solr/build/solr-core/test/J0/temp/solr.handler.TestReplicationHandler_7DF89915E8AE43B4-001/solr-instance-022/./collection1/data/snapshot_metadata, /Users/jenkins/workspace/Lucene-Solr-master-MacOSX/solr/build/solr-core/test/J0/temp/solr.handler.TestReplicationHandler_7DF89915E8AE43B4-001/solr-instance-022/./collection1/data, /Users/jenkins/workspace/Lucene-Solr-master-MacOSX/solr/build/solr-core/test/J0/temp/solr.handler.TestReplicationHandler_7DF89915E8AE43B4-001/solr-instance-022/./collection1/data/index.20160805203313678, /Users/jenkins/workspace/Lucene-Solr-master-MacOSX/solr/build/solr-core/test/J0/temp/solr.handler.TestReplicationHandler_7DF89915E8AE43B4-001/solr-instance-022/./collection1/data/index.20160805203313786] expected:<3> but was:<4>
Stack Trace:
java.lang.AssertionError: [/Users/jenkins/workspace/Lucene-Solr-master-MacOSX/solr/build/solr-core/test/J0/temp/solr.handler.TestReplicationHandler_7DF89915E8AE43B4-001/solr-instance-022/./collection1/data/snapshot_metadata, /Users/jenkins/workspace/Lucene-Solr-master-MacOSX/solr/build/solr-core/test/J0/temp/solr.handler.TestReplicationHandler_7DF89915E8AE43B4-001/solr-instance-022/./collection1/data, /Users/jenkins/workspace/Lucene-Solr-master-MacOSX/solr/build/solr-core/test/J0/temp/solr.handler.TestReplicationHandler_7DF89915E8AE43B4-001/solr-instance-022/./collection1/data/index.20160805203313678, /Users/jenkins/workspace/Lucene-Solr-master-MacOSX/solr/build/solr-core/test/J0/temp/solr.handler.TestReplicationHandler_7DF89915E8AE43B4-001/solr-instance-022/./collection1/data/index.20160805203313786] expected:<3> but was:<4>
at __randomizedtesting.SeedInfo.seed([7DF89915E8AE43B4:8A8B774D2E46EC52]:0)
at org.junit.Assert.fail(Assert.java:93)
at org.junit.Assert.failNotEquals(Assert.java:647)
at org.junit.Assert.assertEquals(Assert.java:128)
at org.junit.Assert.assertEquals(Assert.java:472)
at org.apache.solr.handler.TestReplicationHandler.checkForSingleIndex(TestReplicationHandler.java:902)
at org.apache.solr.handler.TestReplicationHandler.doTestIndexAndConfigAliasReplication(TestReplicationHandler.java:1334)
at sun.reflect.NativeMethodAccessorImpl.invoke0(Native Method)
at sun.reflect.NativeMethodAccessorImpl.invoke(NativeMethodAccessorImpl.java:62)
at sun.reflect.DelegatingMethodAccessorImpl.invoke(DelegatingMethodAccessorImpl.java:43)
at java.lang.reflect.Method.invoke(Method.java:498)
at com.carrotsearch.randomizedtesting.RandomizedRunner.invoke(RandomizedRunner.java:1764)
at com.carrotsearch.randomizedtesting.RandomizedRunner$8.evaluate(RandomizedRunner.java:871)
at com.carrotsearch.randomizedtesting.RandomizedRunner$9.evaluate(RandomizedRunner.java:907)
at com.carrotsearch.randomizedtesting.RandomizedRunner$10.evaluate(RandomizedRunner.java:921)
at com.carrotsearch.randomizedtesting.rules.SystemPropertiesRestoreRule$1.evaluate(SystemPropertiesRestoreRule.java:57)
at org.apache.lucene.util.TestRuleSetupTeardownChained$1.evaluate(TestRuleSetupTeardownChained.java:49)
at org.apache.lucene.util.AbstractBeforeAfterRule$1.evaluate(AbstractBeforeAfterRule.java:45)
at org.apache.lucene.util.TestRuleThreadAndTestName$1.evaluate(TestRuleThreadAndTestName.java:48)
at org.apache.lucene.util.TestRuleIgnoreAfterMaxFailures$1.evaluate(TestRuleIgnoreAfterMaxFailures.java:64)
at org.apache.lucene.util.TestRuleMarkFailure$1.evaluate(TestRuleMarkFailure.java:47)
at com.carrotsearch.randomizedtesting.rules.StatementAdapter.evaluate(StatementAdapter.java:36)
at com.carrotsearch.randomizedtesting.ThreadLeakControl$StatementRunner.run(ThreadLeakControl.java:367)
at com.carrotsearch.randomizedtesting.ThreadLeakControl.forkTimeoutingTask(ThreadLeakControl.java:809)
at com.carrotsearch.randomizedtesting.ThreadLeakControl$3.evaluate(ThreadLeakControl.java:460)
at com.carrotsearch.randomizedtesting.RandomizedRunner.runSingleTest(RandomizedRunner.java:880)
at com.carrotsearch.randomizedtesting.RandomizedRunner$5.evaluate(RandomizedRunner.java:781)
at com.carrotsearch.randomizedtesting.RandomizedRunner$6.evaluate(RandomizedRunner.java:816)
at com.carrotsearch.randomizedtesting.RandomizedRunner$7.evaluate(RandomizedRunner.java:827)
at com.carrotsearch.randomizedtesting.rules.StatementAdapter.evaluate(StatementAdapter.java:36)
at com.carrotsearch.randomizedtesting.rules.SystemPropertiesRestoreRule$1.evaluate(SystemPropertiesRestoreRule.java:57)
at org.apache.lucene.util.AbstractBeforeAfterRule$1.evaluate(AbstractBeforeAfterRule.java:45)
at com.carrotsearch.randomizedtesting.rules.StatementAdapter.evaluate(StatementAdapter.java:36)
at org.apache.lucene.util.TestRuleStoreClassName$1.evaluate(TestRuleStoreClassName.java:41)
at com.carrotsearch.randomizedtesting.rules.NoShadowingOrOverridesOnMethodsRule$1.evaluate(NoShadowingOrOverridesOnMethodsRule.java:40)
at com.carrotsearch.randomizedtesting.rules.NoShadowingOrOverridesOnMethodsRule$1.evaluate(NoShadowingOrOverridesOnMethodsRule.java:40)
at com.carrotsearch.randomizedtesting.rules.StatementAdapter.evaluate(StatementAdapter.java:36)
at com.carrotsearch.randomizedtesting.rules.StatementAdapter.evaluate(StatementAdapter.java:36)
at com.carrotsearch.randomizedtesting.rules.StatementAdapter.evaluate(StatementAdapter.java:36)
at org.apache.lucene.util.TestRuleAssertionsRequired$1.evaluate(TestRuleAssertionsRequired.java:53)
at org.apache.lucene.util.TestRuleMarkFailure$1.evaluate(TestRuleMarkFailure.java:47)
at org.apache.lucene.util.TestRuleIgnoreAfterMaxFailures$1.evaluate(TestRuleIgnoreAfterMaxFailures.java:64)
at org.apache.lucene.util.TestRuleIgnoreTestSuites$1.evaluate(TestRuleIgnoreTestSuites.java:54)
at com.carrotsearch.randomizedtesting.rules.StatementAdapter.evaluate(StatementAdapter.java:36)
at com.carrotsearch.randomizedtesting.ThreadLeakControl$StatementRunner.run(ThreadLeakControl.java:367)
at java.lang.Thread.run(Thread.java:745)
Build Log:
[...truncated 11215 lines...]
[junit4] Suite: org.apache.solr.handler.TestReplicationHandler
[junit4] 2> Creating dataDir: /Users/jenkins/workspace/Lucene-Solr-master-MacOSX/solr/build/solr-core/test/J0/temp/solr.handler.TestReplicationHandler_7DF89915E8AE43B4-001/init-core-data-001
[junit4] 2> 1365757 INFO (SUITE-TestReplicationHandler-seed#[7DF89915E8AE43B4]-worker) [ ] o.a.s.SolrTestCaseJ4 Randomized ssl (false) and clientAuth (false) via: @org.apache.solr.SolrTestCaseJ4$SuppressSSL(bugUrl=None) w/ MAC_OS_X supressed clientAuth
[junit4] 2> 1365759 INFO (TEST-TestReplicationHandler.doTestIndexFetchWithMasterUrl-seed#[7DF89915E8AE43B4]) [ ] o.a.s.SolrTestCaseJ4 ###Starting doTestIndexFetchWithMasterUrl
[junit4] 2> 1365759 INFO (TEST-TestReplicationHandler.doTestIndexFetchWithMasterUrl-seed#[7DF89915E8AE43B4]) [ ] o.a.s.SolrTestCaseJ4 Writing core.properties file to /Users/jenkins/workspace/Lucene-Solr-master-MacOSX/solr/build/solr-core/test/J0/temp/solr.handler.TestReplicationHandler_7DF89915E8AE43B4-001/solr-instance-001/collection1
[junit4] 2> 1365856 INFO (TEST-TestReplicationHandler.doTestIndexFetchWithMasterUrl-seed#[7DF89915E8AE43B4]) [ ] o.e.j.s.Server jetty-9.3.8.v20160314
[junit4] 2> 1365858 INFO (TEST-TestReplicationHandler.doTestIndexFetchWithMasterUrl-seed#[7DF89915E8AE43B4]) [ ] o.e.j.s.h.ContextHandler Started o.e.j.s.ServletContextHandler@68621fbf{/solr,null,AVAILABLE}
[junit4] 2> 1365860 INFO (TEST-TestReplicationHandler.doTestIndexFetchWithMasterUrl-seed#[7DF89915E8AE43B4]) [ ] o.e.j.s.ServerConnector Started ServerConnector@3788928a{HTTP/1.1,[http/1.1]}{127.0.0.1:54036}
[junit4] 2> 1365860 INFO (TEST-TestReplicationHandler.doTestIndexFetchWithMasterUrl-seed#[7DF89915E8AE43B4]) [ ] o.e.j.s.Server Started @1371115ms
[junit4] 2> 1365860 INFO (TEST-TestReplicationHandler.doTestIndexFetchWithMasterUrl-seed#[7DF89915E8AE43B4]) [ ] o.a.s.c.s.e.JettySolrRunner Jetty properties: {solr.data.dir=/Users/jenkins/workspace/Lucene-Solr-master-MacOSX/solr/build/solr-core/test/J0/temp/solr.handler.TestReplicationHandler_7DF89915E8AE43B4-001/solr-instance-001/collection1/data, hostContext=/solr, hostPort=54036}
[junit4] 2> 1365860 INFO (TEST-TestReplicationHandler.doTestIndexFetchWithMasterUrl-seed#[7DF89915E8AE43B4]) [ ] o.a.s.s.SolrDispatchFilter SolrDispatchFilter.init(): sun.misc.Launcher$AppClassLoader@4554617c
[junit4] 2> 1365861 INFO (TEST-TestReplicationHandler.doTestIndexFetchWithMasterUrl-seed#[7DF89915E8AE43B4]) [ ] o.a.s.c.SolrResourceLoader new SolrResourceLoader for directory: '/Users/jenkins/workspace/Lucene-Solr-master-MacOSX/solr/build/solr-core/test/J0/temp/solr.handler.TestReplicationHandler_7DF89915E8AE43B4-001/solr-instance-001'
[junit4] 2> 1365861 INFO (TEST-TestReplicationHandler.doTestIndexFetchWithMasterUrl-seed#[7DF89915E8AE43B4]) [ ] o.a.s.c.SolrResourceLoader JNDI not configured for solr (NoInitialContextEx)
[junit4] 2> 1365861 INFO (TEST-TestReplicationHandler.doTestIndexFetchWithMasterUrl-seed#[7DF89915E8AE43B4]) [ ] o.a.s.c.SolrResourceLoader solr home defaulted to 'solr/' (could not find system property or JNDI)
[junit4] 2> 1365861 INFO (TEST-TestReplicationHandler.doTestIndexFetchWithMasterUrl-seed#[7DF89915E8AE43B4]) [ ] o.a.s.c.SolrXmlConfig Loading container configuration from /Users/jenkins/workspace/Lucene-Solr-master-MacOSX/solr/build/solr-core/test/J0/temp/solr.handler.TestReplicationHandler_7DF89915E8AE43B4-001/solr-instance-001/solr.xml
[junit4] 2> 1365913 INFO (TEST-TestReplicationHandler.doTestIndexFetchWithMasterUrl-seed#[7DF89915E8AE43B4]) [ ] o.a.s.c.CorePropertiesLocator Config-defined core root directory: /Users/jenkins/workspace/Lucene-Solr-master-MacOSX/solr/build/solr-core/test/J0/temp/solr.handler.TestReplicationHandler_7DF89915E8AE43B4-001/solr-instance-001/.
[junit4] 2> 1365914 INFO (TEST-TestReplicationHandler.doTestIndexFetchWithMasterUrl-seed#[7DF89915E8AE43B4]) [ ] o.a.s.c.CoreContainer New CoreContainer 1298358149
[junit4] 2> 1365914 INFO (TEST-TestReplicationHandler.doTestIndexFetchWithMasterUrl-seed#[7DF89915E8AE43B4]) [ ] o.a.s.c.CoreContainer Loading cores into CoreContainer [instanceDir=/Users/jenkins/workspace/Lucene-Solr-master-MacOSX/solr/build/solr-core/test/J0/temp/solr.handler.TestReplicationHandler_7DF89915E8AE43B4-001/solr-instance-001]
[junit4] 2> 1365914 WARN (TEST-TestReplicationHandler.doTestIndexFetchWithMasterUrl-seed#[7DF89915E8AE43B4]) [ ] o.a.s.c.CoreContainer Couldn't add files from /Users/jenkins/workspace/Lucene-Solr-master-MacOSX/solr/build/solr-core/test/J0/temp/solr.handler.TestReplicationHandler_7DF89915E8AE43B4-001/solr-instance-001/lib to classpath: /Users/jenkins/workspace/Lucene-Solr-master-MacOSX/solr/build/solr-core/test/J0/temp/solr.handler.TestReplicationHandler_7DF89915E8AE43B4-001/solr-instance-001/lib
[junit4] 2> 1365914 INFO (TEST-TestReplicationHandler.doTestIndexFetchWithMasterUrl-seed#[7DF89915E8AE43B4]) [ ] o.a.s.h.c.HttpShardHandlerFactory created with socketTimeout : 90000,urlScheme : ,connTimeout : 15000,maxConnectionsPerHost : 20,maxConnections : 10000,corePoolSize : 0,maximumPoolSize : 2147483647,maxThreadIdleTime : 5,sizeOfQueue : -1,fairnessPolicy : false,
[junit4] 2> 1365920 INFO (TEST-TestReplicationHandler.doTestIndexFetchWithMasterUrl-seed#[7DF89915E8AE43B4]) [ ] o.a.s.u.UpdateShardHandler Created UpdateShardHandler HTTP client with params: socketTimeout=340000&connTimeout=45000&maxConnections=100000&maxConnectionsPerHost=100000
[junit4] 2> 1365920 INFO (TEST-TestReplicationHandler.doTestIndexFetchWithMasterUrl-seed#[7DF89915E8AE43B4]) [ ] o.a.s.l.LogWatcher SLF4J impl is org.slf4j.impl.Log4jLoggerFactory
[junit4] 2> 1365920 INFO (TEST-TestReplicationHandler.doTestIndexFetchWithMasterUrl-seed#[7DF89915E8AE43B4]) [ ] o.a.s.l.LogWatcher Registering Log Listener [Log4j (org.slf4j.impl.Log4jLoggerFactory)]
[junit4] 2> 1365920 INFO (TEST-TestReplicationHandler.doTestIndexFetchWithMasterUrl-seed#[7DF89915E8AE43B4]) [ ] o.a.s.c.CoreContainer Security conf doesn't exist. Skipping setup for authorization module.
[junit4] 2> 1365920 INFO (TEST-TestReplicationHandler.doTestIndexFetchWithMasterUrl-seed#[7DF89915E8AE43B4]) [ ] o.a.s.c.CoreContainer No authentication plugin used.
[junit4] 2> 1366404 INFO (TEST-TestReplicationHandler.doTestIndexFetchWithMasterUrl-seed#[7DF89915E8AE43B4]) [ ] o.a.s.c.CorePropertiesLocator Looking for core definitions underneath /Users/jenkins/workspace/Lucene-Solr-master-MacOSX/solr/build/solr-core/test/J0/temp/solr.handler.TestReplicationHandler_7DF89915E8AE43B4-001/solr-instance-001/.
[junit4] 2> 1366406 INFO (TEST-TestReplicationHandler.doTestIndexFetchWithMasterUrl-seed#[7DF89915E8AE43B4]) [ ] o.a.s.c.CoreDescriptor Created CoreDescriptor: {name=collection1, config=solrconfig.xml, loadOnStartup=true, schema=schema.xml, configSetProperties=configsetprops.json, transient=false, dataDir=data/}
[junit4] 2> 1366406 INFO (TEST-TestReplicationHandler.doTestIndexFetchWithMasterUrl-seed#[7DF89915E8AE43B4]) [ ] o.a.s.c.CorePropertiesLocator Found core collection1 in /Users/jenkins/workspace/Lucene-Solr-master-MacOSX/solr/build/solr-core/test/J0/temp/solr.handler.TestReplicationHandler_7DF89915E8AE43B4-001/solr-instance-001/./collection1
[junit4] 2> 1366406 INFO (TEST-TestReplicationHandler.doTestIndexFetchWithMasterUrl-seed#[7DF89915E8AE43B4]) [ ] o.a.s.c.CorePropertiesLocator Found 1 core definitions
[junit4] 2> 1366407 INFO (coreLoadExecutor-3825-thread-1) [ ] o.a.s.c.SolrResourceLoader new SolrResourceLoader for directory: '/Users/jenkins/workspace/Lucene-Solr-master-MacOSX/solr/build/solr-core/test/J0/temp/solr.handler.TestReplicationHandler_7DF89915E8AE43B4-001/solr-instance-001/collection1'
[junit4] 2> 1366407 INFO (TEST-TestReplicationHandler.doTestIndexFetchWithMasterUrl-seed#[7DF89915E8AE43B4]) [ ] o.a.s.s.SolrDispatchFilter user.dir=/Users/jenkins/workspace/Lucene-Solr-master-MacOSX/solr/build/solr-core/test/J0
[junit4] 2> 1366407 INFO (coreLoadExecutor-3825-thread-1) [ ] o.a.s.c.SolrResourceLoader JNDI not configured for solr (NoInitialContextEx)
[junit4] 2> 1366408 INFO (coreLoadExecutor-3825-thread-1) [ ] o.a.s.c.SolrResourceLoader solr home defaulted to 'solr/' (could not find system property or JNDI)
[junit4] 2> 1366407 INFO (TEST-TestReplicationHandler.doTestIndexFetchWithMasterUrl-seed#[7DF89915E8AE43B4]) [ ] o.a.s.s.SolrDispatchFilter SolrDispatchFilter.init() done
[junit4] 2> 1366417 INFO (coreLoadExecutor-3825-thread-1) [ ] o.a.s.c.SolrConfig current version of requestparams : -1
[junit4] 2> 1366419 WARN (coreLoadExecutor-3825-thread-1) [ ] o.a.s.c.Config Beginning with Solr 5.5, <mergePolicy> is deprecated, use <mergePolicyFactory> instead.
[junit4] 2> 1366420 INFO (coreLoadExecutor-3825-thread-1) [ ] o.a.s.c.SolrConfig Using Lucene MatchVersion: 7.0.0
[junit4] 2> 1366425 INFO (coreLoadExecutor-3825-thread-1) [ ] o.a.s.c.SolrConfig Loaded SolrConfig: solrconfig.xml
[junit4] 2> 1366427 INFO (coreLoadExecutor-3825-thread-1) [ ] o.a.s.s.IndexSchema [collection1] Schema name=test
[junit4] 2> 1366432 INFO (coreLoadExecutor-3825-thread-1) [ ] o.a.s.s.IndexSchema unique key field: id
[junit4] 2> 1366437 INFO (coreLoadExecutor-3825-thread-1) [ ] o.a.s.c.ConfigSetProperties Did not find ConfigSet properties, assuming default properties: Can't find resource 'configsetprops.json' in classpath or '/Users/jenkins/workspace/Lucene-Solr-master-MacOSX/solr/build/solr-core/test/J0/temp/solr.handler.TestReplicationHandler_7DF89915E8AE43B4-001/solr-instance-001/collection1'
[junit4] 2> 1366437 INFO (coreLoadExecutor-3825-thread-1) [ ] o.a.s.c.CoreContainer Creating SolrCore 'collection1' using configuration from instancedir /Users/jenkins/workspace/Lucene-Solr-master-MacOSX/solr/build/solr-core/test/J0/temp/solr.handler.TestReplicationHandler_7DF89915E8AE43B4-001/solr-instance-001/./collection1
[junit4] 2> 1366437 INFO (coreLoadExecutor-3825-thread-1) [ x:collection1] o.a.s.c.SolrCore org.apache.solr.core.MockDirectoryFactory
[junit4] 2> 1366437 INFO (coreLoadExecutor-3825-thread-1) [ x:collection1] o.a.s.c.SolrCore [[collection1] ] Opening new SolrCore at [/Users/jenkins/workspace/Lucene-Solr-master-MacOSX/solr/build/solr-core/test/J0/temp/solr.handler.TestReplicationHandler_7DF89915E8AE43B4-001/solr-instance-001/collection1], dataDir=[/Users/jenkins/workspace/Lucene-Solr-master-MacOSX/solr/build/solr-core/test/J0/temp/solr.handler.TestReplicationHandler_7DF89915E8AE43B4-001/solr-instance-001/./collection1/data/]
[junit4] 2> 1366437 INFO (coreLoadExecutor-3825-thread-1) [ x:collection1] o.a.s.c.SolrCore JMX monitoring not detected for core: collection1
[junit4] 2> 1366438 INFO (coreLoadExecutor-3825-thread-1) [ x:collection1] o.a.s.c.CachingDirectoryFactory return new directory for /Users/jenkins/workspace/Lucene-Solr-master-MacOSX/solr/build/solr-core/test/J0/temp/solr.handler.TestReplicationHandler_7DF89915E8AE43B4-001/solr-instance-001/./collection1/data/snapshot_metadata
[junit4] 2> 1366438 INFO (coreLoadExecutor-3825-thread-1) [ x:collection1] o.a.s.c.s.SolrSnapshotMetaDataManager Loading from snapshot metadata file...
[junit4] 2> 1366438 INFO (coreLoadExecutor-3825-thread-1) [ x:collection1] o.a.s.c.CachingDirectoryFactory return new directory for /Users/jenkins/workspace/Lucene-Solr-master-MacOSX/solr/build/solr-core/test/J0/temp/solr.handler.TestReplicationHandler_7DF89915E8AE43B4-001/solr-instance-001/./collection1/data
[junit4] 2> 1366438 INFO (coreLoadExecutor-3825-thread-1) [ x:collection1] o.a.s.c.SolrCore New index directory detected: old=null new=/Users/jenkins/workspace/Lucene-Solr-master-MacOSX/solr/build/solr-core/test/J0/temp/solr.handler.TestReplicationHandler_7DF89915E8AE43B4-001/solr-instance-001/./collection1/data/index/
[junit4] 2> 1366438 WARN (coreLoadExecutor-3825-thread-1) [ x:collection1] o.a.s.c.SolrCore [collection1] Solr index directory '/Users/jenkins/workspace/Lucene-Solr-master-MacOSX/solr/build/solr-core/test/J0/temp/solr.handler.TestReplicationHandler_7DF89915E8AE43B4-001/solr-instance-001/./collection1/data/index' doesn't exist. Creating new index...
[junit4] 2> 1366438 INFO (coreLoadExecutor-3825-thread-1) [ x:collection1] o.a.s.c.CachingDirectoryFactory return new directory for /Users/jenkins/workspace/Lucene-Solr-master-MacOSX/solr/build/solr-core/test/J0/temp/solr.handler.TestReplicationHandler_7DF89915E8AE43B4-001/solr-instance-001/./collection1/data/index
[junit4] 2> 1366438 INFO (coreLoadExecutor-3825-thread-1) [ x:collection1] o.a.s.u.RandomMergePolicy RandomMergePolicy wrapping class org.apache.lucene.index.LogByteSizeMergePolicy: [LogByteSizeMergePolicy: minMergeSize=1677721, mergeFactor=12, maxMergeSize=2147483648, maxMergeSizeForForcedMerge=9223372036854775807, calibrateSizeByDeletes=true, maxMergeDocs=2147483647, maxCFSSegmentSizeMB=8.796093022207999E12, noCFSRatio=1.0]
[junit4] 2> 1366439 INFO (coreLoadExecutor-3825-thread-1) [ x:collection1] o.a.s.c.SolrDeletionPolicy SolrDeletionPolicy.onCommit: commits: num=1
[junit4] 2> commit{dir=MockDirectoryWrapper(RAMDirectory@55a9af72 lockFactory=org.apache.lucene.store.SingleInstanceLockFactory@28e37fb2),segFN=segments_1,generation=1}
[junit4] 2> 1366439 INFO (coreLoadExecutor-3825-thread-1) [ x:collection1] o.a.s.c.SolrDeletionPolicy newest commit generation = 1
[junit4] 2> 1366439 INFO (OldIndexDirectoryCleanupThreadForCore-collection1) [ x:collection1] o.a.s.c.SolrCore Looking for old index directories to cleanup for core collection1 in /Users/jenkins/workspace/Lucene-Solr-master-MacOSX/solr/build/solr-core/test/J0/temp/solr.handler.TestReplicationHandler_7DF89915E8AE43B4-001/solr-instance-001/./collection1/data/
[junit4] 2> 1366441 INFO (coreLoadExecutor-3825-thread-1) [ x:collection1] o.a.s.c.SolrCore no updateRequestProcessorChain defined as default, creating implicit default
[junit4] 2> 1366444 INFO (coreLoadExecutor-3825-thread-1) [ x:collection1] o.a.s.h.l.XMLLoader xsltCacheLifetimeSeconds=60
[junit4] 2> 1366444 INFO (coreLoadExecutor-3825-thread-1) [ x:collection1] o.a.s.h.l.XMLLoader xsltCacheLifetimeSeconds=60
[junit4] 2> 1366445 INFO (coreLoadExecutor-3825-thread-1) [ x:collection1] o.a.s.h.l.XMLLoader xsltCacheLifetimeSeconds=60
[junit4] 2> 1366446 INFO (coreLoadExecutor-3825-thread-1) [ x:collection1] o.a.s.h.l.XMLLoader xsltCacheLifetimeSeconds=60
[junit4] 2> 1366448 INFO (coreLoadExecutor-3825-thread-1) [ x:collection1] o.a.s.c.PluginBag requestHandler : 'lazy' created with startup=lazy
[junit4] 2> 1366448 INFO (coreLoadExecutor-3825-thread-1) [ x:collection1] o.a.s.c.RequestHandlers Registered paths: /admin/mbeans,standard,lazy,/update/json/docs,/admin/luke,/export,/get,/admin/properties,/update/json,/admin/threads,/update/csv,/sql,/graph,/admin/segments,/admin/system,/replication,defaults,/config,/stream,/schema,/admin/plugins,/admin/logging,/admin/ping,/update,/admin/file,/terms
[junit4] 2> 1366448 INFO (coreLoadExecutor-3825-thread-1) [ x:collection1] o.a.s.c.SolrCore Using default statsCache cache: org.apache.solr.search.stats.LocalStatsCache
[junit4] 2> 1366448 INFO (coreLoadExecutor-3825-thread-1) [ x:collection1] o.a.s.u.CommitTracker Hard AutoCommit: disabled
[junit4] 2> 1366448 INFO (coreLoadExecutor-3825-thread-1) [ x:collection1] o.a.s.u.CommitTracker Soft AutoCommit: disabled
[junit4] 2> 1366448 INFO (coreLoadExecutor-3825-thread-1) [ x:collection1] o.a.s.u.RandomMergePolicy RandomMergePolicy wrapping class org.apache.lucene.index.TieredMergePolicy: [TieredMergePolicy: maxMergeAtOnce=27, maxMergeAtOnceExplicit=38, maxMergedSegmentMB=49.9072265625, floorSegmentMB=0.4091796875, forceMergeDeletesPctAllowed=12.336132729501166, segmentsPerTier=5.0, maxCFSSegmentSizeMB=8.796093022207999E12, noCFSRatio=1.0
[junit4] 2> 1366448 INFO (coreLoadExecutor-3825-thread-1) [ x:collection1] o.a.s.c.SolrDeletionPolicy SolrDeletionPolicy.onInit: commits: num=1
[junit4] 2> commit{dir=MockDirectoryWrapper(RAMDirectory@55a9af72 lockFactory=org.apache.lucene.store.SingleInstanceLockFactory@28e37fb2),segFN=segments_1,generation=1}
[junit4] 2> 1366448 INFO (coreLoadExecutor-3825-thread-1) [ x:collection1] o.a.s.c.SolrDeletionPolicy newest commit generation = 1
[junit4] 2> 1366448 INFO (coreLoadExecutor-3825-thread-1) [ x:collection1] o.a.s.s.SolrIndexSearcher Opening [Searcher@37297626[collection1] main]
[junit4] 2> 1366449 INFO (coreLoadExecutor-3825-thread-1) [ x:collection1] o.a.s.r.ManagedResourceStorage File-based storage initialized to use dir: /Users/jenkins/workspace/Lucene-Solr-master-MacOSX/solr/build/solr-core/test/J0/temp/solr.handler.TestReplicationHandler_7DF89915E8AE43B4-001/solr-instance-001/collection1/conf
[junit4] 2> 1366449 INFO (coreLoadExecutor-3825-thread-1) [ x:collection1] o.a.s.r.RestManager Initializing RestManager with initArgs: {storageDir=/Users/jenkins/workspace/Lucene-Solr-master-MacOSX/solr/build/solr-core/test/J0/temp/solr.handler.TestReplicationHandler_7DF89915E8AE43B4-001/solr-instance-001/collection1/conf}
[junit4] 2> 1366449 INFO (coreLoadExecutor-3825-thread-1) [ x:collection1] o.a.s.r.ManagedResourceStorage Reading _rest_managed.json using file:dir=/Users/jenkins/workspace/Lucene-Solr-master-MacOSX/solr/build/solr-core/test/J0/temp/solr.handler.TestReplicationHandler_7DF89915E8AE43B4-001/solr-instance-001/collection1/conf
[junit4] 2> 1366449 INFO (coreLoadExecutor-3825-thread-1) [ x:collection1] o.a.s.r.RestManager Initializing 0 registered ManagedResources
[junit4] 2> 1366449 INFO (coreLoadExecutor-3825-thread-1) [ x:collection1] o.a.s.h.ReplicationHandler Replication enabled for following config files: schema.xml,xslt/dummy.xsl
[junit4] 2> 1366449 INFO (coreLoadExecutor-3825-thread-1) [ x:collection1] o.a.s.h.ReplicationHandler Commits will be reserved for 10000
[junit4] 2> 1366449 INFO (searcherExecutor-3826-thread-1-processing-x:collection1) [ x:collection1] o.a.s.c.SolrCore [collection1] Registered new searcher Searcher@37297626[collection1] main{ExitableDirectoryReader(UninvertingDirectoryReader())}
[junit4] 2> 1366449 INFO (coreLoadExecutor-3825-thread-1) [ x:collection1] o.a.s.c.CoreContainer registering core: collection1
[junit4] 2> 1366912 INFO (TEST-TestReplicationHandler.doTestIndexFetchWithMasterUrl-seed#[7DF89915E8AE43B4]) [ ] o.a.s.SolrTestCaseJ4 Writing core.properties file to /Users/jenkins/workspace/Lucene-Solr-master-MacOSX/solr/build/solr-core/test/J0/temp/solr.handler.TestReplicationHandler_7DF89915E8AE43B4-001/solr-instance-002/collection1
[junit4] 2> 1366925 INFO (TEST-TestReplicationHandler.doTestIndexFetchWithMasterUrl-seed#[7DF89915E8AE43B4]) [ ] o.e.j.s.Server jetty-9.3.8.v20160314
[junit4] 2> 1366927 INFO (TEST-TestReplicationHandler.doTestIndexFetchWithMasterUrl-seed#[7DF89915E8AE43B4]) [ ] o.e.j.s.h.ContextHandler Started o.e.j.s.ServletContextHandler@21ea1262{/solr,null,AVAILABLE}
[junit4] 2> 1366928 INFO (TEST-TestReplicationHandler.doTestIndexFetchWithMasterUrl-seed#[7DF89915E8AE43B4]) [ ] o.e.j.s.ServerConnector Started ServerConnector@4e9953f8{HTTP/1.1,[http/1.1]}{127.0.0.1:54037}
[junit4] 2> 1366928 INFO (TEST-TestReplicationHandler.doTestIndexFetchWithMasterUrl-seed#[7DF89915E8AE43B4]) [ ] o.e.j.s.Server Started @1372182ms
[junit4] 2> 1366928 INFO (TEST-TestReplicationHandler.doTestIndexFetchWithMasterUrl-seed#[7DF89915E8AE43B4]) [ ] o.a.s.c.s.e.JettySolrRunner Jetty properties: {solr.data.dir=/Users/jenkins/workspace/Lucene-Solr-master-MacOSX/solr/build/solr-core/test/J0/temp/solr.handler.TestReplicationHandler_7DF89915E8AE43B4-001/solr-instance-002/collection1/data, hostContext=/solr, hostPort=54037}
[junit4] 2> 1366929 INFO (TEST-TestReplicationHandler.doTestIndexFetchWithMasterUrl-seed#[7DF89915E8AE43B4]) [ ] o.a.s.s.SolrDispatchFilter SolrDispatchFilter.init(): sun.misc.Launcher$AppClassLoader@4554617c
[junit4] 2> 1366929 INFO (TEST-TestReplicationHandler.doTestIndexFetchWithMasterUrl-seed#[7DF89915E8AE43B4]) [ ] o.a.s.c.SolrResourceLoader new SolrResourceLoader for directory: '/Users/jenkins/workspace/Lucene-Solr-master-MacOSX/solr/build/solr-core/test/J0/temp/solr.handler.TestReplicationHandler_7DF89915E8AE43B4-001/solr-instance-002'
[junit4] 2> 1366929 INFO (TEST-TestReplicationHandler.doTestIndexFetchWithMasterUrl-seed#[7DF89915E8AE43B4]) [ ] o.a.s.c.SolrResourceLoader JNDI not configured for solr (NoInitialContextEx)
[junit4] 2> 1366929 INFO (TEST-TestReplicationHandler.doTestIndexFetchWithMasterUrl-seed#[7DF89915E8AE43B4]) [ ] o.a.s.c.SolrResourceLoader solr home defaulted to 'solr/' (could not find system property or JNDI)
[junit4] 2> 1366930 INFO (TEST-TestReplicationHandler.doTestIndexFetchWithMasterUrl-seed#[7DF89915E8AE43B4]) [ ] o.a.s.c.SolrXmlConfig Loading container configuration from /Users/jenkins/workspace/Lucene-Solr-master-MacOSX/solr/build/solr-core/test/J0/temp/solr.handler.TestReplicationHandler_7DF89915E8AE43B4-001/solr-instance-002/solr.xml
[junit4] 2> 1366946 INFO (TEST-TestReplicationHandler.doTestIndexFetchWithMasterUrl-seed#[7DF89915E8AE43B4]) [ ] o.a.s.c.CorePropertiesLocator Config-defined core root directory: /Users/jenkins/workspace/Lucene-Solr-master-MacOSX/solr/build/solr-core/test/J0/temp/solr.handler.TestReplicationHandler_7DF89915E8AE43B4-001/solr-instance-002/.
[junit4] 2> 1366947 INFO (TEST-TestReplicationHandler.doTestIndexFetchWithMasterUrl-seed#[7DF89915E8AE43B4]) [ ] o.a.s.c.CoreContainer New CoreContainer 455188215
[junit4] 2> 1366947 INFO (TEST-TestReplicationHandler.doTestIndexFetchWithMasterUrl-seed#[7DF89915E8AE43B4]) [ ] o.a.s.c.CoreContainer Loading cores into CoreContainer [instanceDir=/Users/jenkins/workspace/Lucene-Solr-master-MacOSX/solr/build/solr-core/test/J0/temp/solr.handler.TestReplicationHandler_7DF89915E8AE43B4-001/solr-instance-002]
[junit4] 2> 1366947 WARN (TEST-TestReplicationHandler.doTestIndexFetchWithMasterUrl-seed#[7DF89915E8AE43B4]) [ ] o.a.s.c.CoreContainer Couldn't add files from /Users/jenkins/workspace/Lucene-Solr-master-MacOSX/solr/build/solr-core/test/J0/temp/solr.handler.TestReplicationHandler_7DF89915E8AE43B4-001/solr-instance-002/lib to classpath: /Users/jenkins/workspace/Lucene-Solr-master-MacOSX/solr/build/solr-core/test/J0/temp/solr.handler.TestReplicationHandler_7DF89915E8AE43B4-001/solr-instance-002/lib
[junit4] 2> 1366947 INFO (TEST-TestReplicationHandler.doTestIndexFetchWithMasterUrl-seed#[7DF89915E8AE43B4]) [ ] o.a.s.h.c.HttpShardHandlerFactory created with socketTimeout : 90000,urlScheme : ,connTimeout : 15000,maxConnectionsPerHost : 20,maxConnections : 10000,corePoolSize : 0,maximumPoolSize : 2147483647,maxThreadIdleTime : 5,sizeOfQueue : -1,fairnessPolicy : false,
[junit4] 2> 1366949 INFO (TEST-TestReplicationHandler.doTestIndexFetchWithMasterUrl-seed#[7DF89915E8AE43B4]) [ ] o.a.s.u.UpdateShardHandler Created UpdateShardHandler HTTP client with params: socketTimeout=340000&connTimeout=45000&maxConnections=100000&maxConnectionsPerHost=100000
[junit4] 2> 1366949 INFO (TEST-TestReplicationHandler.doTestIndexFetchWithMasterUrl-seed#[7DF89915E8AE43B4]) [ ] o.a.s.l.LogWatcher SLF4J impl is org.slf4j.impl.Log4jLoggerFactory
[junit4] 2> 1366949 INFO (TEST-TestReplicationHandler.doTestIndexFetchWithMasterUrl-seed#[7DF89915E8AE43B4]) [ ] o.a.s.l.LogWatcher Registering Log Listener [Log4j (org.slf4j.impl.Log4jLoggerFactory)]
[junit4] 2> 1366949 INFO (TEST-TestReplicationHandler.doTestIndexFetchWithMasterUrl-seed#[7DF89915E8AE43B4]) [ ] o.a.s.c.CoreContainer Security conf doesn't exist. Skipping setup for authorization module.
[junit4] 2> 1366950 INFO (TEST-TestReplicationHandler.doTestIndexFetchWithMasterUrl-seed#[7DF89915E8AE43B4]) [ ] o.a.s.c.CoreContainer No authentication plugin used.
[junit4] 2> 1366951 INFO (TEST-TestReplicationHandler.doTestIndexFetchWithMasterUrl-seed#[7DF89915E8AE43B4]) [ ] o.a.s.c.CorePropertiesLocator Looking for core definitions underneath /Users/jenkins/workspace/Lucene-Solr-master-MacOSX/solr/build/solr-core/test/J0/temp/solr.handler.TestReplicationHandler_7DF89915E8AE43B4-001/solr-instance-002/.
[junit4] 2> 1366953 INFO (TEST-TestReplicationHandler.doTestIndexFetchWithMasterUrl-seed#[7DF89915E8AE43B4]) [ ] o.a.s.c.CoreDescriptor Created CoreDescriptor: {name=collection1, config=solrconfig.xml, loadOnStartup=true, schema=schema.xml, configSetProperties=configsetprops.json, transient=false, dataDir=data/}
[junit4] 2> 1366953 INFO (TEST-TestReplicationHandler.doTestIndexFetchWithMasterUrl-seed#[7DF89915E8AE43B4]) [ ] o.a.s.c.CorePropertiesLocator Found core collection1 in /Users/jenkins/workspace/Lucene-Solr-master-MacOSX/solr/build/solr-core/test/J0/temp/solr.handler.TestReplicationHandler_7DF89915E8AE43B4-001/solr-instance-002/./collection1
[junit4] 2> 1366953 INFO (TEST-TestReplicationHandler.doTestIndexFetchWithMasterUrl-seed#[7DF89915E8AE43B4]) [ ] o.a.s.c.CorePropertiesLocator Found 1 core definitions
[junit4] 2> 1366954 INFO (coreLoadExecutor-3835-thread-1) [ ] o.a.s.c.SolrResourceLoader new SolrResourceLoader for directory: '/Users/jenkins/workspace/Lucene-Solr-master-MacOSX/solr/build/solr-core/test/J0/temp/solr.handler.TestReplicationHandler_7DF89915E8AE43B4-001/solr-instance-002/collection1'
[junit4] 2> 1366955 INFO (TEST-TestReplicationHandler.doTestIndexFetchWithMasterUrl-seed#[7DF89915E8AE43B4]) [ ] o.a.s.s.SolrDispatchFilter user.dir=/Users/jenkins/workspace/Lucene-Solr-master-MacOSX/solr/build/solr-core/test/J0
[junit4] 2> 1366955 INFO (TEST-TestReplicationHandler.doTestIndexFetchWithMasterUrl-seed#[7DF89915E8AE43B4]) [ ] o.a.s.s.SolrDispatchFilter SolrDispatchFilter.init() done
[junit4] 2> 1366955 INFO (coreLoadExecutor-3835-thread-1) [ ] o.a.s.c.SolrResourceLoader JNDI not configured for solr (NoInitialContextEx)
[junit4] 2> 1366955 INFO (coreLoadExecutor-3835-thread-1) [ ] o.a.s.c.SolrResourceLoader solr home defaulted to 'solr/' (could not find system property or JNDI)
[junit4] 2> 1366963 INFO (coreLoadExecutor-3835-thread-1) [ ] o.a.s.c.SolrConfig current version of requestparams : -1
[junit4] 2> 1366966 WARN (coreLoadExecutor-3835-thread-1) [ ] o.a.s.c.Config Beginning with Solr 5.5, <mergePolicy> is deprecated, use <mergePolicyFactory> instead.
[junit4] 2> 1366967 INFO (coreLoadExecutor-3835-thread-1) [ ] o.a.s.c.SolrConfig Using Lucene MatchVersion: 7.0.0
[junit4] 2> 1366972 INFO (coreLoadExecutor-3835-thread-1) [ ] o.a.s.c.SolrConfig Loaded SolrConfig: solrconfig.xml
[junit4] 2> 1366975 INFO (coreLoadExecutor-3835-thread-1) [ ] o.a.s.s.IndexSchema [collection1] Schema name=test
[junit4] 2> 1366977 INFO (coreLoadExecutor-3835-thread-1) [ ] o.a.s.s.IndexSchema unique key field: id
[junit4] 2> 1366978 INFO (coreLoadExecutor-3835-thread-1) [ ] o.a.s.c.ConfigSetProperties Did not find ConfigSet properties, assuming default properties: Can't find resource 'configsetprops.json' in classpath or '/Users/jenkins/workspace/Lucene-Solr-master-MacOSX/solr/build/solr-core/test/J0/temp/solr.handler.TestReplicationHandler_7DF89915E8AE43B4-001/solr-instance-002/collection1'
[junit4] 2> 1366979 INFO (coreLoadExecutor-3835-thread-1) [ ] o.a.s.c.CoreContainer Creating SolrCore 'collection1' using configuration from instancedir /Users/jenkins/workspace/Lucene-Solr-master-MacOSX/solr/build/solr-core/test/J0/temp/solr.handler.TestReplicationHandler_7DF89915E8AE43B4-001/solr-instance-002/./collection1
[junit4] 2> 1366979 INFO (coreLoadExecutor-3835-thread-1) [ x:collection1] o.a.s.c.SolrCore org.apache.solr.core.MockDirectoryFactory
[junit4] 2> 1366979 INFO (coreLoadExecutor-3835-thread-1) [ x:collection1] o.a.s.c.SolrCore [[collection1] ] Opening new SolrCore at [/Users/jenkins/workspace/Lucene-Solr-master-MacOSX/solr/build/solr-core/test/J0/temp/solr.handler.TestReplicationHandler_7DF89915E8AE43B4-001/solr-instance-002/collection1], dataDir=[/Users/jenkins/workspace/Lucene-Solr-master-MacOSX/solr/build/solr-core/test/J0/temp/solr.handler.TestReplicationHandler_7DF89915E8AE43B4-001/solr-instance-002/./collection1/data/]
[junit4] 2> 1366979 INFO (coreLoadExecutor-3835-thread-1) [ x:collection1] o.a.s.c.SolrCore JMX monitoring not detected for core: collection1
[junit4] 2> 1366979 INFO (coreLoadExecutor-3835-thread-1) [ x:collection1] o.a.s.c.CachingDirectoryFactory return new directory for /Users/jenkins/workspace/Lucene-Solr-master-MacOSX/solr/build/solr-core/test/J0/temp/solr.handler.TestReplicationHandler_7DF89915E8AE43B4-001/solr-instance-002/./collection1/data/snapshot_metadata
[junit4] 2> 1366979 INFO (coreLoadExecutor-3835-thread-1) [ x:collection1] o.a.s.c.s.SolrSnapshotMetaDataManager Loading from snapshot metadata file...
[junit4] 2> 1366979 INFO (coreLoadExecutor-3835-thread-1) [ x:collection1] o.a.s.c.CachingDirectoryFactory return new directory for /Users/jenkins/workspace/Lucene-Solr-master-MacOSX/solr/build/solr-core/test/J0/temp/solr.handler.TestReplicationHandler_7DF89915E8AE43B4-001/solr-instance-002/./collection1/data
[junit4] 2> 1366979 INFO (coreLoadExecutor-3835-thread-1) [ x:collection1] o.a.s.c.SolrCore New index directory detected: old=null new=/Users/jenkins/workspace/Lucene-Solr-master-MacOSX/solr/build/solr-core/test/J0/temp/solr.handler.TestReplicationHandler_7DF89915E8AE43B4-001/solr-instance-002/./collection1/data/index/
[junit4] 2> 1366980 WARN (coreLoadExecutor-3835-thread-1) [ x:collection1] o.a.s.c.SolrCore [collection1] Solr index directory '/Users/jenkins/workspace/Lucene-Solr-master-MacOSX/solr/build/solr-core/test/J0/temp/solr.handler.TestReplicationHandler_7DF89915E8AE43B4-001/solr-instance-002/./collection1/data/index' doesn't exist. Creating new index...
[junit4] 2> 1366980 INFO (coreLoadExecutor-3835-thread-1) [ x:collection1] o.a.s.c.CachingDirectoryFactory return new directory for /Users/jenkins/workspace/Lucene-Solr-master-MacOSX/solr/build/solr-core/test/J0/temp/solr.handler.TestReplicationHandler_7DF89915E8AE43B4-001/solr-instance-002/./collection1/data/index
[junit4] 2> 1366980 INFO (coreLoadExecutor-3835-thread-1) [ x:collection1] o.a.s.u.RandomMergePolicy RandomMergePolicy wrapping class org.apache.lucene.index.LogByteSizeMergePolicy: [LogByteSizeMergePolicy: minMergeSize=1677721, mergeFactor=12, maxMergeSize=2147483648, maxMergeSizeForForcedMerge=9223372036854775807, calibrateSizeByDeletes=true, maxMergeDocs=2147483647, maxCFSSegmentSizeMB=8.796093022207999E12, noCFSRatio=1.0]
[junit4] 2> 1366980 INFO (coreLoadExecutor-3835-thread-1) [ x:collection1] o.a.s.c.SolrDeletionPolicy SolrDeletionPolicy.onCommit: commits: num=1
[junit4] 2> commit{dir=MockDirectoryWrapper(RAMDirectory@7a0465b4 lockFactory=org.apache.lucene.store.SingleInstanceLockFactory@12e73b29),segFN=segments_1,generation=1}
[junit4] 2> 1366980 INFO (coreLoadExecutor-3835-thread-1) [ x:collection1] o.a.s.c.SolrDeletionPolicy newest commit generation = 1
[junit4] 2> 1366981 INFO (OldIndexDirectoryCleanupThreadForCore-collection1) [ x:collection1] o.a.s.c.SolrCore Looking for old index directories to cleanup for core collection1 in /Users/jenkins/workspace/Lucene-Solr-master-MacOSX/solr/build/solr-core/test/J0/temp/solr.handler.TestReplicationHandler_7DF89915E8AE43B4-001/solr-instance-002/./collection1/data/
[junit4] 2> 1366982 INFO (coreLoadExecutor-3835-thread-1) [ x:collection1] o.a.s.c.SolrCore no updateRequestProcessorChain defined as default, creating implicit default
[junit4] 2> 1366983 INFO (coreLoadExecutor-3835-thread-1) [ x:collection1] o.a.s.h.l.XMLLoader xsltCacheLifetimeSeconds=60
[junit4] 2> 1366983 INFO (coreLoadExecutor-3835-thread-1) [ x:collection1] o.a.s.h.l.XMLLoader xsltCacheLifetimeSeconds=60
[junit4] 2> 1366984 INFO (coreLoadExecutor-3835-thread-1) [ x:collection1] o.a.s.h.l.XMLLoader xsltCacheLifetimeSeconds=60
[junit4] 2> 1366985 INFO (coreLoadExecutor-3835-thread-1) [ x:collection1] o.a.s.h.l.XMLLoader xsltCacheLifetimeSeconds=60
[junit4] 2> 1366987 INFO (coreLoadExecutor-3835-thread-1) [ x:collection1] o.a.s.c.PluginBag requestHandler : 'lazy' created with startup=lazy
[junit4] 2> 1366987 INFO (coreLoadExecutor-3835-thread-1) [ x:collection1] o.a.s.c.RequestHandlers Registered paths: /admin/mbeans,standard,lazy,/update/json/docs,/admin/luke,/export,/get,/admin/properties,/update/json,/admin/threads,/update/csv,/sql,/graph,/admin/segments,/admin/system,/replication,defaults,/config,/stream,/schema,/admin/plugins,/admin/logging,/admin/ping,/update,/admin/file,/terms
[junit4] 2> 1366987 INFO (coreLoadExecutor-3835-thread-1) [ x:collection1] o.a.s.c.SolrCore Using default statsCache cache: org.apache.solr.search.stats.LocalStatsCache
[junit4] 2> 1366987 INFO (coreLoadExecutor-3835-thread-1) [ x:collection1] o.a.s.u.CommitTracker Hard AutoCommit: disabled
[junit4] 2> 1366987 INFO (coreLoadExecutor-3835-thread-1) [ x:collection1] o.a.s.u.CommitTracker Soft AutoCommit: disabled
[junit4] 2> 1366987 INFO (coreLoadExecutor-3835-thread-1) [ x:collection1] o.a.s.u.RandomMergePolicy RandomMergePolicy wrapping class org.apache.lucene.index.TieredMergePolicy: [TieredMergePolicy: maxMergeAtOnce=27, maxMergeAtOnceExplicit=38, maxMergedSegmentMB=49.9072265625, floorSegmentMB=0.4091796875, forceMergeDeletesPctAllowed=12.336132729501166, segmentsPerTier=5.0, maxCFSSegmentSizeMB=8.796093022207999E12, noCFSRatio=1.0
[junit4] 2> 1366988 INFO (coreLoadExecutor-3835-thread-1) [ x:collection1] o.a.s.c.SolrDeletionPolicy SolrDeletionPolicy.onInit: commits: num=1
[junit4] 2> commit{dir=MockDirectoryWrapper(RAMDirectory@7a0465b4 lockFactory=org.apache.lucene.store.SingleInstanceLockFactory@12e73b29),segFN=segments_1,generation=1}
[junit4] 2> 1366988 INFO (coreLoadExecutor-3835-thread-1) [ x:collection1] o.a.s.c.SolrDeletionPolicy newest commit generation = 1
[junit4] 2> 1366988 INFO (coreLoadExecutor-3835-thread-1) [ x:collection1] o.a.s.s.SolrIndexSearcher Opening [Searcher@2fd9c110[collection1] main]
[junit4] 2> 1366988 INFO (coreLoadExecutor-3835-thread-1) [ x:collection1] o.a.s.r.ManagedResourceStorage File-based storage initialized to use dir: /Users/jenkins/workspace/Lucene-Solr-master-MacOSX/solr/build/solr-core/test/J0/temp/solr.handler.TestReplicationHandler_7DF89915E8AE43B4-001/solr-instance-002/collection1/conf
[junit4] 2> 1366988 INFO (coreLoadExecutor-3835-thread-1) [ x:collection1] o.a.s.r.RestManager Initializing RestManager with initArgs: {storageDir=/Users/jenkins/workspace/Lucene-Solr-master-MacOSX/solr/build/solr-core/test/J0/temp/solr.handler.TestReplicationHandler_7DF89915E8AE43B4-001/solr-instance-002/collection1/conf}
[junit4] 2> 1366988 INFO (coreLoadExecutor-3835-thread-1) [ x:collection1] o.a.s.r.ManagedResourceStorage Reading _rest_managed.json using file:dir=/Users/jenkins/workspace/Lucene-Solr-master-MacOSX/solr/build/solr-core/test/J0/temp/solr.handler.TestReplicationHandler_7DF89915E8AE43B4-001/solr-instance-002/collection1/conf
[junit4] 2> 1366988 INFO (coreLoadExecutor-3835-thread-1) [ x:collection1] o.a.s.r.RestManager Initializing 0 registered ManagedResources
[junit4] 2> 1366990 INFO (coreLoadExecutor-3835-thread-1) [ x:collection1] o.a.s.h.ReplicationHandler Poll scheduled at an interval of 1000ms
[junit4] 2> 1366990 INFO (searcherExecutor-3836-thread-1-processing-x:collection1) [ x:collection1] o.a.s.c.SolrCore [collection1] Registered new searcher Searcher@2fd9c110[collection1] main{ExitableDirectoryReader(UninvertingDirectoryReader())}
[junit4] 2> 1366990 INFO (coreLoadExecutor-3835-thread-1) [ x:collection1] o.a.s.c.CoreContainer registering core: collection1
[junit4] 2> 1367117 INFO (qtp805477578-8628) [ x:collection1] o.a.s.c.S.Request [collection1] webapp=/solr path=/replication params={qt=/replication&wt=javabin&version=2&command=indexversion} status=0 QTime=0
[junit4] 2> 1367483 INFO (TEST-TestReplicationHandler.doTestIndexFetchWithMasterUrl-seed#[7DF89915E8AE43B4]) [ ] o.e.j.s.ServerConnector Stopped ServerConnector@4e9953f8{HTTP/1.1,[http/1.1]}{127.0.0.1:0}
[junit4] 2> 1367484 INFO (TEST-TestReplicationHandler.doTestIndexFetchWithMasterUrl-seed#[7DF89915E8AE43B4]) [ ] o.a.s.c.CoreContainer Shutting down CoreContainer instance=455188215
[junit4] 2> 1367485 INFO (coreCloseExecutor-3841-thread-1) [ x:collection1] o.a.s.c.SolrCore [collection1] CLOSING SolrCore org.apache.solr.core.SolrCore@6fe5d0d4
[junit4] 2> 1367485 INFO (coreCloseExecutor-3841-thread-1) [ x:collection1] o.a.s.u.DirectUpdateHandler2 closing DirectUpdateHandler2{commits=0,autocommits=0,soft autocommits=0,optimizes=0,rollbacks=0,expungeDeletes=0,docsPending=0,adds=0,deletesById=0,deletesByQuery=0,errors=0,cumulative_adds=0,cumulative_deletesById=0,cumulative_deletesByQuery=0,cumulative_errors=0}
[junit4] 2> 1367485 INFO (coreCloseExecutor-3841-thread-1) [ x:collection1] o.a.s.u.SolrCoreState Closing SolrCoreState
[junit4] 2> 1367485 INFO (coreCloseExecutor-3841-thread-1) [ x:collection1] o.a.s.u.DefaultSolrCoreState SolrCoreState ref count has reached 0 - closing IndexWriter
[junit4] 2> 1367485 INFO (coreCloseExecutor-3841-thread-1) [ x:collection1] o.a.s.u.DefaultSolrCoreState closing IndexWriter with IndexWriterCloser
[junit4] 2> 1367486 INFO (coreCloseExecutor-3841-thread-1) [ x:collection1] o.a.s.c.SolrCore [collection1] Closing main searcher on request.
[junit4] 2> 1367486 INFO (coreCloseExecutor-3841-thread-1) [ x:collection1] o.a.s.c.CachingDirectoryFactory Closing MockDirectoryFactory - 3 directories currently being tracked
[junit4] 2> 1367486 INFO (coreCloseExecutor-3841-thread-1) [ x:collection1] o.a.s.c.CachingDirectoryFactory looking to close /Users/jenkins/workspace/Lucene-Solr-master-MacOSX/solr/build/solr-core/test/J0/temp/solr.handler.TestReplicationHandler_7DF89915E8AE43B4-001/solr-instance-002/./collection1/data [CachedDir<<refCount=0;path=/Users/jenkins/workspace/Lucene-Solr-master-MacOSX/solr/build/solr-core/test/J0/temp/solr.handler.TestReplicationHandler_7DF89915E8AE43B4-001/solr-instance-002/./collection1/data;done=false>>]
[junit4] 2> 1367486 INFO (coreCloseExecutor-3841-thread-1) [ x:collection1] o.a.s.c.CachingDirectoryFactory Closing directory, CoreContainer#isShutdown=true
[junit4] 2> 1367486 INFO (coreCloseExecutor-3841-thread-1) [ x:collection1] o.a.s.c.CachingDirectoryFactory Closing directory: /Users/jenkins/workspace/Lucene-Solr-master-MacOSX/solr/build/solr-core/test/J0/temp/solr.handler.TestReplicationHandler_7DF89915E8AE43B4-001/solr-instance-002/./collection1/data
[junit4] 2> 1367486 INFO (coreCloseExecutor-3841-thread-1) [ x:collection1] o.a.s.c.CachingDirectoryFactory looking to close /Users/jenkins/workspace/Lucene-Solr-master-MacOSX/solr/build/solr-core/test/J0/temp/solr.handler.TestReplicationHandler_7DF89915E8AE43B4-001/solr-instance-002/./collection1/data/index [CachedDir<<refCount=0;path=/Users/jenkins/workspace/Lucene-Solr-master-MacOSX/solr/build/solr-core/test/J0/temp/solr.handler.TestReplicationHandler_7DF89915E8AE43B4-001/solr-instance-002/./collection1/data/index;done=false>>]
[junit4] 2> 1367487 INFO (coreCloseExecutor-3841-thread-1) [ x:collection1] o.a.s.c.CachingDirectoryFactory Closing directory, CoreContainer#isShutdown=true
[junit4] 2> 1367487 INFO (coreCloseExecutor-3841-thread-1) [ x:collection1] o.a.s.c.CachingDirectoryFactory Closing directory: /Users/jenkins/workspace/Lucene-Solr-master-MacOSX/solr/build/solr-core/test/J0/temp/solr.handler.TestReplicationHandler_7DF89915E8AE43B4-001/solr-instance-002/./collection1/data/index
[junit4] 2> 1367487 INFO (coreCloseExecutor-3841-thread-1) [ x:collection1] o.a.s.c.CachingDirectoryFactory looking to close /Users/jenkins/workspace/Lucene-Solr-master-MacOSX/solr/build/solr-core/test/J0/temp/solr.handler.TestReplicationHandler_7DF89915E8AE43B4-001/solr-instance-002/./collection1/data/snapshot_metadata [CachedDir<<refCount=0;path=/Users/jenkins/workspace/Lucene-Solr-master-MacOSX/solr/build/solr-core/test/J0/temp/solr.handler.TestReplicationHandler_7DF89915E8AE43B4-001/solr-instance-002/./collection1/data/snapshot_metadata;done=false>>]
[junit4] 2> 1367487 INFO (coreCloseExecutor-3841-thread-1) [ x:collection1] o.a.s.c.CachingDirectoryFactory Closing directory, CoreContainer#isShutdown=true
[junit4] 2> 1367487 INFO (coreCloseExecutor-3841-thread-1) [ x:collection1] o.a.s.c.CachingDirectoryFactory Closing directory: /Users/jenkins/workspace/Lucene-Solr-master-MacOSX/solr/build/solr-core/test/J0/temp/solr.handler.TestReplicationHandler_7DF89915E8AE43B4-001/solr-instance-002/./collection1/data/snapshot_metadata
[junit4] 2> 1367488 INFO (TEST-TestReplicationHandler.doTestIndexFetchWithMasterUrl-seed#[7DF89915E8AE43B4]) [ ] o.e.j.s.h.ContextHandler Stopped o.e.j.s.ServletContextHandler@21ea1262{/solr,null,UNAVAILABLE}
[junit4] 2> 1367491 INFO (TEST-TestReplicationHandler.doTestIndexFetchWithMasterUrl-seed#[7DF89915E8AE43B4]) [ ] o.e.j.s.Server jetty-9.3.8.v20160314
[junit4] 2> 1367494 INFO (TEST-TestReplicationHandler.doTestIndexFetchWithMasterUrl-seed#[7DF89915E8AE43B4]) [ ] o.e.j.s.h.ContextHandler Started o.e.j.s.ServletContextHandler@4443ae64{/solr,null,AVAILABLE}
[junit4] 2> 1367494 INFO (TEST-TestReplicationHandler.doTestIndexFetchWithMasterUrl-seed#[7DF89915E8AE43B4]) [ ] o.e.j.s.ServerConnector Started ServerConnector@73bcfec1{HTTP/1.1,[http/1.1]}{127.0.0.1:54039}
[junit4] 2> 1367494 INFO (TEST-TestReplicationHandler.doTestIndexFetchWithMasterUrl-seed#[7DF89915E8AE43B4]) [ ] o.e.j.s.Server Started @1372749ms
[junit4] 2> 1367495 INFO (TEST-TestReplicationHandler.doTestIndexFetchWithMasterUrl-seed#[7DF89915E8AE43B4]) [ ] o.a.s.c.s.e.JettySolrRunner Jetty properties: {solr.data.dir=/Users/jenkins/workspace/Lucene-Solr-master-MacOSX/solr/build/solr-core/test/J0/temp/solr.handler.TestReplicationHandler_7DF89915E8AE43B4-001/solr-instance-002/collection1/data, hostContext=/solr, hostPort=54039}
[junit4] 2> 1367496 INFO (TEST-TestReplicationHandler.doTestIndexFetchWithMasterUrl-seed#[7DF89915E8AE43B4]) [ ] o.a.s.s.SolrDispatchFilter SolrDispatchFilter.init(): sun.misc.Launcher$AppClassLoader@4554617c
[junit4] 2> 1367496 INFO (TEST-TestReplicationHandler.doTestIndexFetchWithMasterUrl-seed#[7DF89915E8AE43B4]) [ ] o.a.s.c.SolrResourceLoader new SolrResourceLoader for directory: '/Users/jenkins/workspace/Lucene-Solr-master-MacOSX/solr/build/solr-core/test/J0/temp/solr.handler.TestReplicationHandler_7DF89915E8AE43B4-001/solr-instance-002'
[junit4] 2> 1367496 INFO (TEST-TestReplicationHandler.doTestIndexFetchWithMasterUrl-seed#[7DF89915E8AE43B4]) [ ] o.a.s.c.SolrResourceLoader JNDI not configured for solr (NoInitialContextEx)
[junit4] 2> 1367496 INFO (TEST-TestReplicationHandler.doTestIndexFetchWithMasterUrl-seed#[7DF89915E8AE43B4]) [ ] o.a.s.c.SolrResourceLoader solr home defaulted to 'solr/' (could not find system property or JNDI)
[junit4] 2> 1367496 INFO (TEST-TestReplicationHandler.doTestIndexFetchWithMasterUrl-seed#[7DF89915E8AE43B4]) [ ] o.a.s.c.SolrXmlConfig Loading container configuration from /Users/jenkins/workspace/Lucene-Solr-master-MacOSX/solr/build/solr-core/test/J0/temp/solr.handler.TestReplicationHandler_7DF89915E8AE43B4-001/solr-instance-002/solr.xml
[junit4] 2> 1367513 INFO (TEST-TestReplicationHandler.doTestIndexFetchWithMasterUrl-seed#[7DF89915E8AE43B4]) [ ] o.a.s.c.CorePropertiesLocator Config-defined core root directory: /Users/jenkins/workspace/Lucene-Solr-master-MacOSX/solr/build/solr-core/test/J0/temp/solr.handler.TestReplicationHandler_7DF89915E8AE43B4-001/solr-instance-002/.
[junit4] 2> 1367513 INFO (TEST-TestReplicationHandler.doTestIndexFetchWithMasterUrl-seed#[7DF89915E8AE43B4]) [ ] o.a.s.c.CoreContainer New CoreContainer 1047516754
[junit4] 2> 1367513 INFO (TEST-TestReplicationHandler.doTestIndexFetchWithMasterUrl-seed#[7DF89915E8AE43B4]) [ ] o.a.s.c.CoreContainer Loading cores into CoreContainer [instanceDir=/Users/jenkins/workspace/Lucene-Solr-master-MacOSX/solr/build/solr-core/test/J0/temp/solr.handler.TestReplicationHandler_7DF89915E8AE43B4-001/solr-instance-002]
[junit4] 2> 1367513 WARN (TEST-TestReplicationHandler.doTestIndexFetchWithMasterUrl-seed#[7DF89915E8AE43B4]) [ ] o.a.s.c.CoreContainer Couldn't add files from /Users/jenkins/workspace/Lucene-Solr-master-MacOSX/solr/build/solr-core/test/J0/temp/solr.handler.TestReplicationHandler_7DF89915E8AE43B4-001/solr-instance-002/lib to classpath: /Users/jenkins/workspace/Lucene-Solr-master-MacOSX/solr/build/solr-core/test/J0/temp/solr.handler.TestReplicationHandler_7DF89915E8AE43B4-001/solr-instance-002/lib
[junit4] 2> 1367515 INFO (TEST-TestReplicationHandler.doTestIndexFetchWithMasterUrl-seed#[7DF89915E8AE43B4]) [ ] o.a.s.h.c.HttpShardHandlerFactory created with socketTimeout : 90000,urlScheme : ,connTimeout : 15000,maxConnectionsPerHost : 20,maxConnections : 10000,corePoolSize : 0,maximumPoolSize : 2147483647,maxThreadIdleTime : 5,sizeOfQueue : -1,fairnessPolicy : false,
[junit4] 2> 1367517 INFO (TEST-TestReplicationHandler.doTestIndexFetchWithMasterUrl-seed#[7DF89915E8AE43B4]) [ ] o.a.s.u.UpdateShardHandler Created UpdateShardHandler HTTP client with params: socketTimeout=340000&connTimeout=45000&maxConnections=100000&maxConnectionsPerHost=100000
[junit4] 2> 1367518 INFO (TEST-TestReplicationHandler.doTestIndexFetchWithMasterUrl-seed#[7DF89915E8AE43B4]) [ ] o.a.s.l.LogWatcher SLF4J impl is org.slf4j.impl.Log4jLoggerFactory
[junit4] 2> 1367518 INFO (TEST-TestReplicationHandler.doTestIndexFetchWithMasterUrl-seed#[7DF89915E8AE43B4]) [ ] o.a.s.l.LogWatcher Registering Log Listener [Log4j (org.slf4j.impl.Log4jLoggerFactory)]
[junit4] 2> 1367518 INFO (TEST-TestReplicationHandler.doTestIndexFetchWithMasterUrl-seed#[7DF89915E8AE43B4]) [ ] o.a.s.c.CoreContainer Security conf doesn't exist. Skipping setup for authorization module.
[junit4] 2> 1367518 INFO (TEST-TestReplicationHandler.doTestIndexFetchWithMasterUrl-seed#[7DF89915E8AE43B4]) [ ] o.a.s.c.CoreContainer No authentication plugin used.
[junit4] 2> 1367519 INFO (TEST-TestReplicationHandler.doTestIndexFetchWithMasterUrl-seed#[7DF89915E8AE43B4]) [ ] o.a.s.c.CorePropertiesLocator Looking for core definitions underneath /Users/jenkins/workspace/Lucene-Solr-master-MacOSX/solr/build/solr-core/test/J0/temp/solr.handler.TestReplicationHandler_7DF89915E8AE43B4-001/solr-instance-002/.
[junit4] 2> 1367520 INFO (TEST-TestReplicationHandler.doTestIndexFetchWithMasterUrl-seed#[7DF89915E8AE43B4]) [ ] o.a.s.c.CoreDescriptor Created CoreDescriptor: {name=collection1, config=solrconfig.xml, loadOnStartup=true, schema=schema.xml, configSetProperties=configsetprops.json, transient=false, dataDir=data/}
[junit4] 2> 1367520 INFO (TEST-TestReplicationHandler.doTestIndexFetchWithMasterUrl-seed#[7DF89915E8AE43B4]) [ ] o.a.s.c.CorePropertiesLocator Found core collection1 in /Users/jenkins/workspace/Lucene-Solr-master-MacOSX/solr/build/solr-core/test/J0/temp/solr.handler.TestReplicationHandler_7DF89915E8AE43B4-001/solr-instance-002/./collection1
[junit4] 2> 1367520 INFO (TEST-TestReplicationHandler.doTestIndexFetchWithMasterUrl-seed#[7DF89915E8AE43B4]) [ ] o.a.s.c.CorePropertiesLocator Found 1 core definitions
[junit4] 2> 1367521 INFO (coreLoadExecutor-3848-thread-1) [ ] o.a.s.c.SolrResourceLoader new SolrResourceLoader for directory: '/Users/jenkins/workspace/Lucene-Solr-master-MacOSX/solr/build/solr-core/test/J0/temp/solr.handler.TestReplicationHandler_7DF89915E8AE43B4-001/solr-instance-002/collection1'
[junit4] 2> 1367523 INFO (coreLoadExecutor-3848-thread-1) [ ] o.a.s.c.SolrResourceLoader JNDI not configured for solr (NoInitialContextEx)
[junit4] 2> 1367523 INFO (TEST-TestReplicationHandler.doTestIndexFetchWithMasterUrl-seed#[7DF89915E8AE43B4]) [ ] o.a.s.s.SolrDispatchFilter user.dir=/Users/jenkins/workspace/Lucene-Solr-master-MacOSX/solr/build/solr-core/test/J0
[junit4] 2> 1367523 INFO (coreLoadExecutor-3848-thread-1) [ ] o.a.s.c.SolrResourceLoader solr home defaulted to 'solr/' (could not find system property or JNDI)
[junit4] 2> 1367523 INFO (TEST-TestReplicationHandler.doTestIndexFetchWithMasterUrl-seed#[7DF89915E8AE43B4]) [ ] o.a.s.s.SolrDispatchFilter SolrDispatchFilter.init() done
[junit4] 2> 1367530 INFO (coreLoadExecutor-3848-thread-1) [ ] o.a.s.c.SolrConfig current version of requestparams : -1
[junit4] 2> 1367532 WARN (coreLoadExecutor-3848-thread-1) [ ] o.a.s.c.Config Beginning with Solr 5.5, <mergePolicy> is deprecated, use <mergePolicyFactory> instead.
[junit4] 2> 1367533 INFO (coreLoadExecutor-3848-thread-1) [ ] o.a.s.c.SolrConfig Using Lucene MatchVersion: 7.0.0
[junit4] 2> 1367573 INFO (coreLoadExecutor-3848-thread-1) [ ] o.a.s.c.SolrConfig Loaded SolrConfig: solrconfig.xml
[junit4] 2> 1367580 INFO (coreLoadExecutor-3848-thread-1) [ ] o.a.s.s.IndexSchema [collection1] Schema name=test
[junit4] 2> 1367582 INFO (coreLoadExecutor-3848-thread-1) [ ] o.a.s.s.IndexSchema unique key field: id
[junit4] 2> 1367584 INFO (coreLoadExecutor-3848-thread-1) [ ] o.a.s.c.ConfigSetProperties Did not find ConfigSet properties, assuming default properties: Can't find resource 'configsetprops.json' in classpath or '/Users/jenkins/workspace/Lucene-Solr-master-MacOSX/solr/build/solr-core/test/J0/temp/solr.handler.TestReplicationHandler_7DF89915E8AE43B4-001/solr-instance-002/collection1'
[junit4] 2> 1367584 INFO (coreLoadExecutor-3848-thread-1) [ ] o.a.s.c.CoreContainer Creating SolrCore 'collection1' using configuration from instancedir /Users/jenkins/workspace/Lucene-Solr-master-MacOSX/solr/build/solr-core/test/J0/temp/solr.handler.TestReplicationHandler_7DF89915E8AE43B4-001/solr-instance-002/./collection1
[junit4] 2> 1367584 INFO (coreLoadExecutor-3848-thread-1) [ x:collection1] o.a.s.c.SolrCore org.apache.solr.core.MockDirectoryFactory
[junit4] 2> 1367584 INFO (coreLoadExecutor-3848-thread-1) [ x:collection1] o.a.s.c.SolrCore [[collection1] ] Opening new SolrCore at [/Users/jenkins/workspace/Lucene-Solr-master-MacOSX/solr/build/solr-core/test/J0/temp/solr.handler.TestReplicationHandler_7DF89915E8AE43B4-001/solr-instance-002/collection1], dataDir=[/Users/jenkins/workspace/Lucene-Solr-master-MacOSX/solr/build/solr-core/test/J0/temp/solr.handler.TestReplicationHandler_7DF89915E8AE43B4-001/solr-instance-002/./collection1/data/]
[junit4] 2> 1367585 INFO (coreLoadExecutor-3848-thread-1) [ x:collection1] o.a.s.c.SolrCore JMX monitoring not detected for core: collection1
[junit4] 2> 1367585 INFO (coreLoadExecutor-3848-thread-1) [ x:collection1] o.a.s.c.CachingDirectoryFactory return new directory for /Users/jenkins/workspace/Lucene-Solr-master-MacOSX/solr/build/solr-core/test/J0/temp/solr.handler.TestReplicationHandler_7DF89915E8AE43B4-001/solr-instance-002/./collection1/data/snapshot_metadata
[junit4] 2> 1367585 INFO (coreLoadExecutor-3848-thread-1) [ x:collection1] o.a.s.c.s.SolrSnapshotMetaDataManager Loading from snapshot metadata file...
[junit4] 2> 1367585 INFO (coreLoadExecutor-3848-thread-1) [ x:collection1] o.a.s.c.CachingDirectoryFactory return new directory for /Users/jenkins/workspace/Lucene-Solr-master-MacOSX/solr/build/solr-core/test/J0/temp/solr.handler.TestReplicationHandler_7DF89915E8AE43B4-001/solr-instance-002/./collection1/data
[junit4] 2> 1367585 INFO (coreLoadExecutor-3848-thread-1) [ x:collection1] o.a.s.c.SolrCore New index directory detected: old=null new=/Users/jenkins/workspace/Lucene-Solr-master-MacOSX/solr/build/solr-core/test/J0/temp/solr.handler.TestReplicationHandler_7DF89915E8AE43B4-001/solr-instance-002/./collection1/data/index/
[junit4] 2> 1367585 WARN (coreLoadExecutor-3848-thread-1) [ x:collection1] o.a.s.c.SolrCore [collection1] Solr index directory '/Users/jenkins/workspace/Lucene-Solr-master-MacOSX/solr/build/solr-core/test/J0/temp/solr.handler.TestReplicationHandler_7DF89915E8AE43B4-001/solr-instance-002/./collection1/data/index' doesn't exist. Creating new index...
[junit4] 2> 1367586 INFO (coreLoadExecutor-3848-thread-1) [ x:collection1] o.a.s.c.CachingDirectoryFactory return new directory for /Users/jenkins/workspace/Lucene-Solr-master-MacOSX/solr/build/solr-core/test/J0/temp/solr.handler.TestReplicationHandler_7DF89915E8AE43B4-001/solr-instance-002/./collection1/data/index
[junit4] 2> 1367586 INFO (coreLoadExecutor-3848-thread-1) [ x:collection1] o.a.s.u.RandomMergePolicy RandomMergePolicy wrapping class org.apache.lucene.index.LogByteSizeMergePolicy: [LogByteSizeMergePolicy: minMergeSize=1677721, mergeFactor=12, maxMergeSize=2147483648, maxMergeSizeForForcedMerge=9223372036854775807, calibrateSizeByDeletes=true, maxMergeDocs=2147483647, maxCFSSegmentSizeMB=8.796093022207999E12, noCFSRatio=1.0]
[junit4] 2> 1367587 INFO (coreLoadExecutor-3848-thread-1) [ x:collection1] o.a.s.c.SolrDeletionPolicy SolrDeletionPolicy.onCommit: commits: num=1
[junit4] 2> commit{dir=MockDirectoryWrapper(RAMDirectory@f5f88a8 lockFactory=org.apache.lucene.store.SingleInstanceLockFactory@6c53feb5),segFN=segments_1,generation=1}
[junit4] 2> 1367587 INFO (coreLoadExecutor-3848-thread-1) [ x:collection1] o.a.s.c.SolrDeletionPolicy newest commit generation = 1
[junit4] 2> 1367587 INFO (OldIndexDirectoryCleanupThreadForCore-collection1) [ x:collection1] o.a.s.c.SolrCore Looking for old index directories to cleanup for core collection1 in /Users/jenkins/workspace/Lucene-Solr-master-MacOSX/solr/build/solr-core/test/J0/temp/solr.handler.TestReplicationHandler_7DF89915E8AE43B4-001/solr-instance-002/./collection1/data/
[junit4] 2> 1367589 INFO (coreLoadExecutor-3848-thread-1) [ x:collection1] o.a.s.c.SolrCore no updateRequestProcessorChain defined as default, creating implicit default
[junit4] 2> 1367591 INFO (coreLoadExecutor-3848-thread-1) [ x:collection1] o.a.s.h.l.XMLLoader xsltCacheLifetimeSeconds=60
[junit4] 2> 1367592 INFO (coreLoadExecutor-3848-thread-1) [ x:collection1] o.a.s.h.l.XMLLoader xsltCacheLifetimeSeconds=60
[junit4] 2> 1367593 INFO (coreLoadExecutor-3848-thread-1) [ x:collection1] o.a.s.h.l.XMLLoader xsltCacheLifetimeSeconds=60
[junit4] 2> 1367594 INFO (coreLoadExecutor-3848-thread-1) [ x:collection1] o.a.s.h.l.XMLLoader xsltCacheLifetimeSeconds=60
[junit4] 2> 1367596 INFO (coreLoadExecutor-3848-thread-1) [ x:collection1] o.a.s.c.PluginBag requestHandler : 'lazy' created with startup=lazy
[junit4] 2> 1367596 INFO (coreLoadExecutor-3848-thread-1) [ x:collection1] o.a.s.c.RequestHandlers Registered paths: /admin/mbeans,standard,lazy,/update/json/docs,/admin/luke,/export,/get,/admin/properties,/update/json,/admin/threads,/update/csv,/sql,/graph,/admin/segments,/admin/system,/replication,defaults,/config,/stream,/schema,/admin/plugins,/admin/logging,/admin/ping,/update,/admin/file,/terms
[junit4] 2> 1367596 INFO (coreLoadExecutor-3848-thread-1) [ x:collection1] o.a.s.c.SolrCore Using default statsCache cache: org.apache.solr.search.stats.LocalStatsCache
[junit4] 2> 1367596 INFO (coreLoadExecutor-3848-thread-1) [ x:collection1] o.a.s.u.CommitTracker Hard AutoCommit: disabled
[junit4] 2> 1367596 INFO (coreLoadExecutor-3848-thread-1) [ x:collection1] o.a.s.u.CommitTracker Soft AutoCommit: disabled
[junit4] 2> 1367596 INFO (coreLoadExecutor-3848-thread-1) [ x:collection1] o.a.s.u.RandomMergePolicy RandomMergePolicy wrapping class org.apache.lucene.index.TieredMergePolicy: [TieredMergePolicy: maxMergeAtOnce=27, maxMergeAtOnceExplicit=38, maxMergedSegmentMB=49.9072265625, floorSegmentMB=0.4091796875, forceMergeDeletesPctAllowed=12.336132729501166, segmentsPerTier=5.0, maxCFSSegmentSizeMB=8.796093022207999E12, noCFSRatio=1.0
[junit4] 2> 1367597 INFO (coreLoadExecutor-3848-thread-1) [ x:collection1] o.a.s.c.SolrDeletionPolicy SolrDeletionPolicy.onInit: commits: num=1
[junit4] 2> commit{dir=MockDirectoryWrapper(RAMDirectory@f5f88a8 lockFactory=org.apache.lucene.store.SingleInstanceLockFactory@6c53feb5),segFN=segments_1,generation=1}
[junit4] 2> 1367597 INFO (coreLoadExecutor-3848-thread-1) [ x:collection1] o.a.s.c.SolrDeletionPolicy newest commit generation = 1
[junit4] 2> 1367597 INFO (coreLoadExecutor-3848-thread-1) [ x:collection1] o.a.s.s.SolrIndexSearcher Opening [Searcher@4e29ba6d[collection1] main]
[junit4] 2> 1367597 INFO (coreLoadExecutor-3848-thread-1) [ x:collection1] o.a.s.r.ManagedResourceStorage File-based storage initialized to use dir: /Users/jenkins/workspace/Lucene-Solr-master-MacOSX/solr/build/solr-core/test/J0/temp/solr.handler.TestReplicationHandler_7DF89915E8AE43B4-001/solr-instance-002/collection1/conf
[junit4] 2> 1367597 INFO (coreLoadExecutor-3848-thread-1) [ x:collection1] o.a.s.r.RestManager Initializing RestManager with initArgs: {storageDir=/Users/jenkins/workspace/Lucene-Solr-master-MacOSX/solr/build/solr-core/test/J0/temp/solr.handler.TestReplicationHandler_7DF89915E8AE43B4-001/solr-instance-002/collection1/conf}
[junit4] 2> 1367597 INFO (coreLoadExecutor-3848-thread-1) [ x:collection1] o.a.s.r.ManagedResourceStorage Reading _rest_managed.json using file:dir=/Users/jenkins/workspace/Lucene-Solr-master-MacOSX/solr/build/solr-core/test/J0/temp/solr.handler.TestReplicationHandler_7DF89915E8AE43B4-001/solr-instance-002/collection1/conf
[junit4] 2> 1367597 INFO (coreLoadExecutor-3848-thread-1) [ x:collection1] o.a.s.r.RestManager Initializing 0 registered ManagedResources
[junit4] 2> 1367597 INFO (coreLoadExecutor-3848-thread-1) [ x:collection1] o.a.s.h.ReplicationHandler Commits will be reserved for 10000
[junit4] 2> 1367597 INFO (searcherExecutor-3849-thread-1-processing-x:collection1) [ x:collection1] o.a.s.c.SolrCore [collection1] Registered new searcher Searcher@4e29ba6d[collection1] main{ExitableDirectoryReader(UninvertingDirectoryReader())}
[junit4] 2> 1367598 INFO (coreLoadExecutor-3848-thread-1) [ x:collection1] o.a.s.c.CoreContainer registering core: collection1
[junit4] 2> 1368026 INFO (qtp805477578-8631) [ x:collection1] o.a.s.u.DirectUpdateHandler2 [collection1] REMOVING ALL DOCUMENTS FROM INDEX
[junit4] 2> 1368027 INFO (qtp805477578-8631) [ x:collection1] o.a.s.u.p.LogUpdateProcessorFactory [collection1] webapp=/solr path=/update params={wt=javabin&version=2}{deleteByQuery=*:*} 0 0
[junit4] 2> 1368031 INFO (qtp1438775736-8665) [ x:collection1] o.a.s.u.DirectUpdateHandler2 [collection1] REMOVING ALL DOCUMENTS FROM INDEX
[junit4] 2> 1368032 INFO (qtp1438775736-8665) [ x:collection1] o.a.s.u.p.LogUpdateProcessorFactory [collection1] webapp=/solr path=/update params={wt=javabin&version=2}{deleteByQuery=*:*} 0 0
[junit4] 2> 1368033 INFO (qtp1438775736-8666) [ x:collection1] o.a.s.u.DirectUpdateHandler2 start commit{,optimize=false,openSearcher=true,waitSearcher=true,expungeDeletes=false,softCommit=false,prepareCommit=false}
[junit4] 2> 1368033 INFO (qtp1438775736-8666) [ x:collection1] o.a.s.c.SolrDeletionPolicy SolrDeletionPolicy.onCommit: commits: num=2
[junit4] 2> commit{dir=MockDirectoryWrapper(RAMDirectory@f5f88a8 lockFactory=org.apache.lucene.store.SingleInstanceLockFactory@6c53feb5),segFN=segments_1,generation=1}
[junit4] 2> commit{dir=MockDirectoryWrapper(RAMDirectory@f5f88a8 lockFactory=org.apache.lucene.store.SingleInstanceLockFactory@6c53feb5),segFN=segments_2,generation=2}
[junit4] 2> 1368034 INFO (qtp1438775736-8666) [ x:collection1] o.a.s.c.SolrDeletionPolicy newest commit generation = 2
[junit4] 2> 1368035 INFO (qtp1438775736-8666) [ x:collection1] o.a.s.s.SolrIndexSearcher Opening [Searcher@216b3f82[collection1] main]
[junit4] 2> 1368036 INFO (qtp1438775736-8666) [ x:collection1] o.a.s.u.DirectUpdateHandler2 end_commit_flush
[junit4] 2> 1368036 INFO (searcherExecutor-3849-thread-1-processing-x:collection1) [ x:collection1] o.a.s.c.SolrCore [collection1] Registered new searcher Searcher@216b3f82[collection1] main{ExitableDirectoryReader(UninvertingDirectoryReader())}
[junit4] 2> 1368036 INFO (qtp1438775736-8666) [ x:collection1] o.a.s.u.p.LogUpdateProcessorFactory [collection1] webapp=/solr path=/update params={waitSearcher=true&commit=true&softCommit=false&wt=javabin&version=2}{commit=} 0 3
[junit4] 2> 1368038 INFO (qtp805477578-8632) [ x:collection1] o.a.s.u.p.LogUpdateProcessorFactory [collection1] webapp=/solr path=/update params={wt=javabin&version=2}{add=[0]} 0 1
[junit4] 2> 1368039 INFO (qtp805477578-8633) [ x:collection1] o.a.s.u.p.LogUpdateProcessorFactory [collection1] webapp=/solr path=/update params={wt=javabin&version=2}{add=[1]} 0 0
[junit4] 2> 1368040 INFO (qtp805477578-8626) [ x:collection1] o.a.s.u.p.LogUpdateProcessorFactory [collection1] webapp=/solr path=/update params={wt=javabin&version=2}{add=[2]} 0 0
[junit4] 2> 1368041 INFO (qtp805477578-8628) [ x:collection1] o.a.s.u.p.LogUpdateProcessorFactory [collection1] webapp=/solr path=/update params={wt=javabin&version=2}{add=[3]} 0 0
[junit4] 2> 1368042 INFO (qtp805477578-8630) [ x:collection1] o.a.s.u.p.LogUpdateProcessorFactory [collection1] webapp=/solr path=/update params={wt=javabin&version=2}{add=[4]} 0 0
[junit4] 2> 1368043 INFO (qtp805477578-8629) [ x:collection1] o.a.s.u.p.LogUpdateProcessorFactory [collection1] webapp=/solr path=/update params={wt=javabin&version=2}{add=[5]} 0 0
[junit4] 2> 1368044 INFO (qtp805477578-8631) [ x:collection1] o.a.s.u.p.LogUpdateProcessorFactory [collection1] webapp=/solr path=/update params={wt=javabin&version=2}{add=[6]} 0 0
[junit4] 2> 1368045 INFO (qtp805477578-8632) [ x:collection1] o.a.s.u.p.LogUpdateProcessorFactory [collection1] webapp=/solr path=/update params={wt=javabin&version=2}{add=[7]} 0 0
[junit4] 2> 1368045 INFO (qtp805477578-8633) [ x:collection1] o.a.s.u.p.LogUpdateProcessorFactory [collection1] webapp=/solr path=/update params={wt=javabin&version=2}{add=[8]} 0 0
[junit4] 2> 1368046 INFO (qtp805477578-8626) [ x:collection1] o.a.s.u.p.LogUpdateProcessorFactory [collection1] webapp=/solr path=/update params={wt=javabin&version=2}{add=[9]} 0 0
[junit4] 2> 1368047 INFO (qtp805477578-8628) [ x:collection1] o.a.s.u.p.LogUpdateProcessorFactory [collection1] webapp=/solr path=/update params={wt=javabin&version=2}{add=[10]} 0 0
[junit4] 2> 1368047 INFO (qtp805477578-8630) [ x:collection1] o.a.s.u.p.LogUpdateProcessorFactory [collection1] webapp=/solr path=/update params={wt=javabin&version=2}{add=[11]} 0 0
[junit4] 2> 1368048 INFO (qtp805477578-8629) [ x:collection1] o.a.s.u.p.LogUpdateProcessorFactory [collection1] webapp=/solr path=/update params={wt=javabin&version=2}{add=[12]} 0 0
[junit4] 2> 1368048 INFO (qtp805477578-8631) [ x:collection1] o.a.s.u.p.LogUpdateProcessorFactory [collection1] webapp=/solr path=/update params={wt=javabin&version=2}{add=[13]} 0 0
[junit4] 2> 1368049 INFO (qtp805477578-8632) [ x:collection1] o.a.s.u.p.LogUpdateProcessorFactory [collection1] webapp=/solr path=/update params={wt=javabin&version=2}{add=[14]} 0 0
[junit4] 2> 1368050 INFO (qtp805477578-8633) [ x:collection1] o.a.s.u.p.LogUpdateProcessorFactory [collection1] webapp=/solr path=/update params={wt=javabin&version=2}{add=[15]} 0 0
[junit4] 2> 1368050 INFO (qtp805477578-8626) [ x:collection1] o.a.s.u.p.LogUpdateProcessorFactory [collection1] webapp=/solr path=/update params={wt=javabin&version=2}{add=[16]} 0 0
[junit4] 2> 1368051 INFO (qtp805477578-8628) [ x:collection1] o.a.s.u.p.LogUpdateProcessorFactory [collection1] webapp=/solr path=/update params={wt=javabin&version=2}{add=[17]} 0 0
[junit4] 2> 1368051 INFO (qtp805477578-8630) [ x:collection1] o.a.s.u.p.LogUpdateProcessorFactory [collection1] webapp=/solr path=/update params={wt=javabin&version=2}{add=[18]} 0 0
[junit4] 2> 1368052 INFO (qtp805477578-8629) [ x:collection1] o.a.s.u.p.LogUpdateProcessorFactory [collection1] webapp=/solr path=/update params={wt=javabin&version=2}{add=[19]} 0 0
[junit4] 2> 1368053 INFO (qtp805477578-8631) [ x:collection1] o.a.s.u.p.LogUpdateProcessorFactory [collection1] webapp=/solr path=/update params={wt=javabin&version=2}{add=[20]} 0 0
[junit4] 2> 1368055 INFO (qtp805477578-8632) [ x:collection1] o.a.s.u.p.LogUpdateProcessorFactory [collection1] webapp=/solr path=/update params={wt=javabin&version=2}{add=[21]} 0 1
[junit4] 2> 1368056 INFO (qtp805477578-8633) [ x:collection1] o.a.s.u.p.LogUpdateProcessorFactory [collection1] webapp=/solr path=/update params={wt=javabin&version=2}{add=[22]} 0 0
[junit4] 2> 1368056 INFO (qtp805477578-8626) [ x:collection1] o.a.s.u.p.LogUpdateProcessorFactory [collection1] webapp=/solr path=/update params={wt=javabin&version=2}{add=[23]} 0 0
[junit4] 2> 1368057 INFO (qtp805477578-8626) [ x:collection1] o.a.s.u.p.LogUpdateProcessorFactory [collection1] webapp=/solr path=/update params={wt=javabin&version=2}{add=[24]} 0 0
[junit4] 2> 1368058 INFO (qtp805477578-8626) [ x:collection1] o.a.s.u.p.LogUpdateProcessorFactory [collection1] webapp=/solr path=/update params={wt=javabin&version=2}{add=[25]} 0 0
[junit4] 2> 1368058 INFO (qtp805477578-8629) [ x:collection1] o.a.s.u.p.LogUpdateProcessorFactory [collection1] webapp=/solr path=/update params={wt=javabin&version=2}{add=[26]} 0 0
[junit4] 2> 1368059 INFO (qtp805477578-8629) [ x:collection1] o.a.s.u.p.LogUpdateProcessorFactory [collection1] webapp=/solr path=/update params={wt=javabin&version=2}{add=[27]} 0 0
[junit4] 2> 1368060 INFO (qtp805477578-8629) [ x:collection1] o.a.s.u.p.LogUpdateProcessorFactory [collection1] webapp=/solr path=/update params={wt=javabin&version=2}{add=[28]} 0 0
[junit4] 2> 1368060 INFO (qtp805477578-8629) [ x:collection1] o.a.s.u.p.LogUpdateProcessorFactory [collection1] webapp=/solr path=/update params={wt=javabin&version=2}{add=[29]} 0 0
[junit4] 2> 1368061 INFO (qtp805477578-8629) [ x:collection1] o.a.s.u.p.LogUpdateProcessorFactory [collection1] webapp=/solr path=/update params={wt=javabin&version=2}{add=[30]} 0 0
[junit4] 2> 1368062 INFO (qtp805477578-8630) [ x:collection1] o.a.s.u.p.LogUpdateProcessorFactory [collection1] webapp=/solr path=/update params={wt=javabin&version=2}{add=[31]} 0 0
[junit4] 2> 1368062 INFO (qtp805477578-8630) [ x:collection1] o.a.s.u.p.LogUpdateProcessorFactory [collection1] webapp=/solr path=/update params={wt=javabin&version=2}{add=[32]} 0 0
[junit4] 2> 1368063 INFO (qtp805477578-8630) [ x:collection1] o.a.s.u.p.LogUpdateProcessorFactory [collection1] webapp=/solr path=/update params={wt=javabin&version=2}{add=[33]} 0 0
[junit4] 2> 1368063 INFO (qtp805477578-8630) [ x:collection1] o.a.s.u.p.LogUpdateProcessorFactory [collection1] webapp=/solr path=/update params={wt=javabin&version=2}{add=[34]} 0 0
[junit4] 2> 1368064 INFO (qtp805477578-8630) [ x:collection1] o.a.s.u.p.LogUpdateProcessorFactory [collection1] webapp=/solr path=/update params={wt=javabin&version=2}{add=[35]} 0 0
[junit4] 2> 1368065 INFO (qtp805477578-8630) [ x:collection1] o.a.s.u.p.LogUpdateProcessorFactory [collection1] webapp=/solr path=/update params={wt=javabin&version=2}{add=[36]} 0 0
[junit4] 2> 1368065 INFO (qtp805477578-8630) [ x:collection1] o.a.s.u.p.LogUpdateProcessorFactory [collection1] webapp=/solr path=/update params={wt=javabin&version=2}{add=[37]} 0 0
[junit4] 2> 1368067 INFO (qtp805477578-8630) [ x:collection1] o.a.s.u.p.LogUpdateProcessorFactory [collection1] webapp=/solr path=/update params={wt=javabin&version=2}{add=[38]} 0 0
[junit4] 2> 1368068 INFO (qtp805477578-8630) [ x:collection1] o.a.s.u.p.LogUpdateProcessorFactory [collection1] webapp=/solr path=/update params={wt=javabin&version=2}{add=[39]} 0 0
[junit4] 2> 1368068 INFO (qtp805477578-8630) [ x:collection1] o.a.s.u.p.LogUpdateProcessorFactory [collection1] webapp=/solr path=/update params={wt=javabin&version=2}{add=[40]} 0 0
[junit4] 2> 1368069 INFO (qtp805477578-8633) [ x:collection1] o.a.s.u.p.LogUpdateProcessorFactory [collection1] webapp=/solr path=/update params={wt=javabin&version=2}{add=[41]} 0 0
[junit4] 2> 1368070 INFO (qtp805477578-8633) [ x:collection1] o.a.s.u.p.LogUpdateProcessorFactory [collection1] webapp=/solr path=/update params={wt=javabin&version=2}{add=[42]} 0 0
[junit4] 2> 1368070 INFO (qtp805477578-8633) [ x:collection1] o.a.s.u.p.LogUpdateProcessorFactory [collection1] webapp=/solr path=/update params={wt=javabin&version=2}{add=[43]} 0 0
[junit4] 2> 1368071 INFO (qtp805477578-8626) [ x:collection1] o.a.s.u.p.LogUpdateProcessorFactory [collection1] webapp=/solr path=/update params={wt=javabin&version=2}{add=[44]} 0 0
[junit4] 2> 1368072 INFO (qtp805477578-8626) [ x:collection1] o.a.s.u.p.LogUpdateProcessorFactory [collection1] webapp=/solr path=/update params={wt=javabin&version=2}{add=[45]} 0 0
[junit4] 2> 1368073 INFO (qtp805477578-8632) [ x:collection1] o.a.s.u.p.LogUpdateProcessorFactory [collection1] webapp=/solr path=/update params={wt=javabin&version=2}{add=[46]} 0 0
[junit4] 2> 1368073 INFO (qtp805477578-8630) [ x:collection1] o.a.s.u.p.LogUpdateProcessorFactory [collection1] webapp=/solr path=/update params={wt=javabin&version=2}{add=[47]} 0 0
[junit4] 2> 1368074 INFO (qtp805477578-8628) [ x:collection1] o.a.s.u.p.LogUpdateProcessorFactory [collection1] webapp=/solr path=/update params={wt=javabin&version=2}{add=[48]} 0 0
[junit4] 2> 1368075 INFO (qtp805477578-8629) [ x:collection1] o.a.s.u.p.LogUpdateProcessorFactory [collection1] webapp=/solr path=/update params={wt=javabin&version=2}{add=[49]} 0 0
[junit4] 2> 1368076 INFO (qtp805477578-8633) [ x:collection1] o.a.s.u.p.LogUpdateProcessorFactory [collection1] webapp=/solr path=/update params={wt=javabin&version=2}{add=[50]} 0 0
[junit4] 2> 1368076 INFO (qtp805477578-8631) [ x:collection1] o.a.s.u.p.LogUpdateProcessorFactory [collection1] webapp=/solr path=/update params={wt=javabin&version=2}{add=[51]} 0 0
[junit4] 2> 1368077 INFO (qtp805477578-8626) [ x:collection1] o.a.s.u.p.LogUpdateProcessorFactory [collection1] webapp=/solr path=/update params={wt=javabin&version=2}{add=[52]} 0 0
[junit4] 2> 1368079 INFO (qtp805477578-8632) [ x:collection1] o.a.s.u.p.LogUpdateProcessorFactory [collection1] webapp=/solr path=/update params={wt=javabin&version=2}{add=[53]} 0 0
[junit4] 2> 1368079 INFO (qtp805477578-8630) [ x:collection1] o.a.s.u.p.LogUpdateProcessorFactory [collection1] webapp=/solr path=/update params={wt=javabin&version=2}{add=[54]} 0 0
[junit4] 2> 1368080 INFO (qtp805477578-8628) [ x:collection1] o.a.s.u.p.LogUpdateProcessorFactory [collection1] webapp=/solr path=/update params={wt=javabin&version=2}{add=[55]} 0 0
[junit4] 2> 1368081 INFO (qtp805477578-8628) [ x:collection1] o.a.s.u.p.LogUpdateProcessorFactory [collection1] webapp=/solr path=/update params={wt=javabin&version=2}{add=[56]} 0 0
[junit4] 2> 1368081 INFO (qtp805477578-8628) [ x:collection1] o.a.s.u.p.LogUpdateProcessorFactory [collection1] webapp=/solr path=/update params={wt=javabin&version=2}{add=[57]} 0 0
[junit4] 2> 1368082 INFO (qtp805477578-8628) [ x:collection1] o.a.s.u.p.LogUpdateProcessorFactory [collection1] webapp=/solr path=/update params={wt=javabin&version=2}{add=[58]} 0 0
[junit4] 2> 1368083 INFO (qtp805477578-8628) [ x:collection1] o.a.s.u.p.LogUpdateProcessorFactory [collection1] webapp=/solr path=/update params={wt=javabin&version=2}{add=[59]} 0 0
[junit4] 2> 1368083 INFO (qtp805477578-8628) [ x:collection1] o.a.s.u.p.LogUpdateProcessorFactory [collection1] webapp=/solr path=/update params={wt=javabin&version=2}{add=[60]} 0 0
[junit4] 2> 1368084 INFO (qtp805477578-8628) [ x:collection1] o.a.s.u.p.LogUpdateProcessorFactory [collection1] webapp=/solr path=/update params={wt=javabin&version=2}{add=[61]} 0 0
[junit4] 2> 1368085 INFO (qtp805477578-8628) [ x:collection1] o.a.s.u.p.LogUpdateProcessorFactory [collection1] webapp=/solr path=/update params={wt=javabin&version=2}{add=[62]} 0 0
[junit4] 2> 1368085 INFO (qtp805477578-8628) [ x:collection1] o.a.s.u.p.LogUpdateProcessorFactory [collection1] webapp=/solr path=/update params={wt=javabin&version=2}{add=[63]} 0 0
[junit4] 2> 1368086 INFO (qtp805477578-8628) [ x:collection1] o.a.s.u.p.LogUpdateProcessorFactory [collection1] webapp=/solr path=/update params={wt=javabin&version=2}{add=[64]} 0 0
[junit4] 2> 1368087 INFO (qtp805477578-8628) [ x:collection1] o.a.s.u.p.LogUpdateProcessorFactory [collection1] webapp=/solr path=/update params={wt=javabin&version=2}{add=[65]} 0 0
[junit4] 2> 1368088 INFO (qtp805477578-8628) [ x:collection1] o.a.s.u.p.LogUpdateProcessorFactory [collection1] webapp=/solr path=/update params={wt=javabin&version=2}{add=[66]} 0 0
[junit4] 2> 1368088 INFO (qtp805477578-8628) [ x:collection1] o.a.s.u.p.LogUpdateProcessorFactory [collection1] webapp=/solr path=/update params={wt=javabin&version=2}{add=[67]} 0 0
[junit4] 2> 1368089 INFO (qtp805477578-8628) [ x:collection1] o.a.s.u.p.LogUpdateProcessorFactory [collection1] webapp=/solr path=/update params={wt=javabin&version=2}{add=[68]} 0 0
[junit4] 2> 1368090 INFO (qtp805477578-8628) [ x:collection1] o.a.s.u.p.LogUpdateProcessorFactory [collection1] webapp=/solr path=/update params={wt=javabin&version=2}{add=[69]} 0 0
[junit4] 2> 1368090 INFO (qtp805477578-8628) [ x:collection1] o.a.s.u.p.LogUpdateProcessorFactory [collection1] webapp=/solr path=/update params={wt=javabin&version=2}{add=[70]} 0 0
[junit4] 2> 1368090 INFO (qtp805477578-8628) [ x:collection1] o.a.s.u.p.LogUpdateProcessorFactory [collection1] webapp=/solr path=/update params={wt=javabin&version=2}{add=[71]} 0 0
[junit4] 2> 1368090 INFO (qtp805477578-8628) [ x:collection1] o.a.s.u.p.LogUpdateProcessorFactory [collection1] webapp=/solr path=/update params={wt=javabin&version=2}{add=[72]} 0 0
[junit4] 2> 1368095 INFO (qtp805477578-8628) [ x:collection1] o.a.s.u.p.LogUpdateProcessorFactory [collection1] webapp=/solr path=/update params={wt=javabin&version=2}{add=[73]} 0 0
[junit4] 2> 1368095 INFO (qtp805477578-8628) [ x:collection1] o.a.s.u.p.LogUpdateProcessorFactory [collection1] webapp=/solr path=/update params={wt=javabin&version=2}{add=[74]} 0 0
[junit4] 2> 1368096 INFO (qtp805477578-8628) [ x:collection1] o.a.s.u.p.LogUpdateProcessorFactory [collection1] webapp=/solr path=/update params={wt=javabin&version=2}{add=[75]} 0 0
[junit4] 2> 1368097 INFO (qtp805477578-8631) [ x:collection1] o.a.s.u.p.LogUpdateProcessorFactory [collection1] webapp=/solr path=/update params={wt=javabin&version=2}{add=[76]} 0 0
[junit4] 2> 1368098 INFO (qtp805477578-8626) [ x:collection1] o.a.s.u.p.LogUpdateProcessorFactory [collection1] webapp=/solr path=/update params={wt=javabin&version=2}{add=[77]} 0 0
[junit4] 2> 1368098 INFO (qtp805477578-8632) [ x:collection1] o.a.s.u.p.LogUpdateProcessorFactory [collection1] webapp=/solr path=/update params={wt=javabin&version=2}{add=[78]} 0 0
[junit4] 2> 1368099 INFO (qtp805477578-8630) [ x:collection1] o.a.s.u.p.LogUpdateProcessorFactory [collection1] webapp=/solr path=/update params={wt=javabin&version=2}{add=[79]} 0 0
[junit4] 2> 1368100 INFO (qtp805477578-8629) [ x:collection1] o.a.s.u.p.LogUpdateProcessorFactory [collection1] webapp=/solr path=/update params={wt=javabin&version=2}{add=[80]} 0 0
[junit4] 2> 1368101 INFO (qtp805477578-8633) [ x:collection1] o.a.s.u.p.LogUpdateProcessorFactory [collection1] webapp=/solr path=/update params={wt=javabin&version=2}{add=[81]} 0 0
[junit4] 2> 1368102 INFO (qtp805477578-8628) [ x:collection1] o.a.s.u.p.LogUpdateProcessorFactory [collection1] webapp=/solr path=/update params={wt=javabin&version=2}{add=[82]} 0 0
[junit4] 2> 1368103 INFO (qtp805477578-8631) [ x:collection1] o.a.s.u.p.LogUpdateProcessorFactory [collection1] webapp=/solr path=/update params={wt=javabin&version=2}{add=[83]} 0 0
[junit4] 2> 1368104 INFO (qtp805477578-8626) [ x:collection1] o.a.s.u.p.LogUpdateProcessorFactory [collection1] webapp=/solr path=/update params={wt=javabin&version=2}{add=[84]} 0 0
[junit4] 2> 1368105 INFO (qtp805477578-8632) [ x:collection1] o.a.s.u.p.LogUpdateProcessorFactory [collection1] webapp=/solr path=/update params={wt=javabin&version=2}{add=[85]} 0 0
[junit4] 2> 1368106 INFO (qtp805477578-8630) [ x:collection1] o.a.s.u.p.LogUpdateProcessorFactory [collection1] webapp=/solr path=/update params={wt=javabin&version=2}{add=[86]} 0 0
[junit4] 2> 1368107 INFO (qtp805477578-8629) [ x:collection1] o.a.s.u.p.LogUpdateProcessorFactory [collection1] webapp=/solr path=/update params={wt=javabin&version=2}{add=[87]} 0 0
[junit4] 2> 1368107 INFO (qtp805477578-8633) [ x:collection1] o.a.s.u.p.LogUpdateProcessorFactory [collection1] webapp=/solr path=/update params={wt=javabin&version=2}{add=[88]} 0 0
[junit4] 2> 1368108 INFO (qtp805477578-8628) [ x:collection1] o.a.s.u.p.LogUpdateProcessorFactory [collection1] webapp=/solr path=/update params={wt=javabin&version=2}{add=[89]} 0 0
[junit4] 2> 1368109 INFO (qtp805477578-8631) [ x:collection1] o.a.s.u.p.LogUpdateProcessorFactory [collection1] webapp=/solr path=/update params={wt=javabin&version=2}{add=[90]} 0 0
[junit4] 2> 1368110 INFO (qtp805477578-8626) [ x:collection1] o.a.s.u.p.LogUpdateProcessorFactory [collection1] webapp=/solr path=/update params={wt=javabin&version=2}{add=[91]} 0 0
[junit4] 2> 1368110 INFO (qtp805477578-8632) [ x:collection1] o.a.s.u.p.LogUpdateProcessorFactory [collection1] webapp=/solr path=/update params={wt=javabin&version=2}{add=[92]} 0 0
[junit4] 2> 1368111 INFO (qtp805477578-8630) [ x:collection1] o.a.s.u.p.LogUpdateProcessorFactory [collection1] webapp=/solr path=/update params={wt=javabin&version=2}{add=[93]} 0 0
[junit4] 2> 1368112 INFO (qtp805477578-8629) [ x:collection1] o.a.s.u.p.LogUpdateProcessorFactory [collection1] webapp=/solr path=/update params={wt=javabin&version=2}{add=[94]} 0 0
[junit4] 2> 1368113 INFO (qtp805477578-8633) [ x:collection1] o.a.s.u.p.LogUpdateProcessorFactory [collection1] webapp=/solr path=/update params={wt=javabin&version=2}{add=[95]} 0 0
[junit4] 2> 1368114 INFO (qtp805477578-8628) [ x:collection1] o.a.s.u.p.LogUpdateProcessorFactory [collection1] webapp=/solr path=/update params={wt=javabin&version=2}{add=[96]} 0 0
[junit4] 2> 1368115 INFO (qtp805477578-8631) [ x:collection1] o.a.s.u.p.LogUpdateProcessorFactory [collection1] webapp=/solr path=/update params={wt=javabin&version=2}{add=[97]} 0 0
[junit4] 2> 1368116 INFO (qtp805477578-8626) [ x:collection1] o.a.s.u.p.LogUpdateProcessorFactory [collection1] webapp=/solr path=/update params={wt=javabin&version=2}{add=[98]} 0 0
[junit4] 2> 1368117 INFO (qtp805477578-8632) [ x:collection1] o.a.s.u.p.LogUpdateProcessorFactory [collection1] webapp=/solr path=/update params={wt=javabin&version=2}{add=[99]} 0 0
[junit4] 2> 1368118 INFO (qtp805477578-8630) [ x:collection1] o.a.s.u.p.LogUpdateProcessorFactory [collection1] webapp=/solr path=/update params={wt=javabin&version=2}{add=[100]} 0 0
[junit4] 2> 1368118 INFO (qtp805477578-8629) [ x:collection1] o.a.s.u.p.LogUpdateProcessorFactory [collection1] webapp=/solr path=/update params={wt=javabin&version=2}{add=[101]} 0 0
[junit4] 2> 1368119 INFO (qtp805477578-8633) [ x:collection1] o.a.s.u.p.LogUpdateProcessorFactory [collection1] webapp=/solr path=/update params={wt=javabin&version=2}{add=[102]} 0 0
[junit4] 2> 1368120 INFO (qtp805477578-8633) [ x:collection1] o.a.s.u.p.LogUpdateProcessorFactory [collection1] webapp=/solr path=/update params={wt=javabin&version=2}{add=[103]} 0 0
[junit4] 2> 1368121 INFO (qtp805477578-8633) [ x:collection1] o.a.s.u.p.LogUpdateProcessorFactory [collection1] webapp=/solr path=/update params={wt=javabin&version=2}{add=[104]} 0 0
[junit4] 2> 1368121 INFO (qtp805477578-8633) [ x:collection1] o.a.s.u.p.LogUpdateProcessorFactory [collection1] webapp=/solr path=/update params={wt=javabin&version=2}{add=[105]} 0 0
[junit4] 2> 1368122 INFO (qtp805477578-8633) [ x:collection1] o.a.s.u.p.LogUpdateProcessorFactory [collection1] webapp=/solr path=/update params={wt=javabin&version=2}{add=[106]} 0 0
[junit4] 2> 1368123 INFO (qtp805477578-8633) [ x:collection1] o.a.s.u.p.LogUpdateProcessorFactory [collection1] webapp=/solr path=/update params={wt=javabin&version=2}{add=[107]} 0 0
[junit4] 2> 1368123 INFO (qtp805477578-8633) [ x:collection1] o.a.s.u.p.LogUpdateProcessorFactory [collection1] webapp=/solr path=/update params={wt=javabin&version=2}{add=[108]} 0 0
[junit4] 2> 1368124 INFO (qtp805477578-8633) [ x:collection1] o.a.s.u.p.LogUpdateProcessorFactory [collection1] webapp=/solr path=/update params={wt=javabin&version=2}{add=[109]} 0 0
[junit4] 2> 1368125 INFO (qtp805477578-8633) [ x:collection1] o.a.s.u.p.LogUpdateProcessorFactory [collection1] webapp=/solr path=/update params={wt=javabin&version=2}{add=[110]} 0 0
[junit4] 2> 1368126 INFO (qtp805477578-8633) [ x:collection1] o.a.s.u.p.LogUpdateProcessorFactory [collection1] webapp=/solr path=/update params={wt=javabin&version=2}{add=[111]} 0 0
[junit4] 2> 1368127 INFO (qtp805477578-8633) [ x:collection1] o.a.s.u.p.LogUpdateProcessorFactory [collection1] webapp=/solr path=/update params={wt=javabin&version=2}{add=[112]} 0 0
[junit4] 2> 1368127 INFO (qtp805477578-8633) [ x:collection1] o.a.s.u.p.LogUpdateProcessorFactory [collection1] webapp=/solr path=/update params={wt=javabin&version=2}{add=[113]} 0 0
[junit4] 2> 1368128 INFO (qtp805477578-8633) [ x:collection1] o.a.s.u.p.LogUpdateProcessorFactory [collection1] webapp=/solr path=/update params={wt=javabin&version=2}{add=[114]} 0 0
[junit4] 2> 1368129 INFO (qtp805477578-8633) [ x:collectio
[...truncated too long message...]
/J0/temp/solr.handler.TestReplicationHandler_7DF89915E8AE43B4-001/solr-instance-029/collection1/data/index [CachedDir<<refCount=0;path=/Users/jenkins/workspace/Lucene-Solr-master-MacOSX/solr/build/solr-core/test/J0/temp/solr.handler.TestReplicationHandler_7DF89915E8AE43B4-001/solr-instance-029/collection1/data/index;done=false>>]
[junit4] 2> 1435321 INFO (coreCloseExecutor-4480-thread-1) [ x:collection1] o.a.s.c.CachingDirectoryFactory Closing directory, CoreContainer#isShutdown=true
[junit4] 2> 1435321 INFO (coreCloseExecutor-4480-thread-1) [ x:collection1] o.a.s.c.CachingDirectoryFactory Closing directory: /Users/jenkins/workspace/Lucene-Solr-master-MacOSX/solr/build/solr-core/test/J0/temp/solr.handler.TestReplicationHandler_7DF89915E8AE43B4-001/solr-instance-029/collection1/data/index
[junit4] 2> 1435321 INFO (TEST-TestReplicationHandler.doTestReplicateAfterStartupWithNoActivity-seed#[7DF89915E8AE43B4]) [ ] o.e.j.s.h.ContextHandler Stopped o.e.j.s.ServletContextHandler@5761a194{/solr,null,UNAVAILABLE}
[junit4] 2> 1435323 INFO (TEST-TestReplicationHandler.doTestReplicateAfterStartupWithNoActivity-seed#[7DF89915E8AE43B4]) [ ] o.e.j.s.ServerConnector Stopped ServerConnector@28f90afc{HTTP/1.1,[http/1.1]}{127.0.0.1:0}
[junit4] 2> 1435323 INFO (TEST-TestReplicationHandler.doTestReplicateAfterStartupWithNoActivity-seed#[7DF89915E8AE43B4]) [ ] o.a.s.c.CoreContainer Shutting down CoreContainer instance=192361538
[junit4] 2> 1435324 INFO (coreCloseExecutor-4482-thread-1) [ x:collection1] o.a.s.c.SolrCore [collection1] CLOSING SolrCore org.apache.solr.core.SolrCore@a149c9c
[junit4] 2> 1435324 INFO (coreCloseExecutor-4482-thread-1) [ x:collection1] o.a.s.u.DirectUpdateHandler2 closing DirectUpdateHandler2{commits=0,autocommits=0,soft autocommits=0,optimizes=0,rollbacks=0,expungeDeletes=0,docsPending=0,adds=0,deletesById=0,deletesByQuery=0,errors=0,cumulative_adds=0,cumulative_deletesById=0,cumulative_deletesByQuery=0,cumulative_errors=0}
[junit4] 2> 1435324 INFO (coreCloseExecutor-4482-thread-1) [ x:collection1] o.a.s.u.SolrCoreState Closing SolrCoreState
[junit4] 2> 1435324 INFO (coreCloseExecutor-4482-thread-1) [ x:collection1] o.a.s.u.DefaultSolrCoreState SolrCoreState ref count has reached 0 - closing IndexWriter
[junit4] 2> 1435324 INFO (coreCloseExecutor-4482-thread-1) [ x:collection1] o.a.s.u.DefaultSolrCoreState closing IndexWriter with IndexWriterCloser
[junit4] 2> 1435325 INFO (coreCloseExecutor-4482-thread-1) [ x:collection1] o.a.s.c.SolrCore [collection1] Closing main searcher on request.
[junit4] 2> 1435327 INFO (coreCloseExecutor-4482-thread-1) [ x:collection1] o.a.s.c.CachingDirectoryFactory Closing NRTCachingDirectoryFactory - 3 directories currently being tracked
[junit4] 2> 1435327 INFO (coreCloseExecutor-4482-thread-1) [ x:collection1] o.a.s.c.CachingDirectoryFactory looking to close /Users/jenkins/workspace/Lucene-Solr-master-MacOSX/solr/build/solr-core/test/J0/temp/solr.handler.TestReplicationHandler_7DF89915E8AE43B4-001/solr-instance-030/collection1/data/snapshot_metadata [CachedDir<<refCount=0;path=/Users/jenkins/workspace/Lucene-Solr-master-MacOSX/solr/build/solr-core/test/J0/temp/solr.handler.TestReplicationHandler_7DF89915E8AE43B4-001/solr-instance-030/collection1/data/snapshot_metadata;done=false>>]
[junit4] 2> 1435327 INFO (coreCloseExecutor-4482-thread-1) [ x:collection1] o.a.s.c.CachingDirectoryFactory Closing directory, CoreContainer#isShutdown=true
[junit4] 2> 1435327 INFO (coreCloseExecutor-4482-thread-1) [ x:collection1] o.a.s.c.CachingDirectoryFactory Closing directory: /Users/jenkins/workspace/Lucene-Solr-master-MacOSX/solr/build/solr-core/test/J0/temp/solr.handler.TestReplicationHandler_7DF89915E8AE43B4-001/solr-instance-030/collection1/data/snapshot_metadata
[junit4] 2> 1435327 INFO (coreCloseExecutor-4482-thread-1) [ x:collection1] o.a.s.c.CachingDirectoryFactory looking to close /Users/jenkins/workspace/Lucene-Solr-master-MacOSX/solr/build/solr-core/test/J0/temp/solr.handler.TestReplicationHandler_7DF89915E8AE43B4-001/solr-instance-030/collection1/data/index [CachedDir<<refCount=0;path=/Users/jenkins/workspace/Lucene-Solr-master-MacOSX/solr/build/solr-core/test/J0/temp/solr.handler.TestReplicationHandler_7DF89915E8AE43B4-001/solr-instance-030/collection1/data/index;done=false>>]
[junit4] 2> 1435327 INFO (coreCloseExecutor-4482-thread-1) [ x:collection1] o.a.s.c.CachingDirectoryFactory Closing directory, CoreContainer#isShutdown=true
[junit4] 2> 1435327 INFO (coreCloseExecutor-4482-thread-1) [ x:collection1] o.a.s.c.CachingDirectoryFactory Closing directory: /Users/jenkins/workspace/Lucene-Solr-master-MacOSX/solr/build/solr-core/test/J0/temp/solr.handler.TestReplicationHandler_7DF89915E8AE43B4-001/solr-instance-030/collection1/data/index
[junit4] 2> 1435327 INFO (coreCloseExecutor-4482-thread-1) [ x:collection1] o.a.s.c.CachingDirectoryFactory looking to close /Users/jenkins/workspace/Lucene-Solr-master-MacOSX/solr/build/solr-core/test/J0/temp/solr.handler.TestReplicationHandler_7DF89915E8AE43B4-001/solr-instance-030/collection1/data [CachedDir<<refCount=0;path=/Users/jenkins/workspace/Lucene-Solr-master-MacOSX/solr/build/solr-core/test/J0/temp/solr.handler.TestReplicationHandler_7DF89915E8AE43B4-001/solr-instance-030/collection1/data;done=false>>]
[junit4] 2> 1435327 INFO (coreCloseExecutor-4482-thread-1) [ x:collection1] o.a.s.c.CachingDirectoryFactory Closing directory, CoreContainer#isShutdown=true
[junit4] 2> 1435327 INFO (coreCloseExecutor-4482-thread-1) [ x:collection1] o.a.s.c.CachingDirectoryFactory Closing directory: /Users/jenkins/workspace/Lucene-Solr-master-MacOSX/solr/build/solr-core/test/J0/temp/solr.handler.TestReplicationHandler_7DF89915E8AE43B4-001/solr-instance-030/collection1/data
[junit4] 2> 1435327 INFO (TEST-TestReplicationHandler.doTestReplicateAfterStartupWithNoActivity-seed#[7DF89915E8AE43B4]) [ ] o.e.j.s.h.ContextHandler Stopped o.e.j.s.ServletContextHandler@7260c70c{/solr,null,UNAVAILABLE}
[junit4] 2> 1435329 INFO (SUITE-TestReplicationHandler-seed#[7DF89915E8AE43B4]-worker) [ ] o.a.s.SolrTestCaseJ4 ###deleteCore
[junit4] 2> NOTE: leaving temporary files on disk at: /Users/jenkins/workspace/Lucene-Solr-master-MacOSX/solr/build/solr-core/test/J0/temp/solr.handler.TestReplicationHandler_7DF89915E8AE43B4-001
[junit4] 2> NOTE: test params are: codec=Asserting(Lucene62): {name=PostingsFormat(name=Asserting), id=PostingsFormat(name=Asserting), newname=PostingsFormat(name=Asserting)}, docValues:{}, maxPointsInLeafNode=492, maxMBSortInHeap=5.07219630655829, sim=ClassicSimilarity, locale=ar-MA, timezone=America/Nassau
[junit4] 2> NOTE: Mac OS X 10.11.6 x86_64/Oracle Corporation 1.8.0_102 (64-bit)/cpus=3,threads=1,free=413953800,total=536870912
[junit4] 2> NOTE: All tests run in this JVM: [SOLR749Test, TestStressLucene, PingRequestHandlerTest, TestFieldCacheWithThreads, SuggestComponentContextFilterQueryTest, BlobRepositoryCloudTest, DistributedSpellCheckComponentTest, SpatialFilterTest, TestCloudManagedSchema, TestStressReorder, TestDownShardTolerantSearch, TestCloudPivotFacet, ChangedSchemaMergeTest, StatelessScriptUpdateProcessorFactoryTest, TestSolrCloudWithKerberosAlt, AnalysisErrorHandlingTest, TestFieldCache, AsyncMigrateRouteKeyTest, TestCloudSchemaless, DistributedQueryElevationComponentTest, SchemaVersionSpecificBehaviorTest, TestDefaultStatsCache, TestInitParams, TestFaceting, TestFieldTypeCollectionResource, TestQuerySenderNoQuery, TestConfigReload, SpatialRPTFieldTypeTest, TestSolrDeletionPolicy1, TestConfigSets, CursorPagingTest, TestCloudDeleteByQuery, TestJmxIntegration, TestPivotHelperCode, DataDrivenBlockJoinTest, ClusterStateUpdateTest, QueryEqualityTest, VersionInfoTest, TestTrieFacet, PolyFieldTest, TestReRankQParserPlugin, DistributedQueryComponentOptimizationTest, HttpPartitionTest, SimpleMLTQParserTest, JSONWriterTest, TestRandomDVFaceting, SyncSliceTest, TestRTimerTree, SuggesterFSTTest, TestPKIAuthenticationPlugin, TestGroupingSearch, SmileWriterTest, AnalyticsQueryTest, RequestLoggingTest, ConnectionManagerTest, DistributedFacetPivotLargeTest, RegexBoostProcessorTest, HighlighterTest, SolrIndexConfigTest, ExternalFileFieldSortTest, IgnoreCommitOptimizeUpdateProcessorFactoryTest, AnalysisAfterCoreReloadTest, UpdateParamsTest, LeaderElectionTest, TestDFISimilarityFactory, LeaderInitiatedRecoveryOnCommitTest, TestImplicitCoreProperties, PrimUtilsTest, TestFieldSortValues, TestCSVLoader, AlternateDirectoryTest, DisMaxRequestHandlerTest, TestReplicationHandlerBackup, TestCoreContainer, TestPostingsSolrHighlighter, TestAnalyzedSuggestions, BasicDistributedZkTest, DocValuesMissingTest, TestCryptoKeys, ActionThrottleTest, SimpleFacetsTest, DirectSolrSpellCheckerTest, HdfsNNFailoverTest, FacetPivotSmallTest, URLClassifyProcessorTest, ZkStateWriterTest, TestCodecSupport, TestManagedResourceStorage, ConjunctionSolrSpellCheckerTest, OutOfBoxZkACLAndCredentialsProvidersTest, TestComplexPhraseQParserPlugin, DocumentBuilderTest, TestSolrQueryParserResource, ZkCLITest, TestUninvertingReader, CachingDirectoryFactoryTest, BadCopyFieldTest, TestMiniSolrCloudClusterBase, BufferStoreTest, TestExceedMaxTermLength, TestStressVersions, PrimitiveFieldTypeTest, PreAnalyzedUpdateProcessorTest, TestRebalanceLeaders, SolrCoreTest, TestStressCloudBlindAtomicUpdates, RuleEngineTest, PreAnalyzedFieldTest, DirectUpdateHandlerTest, FastVectorHighlighterTest, VMParamsZkACLAndCredentialsProvidersTest, TestSlowCompositeReaderWrapper, TestSortingResponseWriter, DistributedVersionInfoTest, TestSchemaNameResource, CheckHdfsIndexTest, TestClusterStateMutator, TestTolerantSearch, RemoteQueryErrorTest, TestReplicationHandler]
[junit4] Completed [240/626 (1!)] on J0 in 69.59s, 15 tests, 1 failure, 1 skipped <<< FAILURES!
[...truncated 61339 lines...]
[JENKINS] Lucene-Solr-master-MacOSX (64bit/jdk1.8.0) - Build # 3457
- Still Unstable!
Posted by Policeman Jenkins Server <je...@thetaphi.de>.
Build: http://jenkins.thetaphi.de/job/Lucene-Solr-master-MacOSX/3457/
Java: 64bit/jdk1.8.0 -XX:+UseCompressedOops -XX:+UseParallelGC
2 tests failed.
FAILED: org.apache.solr.handler.TestReqParamsAPI.test
Error Message:
Could not get expected value 'first' for path 'response/params/x/_appends_/add' full output: { "responseHeader":{ "status":0, "QTime":0}, "response":{ "znodeVersion":3, "params":{ "x":{ "a":"A val", "b":"B val", "":{"v":0}}, "y":{ "p":"P val", "q":"Q val", "":{"v":2}}}}}, from server: http://127.0.0.1:52487/collection1
Stack Trace:
java.lang.AssertionError: Could not get expected value 'first' for path 'response/params/x/_appends_/add' full output: {
"responseHeader":{
"status":0,
"QTime":0},
"response":{
"znodeVersion":3,
"params":{
"x":{
"a":"A val",
"b":"B val",
"":{"v":0}},
"y":{
"p":"P val",
"q":"Q val",
"":{"v":2}}}}}, from server: http://127.0.0.1:52487/collection1
at __randomizedtesting.SeedInfo.seed([E1109D68B30CE67D:6944A2B21DF08B85]:0)
at org.junit.Assert.fail(Assert.java:93)
at org.junit.Assert.assertTrue(Assert.java:43)
at org.apache.solr.core.TestSolrConfigHandler.testForResponseElement(TestSolrConfigHandler.java:481)
at org.apache.solr.handler.TestReqParamsAPI.testReqParams(TestReqParamsAPI.java:230)
at org.apache.solr.handler.TestReqParamsAPI.test(TestReqParamsAPI.java:61)
at sun.reflect.NativeMethodAccessorImpl.invoke0(Native Method)
at sun.reflect.NativeMethodAccessorImpl.invoke(NativeMethodAccessorImpl.java:62)
at sun.reflect.DelegatingMethodAccessorImpl.invoke(DelegatingMethodAccessorImpl.java:43)
at java.lang.reflect.Method.invoke(Method.java:498)
at com.carrotsearch.randomizedtesting.RandomizedRunner.invoke(RandomizedRunner.java:1764)
at com.carrotsearch.randomizedtesting.RandomizedRunner$8.evaluate(RandomizedRunner.java:871)
at com.carrotsearch.randomizedtesting.RandomizedRunner$9.evaluate(RandomizedRunner.java:907)
at com.carrotsearch.randomizedtesting.RandomizedRunner$10.evaluate(RandomizedRunner.java:921)
at org.apache.solr.BaseDistributedSearchTestCase$ShardsRepeatRule$ShardsFixedStatement.callStatement(BaseDistributedSearchTestCase.java:985)
at org.apache.solr.BaseDistributedSearchTestCase$ShardsRepeatRule$ShardsStatement.evaluate(BaseDistributedSearchTestCase.java:960)
at com.carrotsearch.randomizedtesting.rules.SystemPropertiesRestoreRule$1.evaluate(SystemPropertiesRestoreRule.java:57)
at org.apache.lucene.util.TestRuleSetupTeardownChained$1.evaluate(TestRuleSetupTeardownChained.java:49)
at org.apache.lucene.util.AbstractBeforeAfterRule$1.evaluate(AbstractBeforeAfterRule.java:45)
at org.apache.lucene.util.TestRuleThreadAndTestName$1.evaluate(TestRuleThreadAndTestName.java:48)
at org.apache.lucene.util.TestRuleIgnoreAfterMaxFailures$1.evaluate(TestRuleIgnoreAfterMaxFailures.java:64)
at org.apache.lucene.util.TestRuleMarkFailure$1.evaluate(TestRuleMarkFailure.java:47)
at com.carrotsearch.randomizedtesting.rules.StatementAdapter.evaluate(StatementAdapter.java:36)
at com.carrotsearch.randomizedtesting.ThreadLeakControl$StatementRunner.run(ThreadLeakControl.java:367)
at com.carrotsearch.randomizedtesting.ThreadLeakControl.forkTimeoutingTask(ThreadLeakControl.java:809)
at com.carrotsearch.randomizedtesting.ThreadLeakControl$3.evaluate(ThreadLeakControl.java:460)
at com.carrotsearch.randomizedtesting.RandomizedRunner.runSingleTest(RandomizedRunner.java:880)
at com.carrotsearch.randomizedtesting.RandomizedRunner$5.evaluate(RandomizedRunner.java:781)
at com.carrotsearch.randomizedtesting.RandomizedRunner$6.evaluate(RandomizedRunner.java:816)
at com.carrotsearch.randomizedtesting.RandomizedRunner$7.evaluate(RandomizedRunner.java:827)
at com.carrotsearch.randomizedtesting.rules.StatementAdapter.evaluate(StatementAdapter.java:36)
at com.carrotsearch.randomizedtesting.rules.SystemPropertiesRestoreRule$1.evaluate(SystemPropertiesRestoreRule.java:57)
at org.apache.lucene.util.AbstractBeforeAfterRule$1.evaluate(AbstractBeforeAfterRule.java:45)
at com.carrotsearch.randomizedtesting.rules.StatementAdapter.evaluate(StatementAdapter.java:36)
at org.apache.lucene.util.TestRuleStoreClassName$1.evaluate(TestRuleStoreClassName.java:41)
at com.carrotsearch.randomizedtesting.rules.NoShadowingOrOverridesOnMethodsRule$1.evaluate(NoShadowingOrOverridesOnMethodsRule.java:40)
at com.carrotsearch.randomizedtesting.rules.NoShadowingOrOverridesOnMethodsRule$1.evaluate(NoShadowingOrOverridesOnMethodsRule.java:40)
at com.carrotsearch.randomizedtesting.rules.StatementAdapter.evaluate(StatementAdapter.java:36)
at com.carrotsearch.randomizedtesting.rules.StatementAdapter.evaluate(StatementAdapter.java:36)
at com.carrotsearch.randomizedtesting.rules.StatementAdapter.evaluate(StatementAdapter.java:36)
at org.apache.lucene.util.TestRuleAssertionsRequired$1.evaluate(TestRuleAssertionsRequired.java:53)
at org.apache.lucene.util.TestRuleMarkFailure$1.evaluate(TestRuleMarkFailure.java:47)
at org.apache.lucene.util.TestRuleIgnoreAfterMaxFailures$1.evaluate(TestRuleIgnoreAfterMaxFailures.java:64)
at org.apache.lucene.util.TestRuleIgnoreTestSuites$1.evaluate(TestRuleIgnoreTestSuites.java:54)
at com.carrotsearch.randomizedtesting.rules.StatementAdapter.evaluate(StatementAdapter.java:36)
at com.carrotsearch.randomizedtesting.ThreadLeakControl$StatementRunner.run(ThreadLeakControl.java:367)
at java.lang.Thread.run(Thread.java:745)
FAILED: org.apache.solr.common.cloud.TestCollectionStateWatchers.testWatchesWorkForStateFormat1
Error Message:
CollectionStateWatcher not notified of stateformat=1 collection creation
Stack Trace:
java.lang.AssertionError: CollectionStateWatcher not notified of stateformat=1 collection creation
at __randomizedtesting.SeedInfo.seed([881B9CDCC6E447B1:EFDC8032325C6310]:0)
at org.junit.Assert.fail(Assert.java:93)
at org.junit.Assert.assertTrue(Assert.java:43)
at org.apache.solr.common.cloud.TestCollectionStateWatchers.testWatchesWorkForStateFormat1(TestCollectionStateWatchers.java:267)
at sun.reflect.NativeMethodAccessorImpl.invoke0(Native Method)
at sun.reflect.NativeMethodAccessorImpl.invoke(NativeMethodAccessorImpl.java:62)
at sun.reflect.DelegatingMethodAccessorImpl.invoke(DelegatingMethodAccessorImpl.java:43)
at java.lang.reflect.Method.invoke(Method.java:498)
at com.carrotsearch.randomizedtesting.RandomizedRunner.invoke(RandomizedRunner.java:1764)
at com.carrotsearch.randomizedtesting.RandomizedRunner$8.evaluate(RandomizedRunner.java:871)
at com.carrotsearch.randomizedtesting.RandomizedRunner$9.evaluate(RandomizedRunner.java:907)
at com.carrotsearch.randomizedtesting.RandomizedRunner$10.evaluate(RandomizedRunner.java:921)
at com.carrotsearch.randomizedtesting.rules.SystemPropertiesRestoreRule$1.evaluate(SystemPropertiesRestoreRule.java:57)
at org.apache.lucene.util.TestRuleSetupTeardownChained$1.evaluate(TestRuleSetupTeardownChained.java:49)
at org.apache.lucene.util.AbstractBeforeAfterRule$1.evaluate(AbstractBeforeAfterRule.java:45)
at org.apache.lucene.util.TestRuleThreadAndTestName$1.evaluate(TestRuleThreadAndTestName.java:48)
at org.apache.lucene.util.TestRuleIgnoreAfterMaxFailures$1.evaluate(TestRuleIgnoreAfterMaxFailures.java:64)
at org.apache.lucene.util.TestRuleMarkFailure$1.evaluate(TestRuleMarkFailure.java:47)
at com.carrotsearch.randomizedtesting.rules.StatementAdapter.evaluate(StatementAdapter.java:36)
at com.carrotsearch.randomizedtesting.ThreadLeakControl$StatementRunner.run(ThreadLeakControl.java:367)
at com.carrotsearch.randomizedtesting.ThreadLeakControl.forkTimeoutingTask(ThreadLeakControl.java:809)
at com.carrotsearch.randomizedtesting.ThreadLeakControl$3.evaluate(ThreadLeakControl.java:460)
at com.carrotsearch.randomizedtesting.RandomizedRunner.runSingleTest(RandomizedRunner.java:880)
at com.carrotsearch.randomizedtesting.RandomizedRunner$5.evaluate(RandomizedRunner.java:781)
at com.carrotsearch.randomizedtesting.RandomizedRunner$6.evaluate(RandomizedRunner.java:816)
at com.carrotsearch.randomizedtesting.RandomizedRunner$7.evaluate(RandomizedRunner.java:827)
at com.carrotsearch.randomizedtesting.rules.StatementAdapter.evaluate(StatementAdapter.java:36)
at com.carrotsearch.randomizedtesting.rules.SystemPropertiesRestoreRule$1.evaluate(SystemPropertiesRestoreRule.java:57)
at org.apache.lucene.util.AbstractBeforeAfterRule$1.evaluate(AbstractBeforeAfterRule.java:45)
at com.carrotsearch.randomizedtesting.rules.StatementAdapter.evaluate(StatementAdapter.java:36)
at org.apache.lucene.util.TestRuleStoreClassName$1.evaluate(TestRuleStoreClassName.java:41)
at com.carrotsearch.randomizedtesting.rules.NoShadowingOrOverridesOnMethodsRule$1.evaluate(NoShadowingOrOverridesOnMethodsRule.java:40)
at com.carrotsearch.randomizedtesting.rules.NoShadowingOrOverridesOnMethodsRule$1.evaluate(NoShadowingOrOverridesOnMethodsRule.java:40)
at com.carrotsearch.randomizedtesting.rules.StatementAdapter.evaluate(StatementAdapter.java:36)
at com.carrotsearch.randomizedtesting.rules.StatementAdapter.evaluate(StatementAdapter.java:36)
at com.carrotsearch.randomizedtesting.rules.StatementAdapter.evaluate(StatementAdapter.java:36)
at org.apache.lucene.util.TestRuleAssertionsRequired$1.evaluate(TestRuleAssertionsRequired.java:53)
at org.apache.lucene.util.TestRuleMarkFailure$1.evaluate(TestRuleMarkFailure.java:47)
at org.apache.lucene.util.TestRuleIgnoreAfterMaxFailures$1.evaluate(TestRuleIgnoreAfterMaxFailures.java:64)
at org.apache.lucene.util.TestRuleIgnoreTestSuites$1.evaluate(TestRuleIgnoreTestSuites.java:54)
at com.carrotsearch.randomizedtesting.rules.StatementAdapter.evaluate(StatementAdapter.java:36)
at com.carrotsearch.randomizedtesting.ThreadLeakControl$StatementRunner.run(ThreadLeakControl.java:367)
at java.lang.Thread.run(Thread.java:745)
Build Log:
[...truncated 12151 lines...]
[junit4] Suite: org.apache.solr.handler.TestReqParamsAPI
[junit4] 2> Creating dataDir: /Users/jenkins/workspace/Lucene-Solr-master-MacOSX/solr/build/solr-core/test/J0/temp/solr.handler.TestReqParamsAPI_E1109D68B30CE67D-001/init-core-data-001
[junit4] 2> 3105337 INFO (SUITE-TestReqParamsAPI-seed#[E1109D68B30CE67D]-worker) [ ] o.a.s.SolrTestCaseJ4 Randomized ssl (false) and clientAuth (false) via: @org.apache.solr.util.RandomizeSSL(reason=, value=NaN, ssl=NaN, clientAuth=NaN) w/ MAC_OS_X supressed clientAuth
[junit4] 2> 3105337 INFO (SUITE-TestReqParamsAPI-seed#[E1109D68B30CE67D]-worker) [ ] o.a.s.BaseDistributedSearchTestCase Setting hostContext system property: /
[junit4] 2> 3105340 INFO (TEST-TestReqParamsAPI.test-seed#[E1109D68B30CE67D]) [ ] o.a.s.c.ZkTestServer STARTING ZK TEST SERVER
[junit4] 2> 3105341 INFO (Thread-3791) [ ] o.a.s.c.ZkTestServer client port:0.0.0.0/0.0.0.0:0
[junit4] 2> 3105341 INFO (Thread-3791) [ ] o.a.s.c.ZkTestServer Starting server
[junit4] 2> 3105448 INFO (TEST-TestReqParamsAPI.test-seed#[E1109D68B30CE67D]) [ ] o.a.s.c.ZkTestServer start zk server on port:52462
[junit4] 2> 3105449 INFO (TEST-TestReqParamsAPI.test-seed#[E1109D68B30CE67D]) [ ] o.a.s.c.c.SolrZkClient Using default ZkCredentialsProvider
[junit4] 2> 3105449 INFO (TEST-TestReqParamsAPI.test-seed#[E1109D68B30CE67D]) [ ] o.a.s.c.c.ConnectionManager Waiting for client to connect to ZooKeeper
[junit4] 2> 3105488 INFO (zkCallback-3281-thread-1) [ ] o.a.s.c.c.ConnectionManager Watcher org.apache.solr.common.cloud.ConnectionManager@342f7518 name:ZooKeeperConnection Watcher:127.0.0.1:52462 got event WatchedEvent state:SyncConnected type:None path:null path:null type:None
[junit4] 2> 3105489 INFO (TEST-TestReqParamsAPI.test-seed#[E1109D68B30CE67D]) [ ] o.a.s.c.c.ConnectionManager Client is connected to ZooKeeper
[junit4] 2> 3105489 INFO (TEST-TestReqParamsAPI.test-seed#[E1109D68B30CE67D]) [ ] o.a.s.c.c.SolrZkClient Using default ZkACLProvider
[junit4] 2> 3105489 INFO (TEST-TestReqParamsAPI.test-seed#[E1109D68B30CE67D]) [ ] o.a.s.c.c.SolrZkClient makePath: /solr
[junit4] 2> 3105495 INFO (TEST-TestReqParamsAPI.test-seed#[E1109D68B30CE67D]) [ ] o.a.s.c.c.SolrZkClient Using default ZkCredentialsProvider
[junit4] 2> 3105496 INFO (TEST-TestReqParamsAPI.test-seed#[E1109D68B30CE67D]) [ ] o.a.s.c.c.ConnectionManager Waiting for client to connect to ZooKeeper
[junit4] 2> 3105498 INFO (zkCallback-3282-thread-1) [ ] o.a.s.c.c.ConnectionManager Watcher org.apache.solr.common.cloud.ConnectionManager@72658ee3 name:ZooKeeperConnection Watcher:127.0.0.1:52462/solr got event WatchedEvent state:SyncConnected type:None path:null path:null type:None
[junit4] 2> 3105498 INFO (TEST-TestReqParamsAPI.test-seed#[E1109D68B30CE67D]) [ ] o.a.s.c.c.ConnectionManager Client is connected to ZooKeeper
[junit4] 2> 3105498 INFO (TEST-TestReqParamsAPI.test-seed#[E1109D68B30CE67D]) [ ] o.a.s.c.c.SolrZkClient Using default ZkACLProvider
[junit4] 2> 3105498 INFO (TEST-TestReqParamsAPI.test-seed#[E1109D68B30CE67D]) [ ] o.a.s.c.c.SolrZkClient makePath: /collections/collection1
[junit4] 2> 3105502 INFO (TEST-TestReqParamsAPI.test-seed#[E1109D68B30CE67D]) [ ] o.a.s.c.c.SolrZkClient makePath: /collections/collection1/shards
[junit4] 2> 3105506 INFO (TEST-TestReqParamsAPI.test-seed#[E1109D68B30CE67D]) [ ] o.a.s.c.c.SolrZkClient makePath: /collections/control_collection
[junit4] 2> 3105510 INFO (TEST-TestReqParamsAPI.test-seed#[E1109D68B30CE67D]) [ ] o.a.s.c.c.SolrZkClient makePath: /collections/control_collection/shards
[junit4] 2> 3105514 INFO (TEST-TestReqParamsAPI.test-seed#[E1109D68B30CE67D]) [ ] o.a.s.c.AbstractZkTestCase put /Users/jenkins/workspace/Lucene-Solr-master-MacOSX/solr/core/src/test-files/solr/collection1/conf/solrconfig-tlog.xml to /configs/conf1/solrconfig.xml
[junit4] 2> 3105516 INFO (TEST-TestReqParamsAPI.test-seed#[E1109D68B30CE67D]) [ ] o.a.s.c.c.SolrZkClient makePath: /configs/conf1/solrconfig.xml
[junit4] 2> 3105521 INFO (TEST-TestReqParamsAPI.test-seed#[E1109D68B30CE67D]) [ ] o.a.s.c.AbstractZkTestCase put /Users/jenkins/workspace/Lucene-Solr-master-MacOSX/solr/core/src/test-files/solr/collection1/conf/schema.xml to /configs/conf1/schema.xml
[junit4] 2> 3105521 INFO (TEST-TestReqParamsAPI.test-seed#[E1109D68B30CE67D]) [ ] o.a.s.c.c.SolrZkClient makePath: /configs/conf1/schema.xml
[junit4] 2> 3105525 INFO (TEST-TestReqParamsAPI.test-seed#[E1109D68B30CE67D]) [ ] o.a.s.c.AbstractZkTestCase put /Users/jenkins/workspace/Lucene-Solr-master-MacOSX/solr/core/src/test-files/solr/collection1/conf/solrconfig.snippet.randomindexconfig.xml to /configs/conf1/solrconfig.snippet.randomindexconfig.xml
[junit4] 2> 3105525 INFO (TEST-TestReqParamsAPI.test-seed#[E1109D68B30CE67D]) [ ] o.a.s.c.c.SolrZkClient makePath: /configs/conf1/solrconfig.snippet.randomindexconfig.xml
[junit4] 2> 3105530 INFO (TEST-TestReqParamsAPI.test-seed#[E1109D68B30CE67D]) [ ] o.a.s.c.AbstractZkTestCase put /Users/jenkins/workspace/Lucene-Solr-master-MacOSX/solr/core/src/test-files/solr/collection1/conf/stopwords.txt to /configs/conf1/stopwords.txt
[junit4] 2> 3105530 INFO (TEST-TestReqParamsAPI.test-seed#[E1109D68B30CE67D]) [ ] o.a.s.c.c.SolrZkClient makePath: /configs/conf1/stopwords.txt
[junit4] 2> 3105533 INFO (TEST-TestReqParamsAPI.test-seed#[E1109D68B30CE67D]) [ ] o.a.s.c.AbstractZkTestCase put /Users/jenkins/workspace/Lucene-Solr-master-MacOSX/solr/core/src/test-files/solr/collection1/conf/protwords.txt to /configs/conf1/protwords.txt
[junit4] 2> 3105534 INFO (TEST-TestReqParamsAPI.test-seed#[E1109D68B30CE67D]) [ ] o.a.s.c.c.SolrZkClient makePath: /configs/conf1/protwords.txt
[junit4] 2> 3105537 INFO (TEST-TestReqParamsAPI.test-seed#[E1109D68B30CE67D]) [ ] o.a.s.c.AbstractZkTestCase put /Users/jenkins/workspace/Lucene-Solr-master-MacOSX/solr/core/src/test-files/solr/collection1/conf/currency.xml to /configs/conf1/currency.xml
[junit4] 2> 3105538 INFO (TEST-TestReqParamsAPI.test-seed#[E1109D68B30CE67D]) [ ] o.a.s.c.c.SolrZkClient makePath: /configs/conf1/currency.xml
[junit4] 2> 3105542 INFO (TEST-TestReqParamsAPI.test-seed#[E1109D68B30CE67D]) [ ] o.a.s.c.AbstractZkTestCase put /Users/jenkins/workspace/Lucene-Solr-master-MacOSX/solr/core/src/test-files/solr/collection1/conf/enumsConfig.xml to /configs/conf1/enumsConfig.xml
[junit4] 2> 3105542 INFO (TEST-TestReqParamsAPI.test-seed#[E1109D68B30CE67D]) [ ] o.a.s.c.c.SolrZkClient makePath: /configs/conf1/enumsConfig.xml
[junit4] 2> 3105545 INFO (TEST-TestReqParamsAPI.test-seed#[E1109D68B30CE67D]) [ ] o.a.s.c.AbstractZkTestCase put /Users/jenkins/workspace/Lucene-Solr-master-MacOSX/solr/core/src/test-files/solr/collection1/conf/open-exchange-rates.json to /configs/conf1/open-exchange-rates.json
[junit4] 2> 3105546 INFO (TEST-TestReqParamsAPI.test-seed#[E1109D68B30CE67D]) [ ] o.a.s.c.c.SolrZkClient makePath: /configs/conf1/open-exchange-rates.json
[junit4] 2> 3105549 INFO (TEST-TestReqParamsAPI.test-seed#[E1109D68B30CE67D]) [ ] o.a.s.c.AbstractZkTestCase put /Users/jenkins/workspace/Lucene-Solr-master-MacOSX/solr/core/src/test-files/solr/collection1/conf/mapping-ISOLatin1Accent.txt to /configs/conf1/mapping-ISOLatin1Accent.txt
[junit4] 2> 3105550 INFO (TEST-TestReqParamsAPI.test-seed#[E1109D68B30CE67D]) [ ] o.a.s.c.c.SolrZkClient makePath: /configs/conf1/mapping-ISOLatin1Accent.txt
[junit4] 2> 3105554 INFO (TEST-TestReqParamsAPI.test-seed#[E1109D68B30CE67D]) [ ] o.a.s.c.AbstractZkTestCase put /Users/jenkins/workspace/Lucene-Solr-master-MacOSX/solr/core/src/test-files/solr/collection1/conf/old_synonyms.txt to /configs/conf1/old_synonyms.txt
[junit4] 2> 3105555 INFO (TEST-TestReqParamsAPI.test-seed#[E1109D68B30CE67D]) [ ] o.a.s.c.c.SolrZkClient makePath: /configs/conf1/old_synonyms.txt
[junit4] 2> 3105559 INFO (TEST-TestReqParamsAPI.test-seed#[E1109D68B30CE67D]) [ ] o.a.s.c.AbstractZkTestCase put /Users/jenkins/workspace/Lucene-Solr-master-MacOSX/solr/core/src/test-files/solr/collection1/conf/synonyms.txt to /configs/conf1/synonyms.txt
[junit4] 2> 3105559 INFO (TEST-TestReqParamsAPI.test-seed#[E1109D68B30CE67D]) [ ] o.a.s.c.c.SolrZkClient makePath: /configs/conf1/synonyms.txt
[junit4] 2> 3106927 INFO (TEST-TestReqParamsAPI.test-seed#[E1109D68B30CE67D]) [ ] o.a.s.SolrTestCaseJ4 Writing core.properties file to /Users/jenkins/workspace/Lucene-Solr-master-MacOSX/solr/build/solr-core/test/J0/temp/solr.handler.TestReqParamsAPI_E1109D68B30CE67D-001/control-001/cores/collection1
[junit4] 2> 3106930 INFO (TEST-TestReqParamsAPI.test-seed#[E1109D68B30CE67D]) [ ] o.e.j.s.Server jetty-9.3.8.v20160314
[junit4] 2> 3106934 INFO (TEST-TestReqParamsAPI.test-seed#[E1109D68B30CE67D]) [ ] o.e.j.s.h.ContextHandler Started o.e.j.s.ServletContextHandler@290c3cb8{/,null,AVAILABLE}
[junit4] 2> 3106934 INFO (TEST-TestReqParamsAPI.test-seed#[E1109D68B30CE67D]) [ ] o.e.j.s.ServerConnector Started ServerConnector@458ab482{HTTP/1.1,[http/1.1]}{127.0.0.1:52467}
[junit4] 2> 3106934 INFO (TEST-TestReqParamsAPI.test-seed#[E1109D68B30CE67D]) [ ] o.e.j.s.Server Started @3112958ms
[junit4] 2> 3106934 INFO (TEST-TestReqParamsAPI.test-seed#[E1109D68B30CE67D]) [ ] o.a.s.c.s.e.JettySolrRunner Jetty properties: {solr.data.dir=/Users/jenkins/workspace/Lucene-Solr-master-MacOSX/solr/build/solr-core/test/J0/temp/solr.handler.TestReqParamsAPI_E1109D68B30CE67D-001/tempDir-001/control/data, hostContext=/, hostPort=52467, coreRootDirectory=/Users/jenkins/workspace/Lucene-Solr-master-MacOSX/solr/build/solr-core/test/J0/../../../../../../../../../Users/jenkins/workspace/Lucene-Solr-master-MacOSX/solr/build/solr-core/test/J0/temp/solr.handler.TestReqParamsAPI_E1109D68B30CE67D-001/control-001/cores}
[junit4] 2> 3106936 INFO (TEST-TestReqParamsAPI.test-seed#[E1109D68B30CE67D]) [ ] o.a.s.s.SolrDispatchFilter SolrDispatchFilter.init(): sun.misc.Launcher$AppClassLoader@4554617c
[junit4] 2> 3106936 INFO (TEST-TestReqParamsAPI.test-seed#[E1109D68B30CE67D]) [ ] o.a.s.c.SolrResourceLoader new SolrResourceLoader for directory: '/Users/jenkins/workspace/Lucene-Solr-master-MacOSX/solr/build/solr-core/test/J0/temp/solr.handler.TestReqParamsAPI_E1109D68B30CE67D-001/control-001'
[junit4] 2> 3106936 INFO (TEST-TestReqParamsAPI.test-seed#[E1109D68B30CE67D]) [ ] o.a.s.c.SolrResourceLoader JNDI not configured for solr (NoInitialContextEx)
[junit4] 2> 3106936 INFO (TEST-TestReqParamsAPI.test-seed#[E1109D68B30CE67D]) [ ] o.a.s.c.SolrResourceLoader solr home defaulted to 'solr/' (could not find system property or JNDI)
[junit4] 2> 3106936 INFO (TEST-TestReqParamsAPI.test-seed#[E1109D68B30CE67D]) [ ] o.a.s.c.c.SolrZkClient Using default ZkCredentialsProvider
[junit4] 2> 3106937 INFO (TEST-TestReqParamsAPI.test-seed#[E1109D68B30CE67D]) [ ] o.a.s.c.c.ConnectionManager Waiting for client to connect to ZooKeeper
[junit4] 2> 3106939 INFO (zkCallback-3283-thread-1) [ ] o.a.s.c.c.ConnectionManager Watcher org.apache.solr.common.cloud.ConnectionManager@7d97e77 name:ZooKeeperConnection Watcher:127.0.0.1:52462/solr got event WatchedEvent state:SyncConnected type:None path:null path:null type:None
[junit4] 2> 3106939 INFO (TEST-TestReqParamsAPI.test-seed#[E1109D68B30CE67D]) [ ] o.a.s.c.c.ConnectionManager Client is connected to ZooKeeper
[junit4] 2> 3106939 INFO (TEST-TestReqParamsAPI.test-seed#[E1109D68B30CE67D]) [ ] o.a.s.c.c.SolrZkClient Using default ZkACLProvider
[junit4] 2> 3106941 INFO (TEST-TestReqParamsAPI.test-seed#[E1109D68B30CE67D]) [ ] o.a.s.s.SolrDispatchFilter Loading solr.xml from SolrHome (not found in ZooKeeper)
[junit4] 2> 3106941 INFO (TEST-TestReqParamsAPI.test-seed#[E1109D68B30CE67D]) [ ] o.a.s.c.SolrXmlConfig Loading container configuration from /Users/jenkins/workspace/Lucene-Solr-master-MacOSX/solr/build/solr-core/test/J0/temp/solr.handler.TestReqParamsAPI_E1109D68B30CE67D-001/control-001/solr.xml
[junit4] 2> 3106952 INFO (TEST-TestReqParamsAPI.test-seed#[E1109D68B30CE67D]) [ ] o.a.s.c.CorePropertiesLocator Config-defined core root directory: /Users/jenkins/workspace/Lucene-Solr-master-MacOSX/solr/build/solr-core/test/J0/../../../../../../../../../Users/jenkins/workspace/Lucene-Solr-master-MacOSX/solr/build/solr-core/test/J0/temp/solr.handler.TestReqParamsAPI_E1109D68B30CE67D-001/control-001/cores
[junit4] 2> 3106952 INFO (TEST-TestReqParamsAPI.test-seed#[E1109D68B30CE67D]) [ ] o.a.s.c.CoreContainer New CoreContainer 1328294176
[junit4] 2> 3106952 INFO (TEST-TestReqParamsAPI.test-seed#[E1109D68B30CE67D]) [ ] o.a.s.c.CoreContainer Loading cores into CoreContainer [instanceDir=/Users/jenkins/workspace/Lucene-Solr-master-MacOSX/solr/build/solr-core/test/J0/temp/solr.handler.TestReqParamsAPI_E1109D68B30CE67D-001/control-001]
[junit4] 2> 3106953 WARN (TEST-TestReqParamsAPI.test-seed#[E1109D68B30CE67D]) [ ] o.a.s.c.CoreContainer Couldn't add files from /Users/jenkins/workspace/Lucene-Solr-master-MacOSX/solr/build/solr-core/test/J0/temp/solr.handler.TestReqParamsAPI_E1109D68B30CE67D-001/control-001/lib to classpath: /Users/jenkins/workspace/Lucene-Solr-master-MacOSX/solr/build/solr-core/test/J0/temp/solr.handler.TestReqParamsAPI_E1109D68B30CE67D-001/control-001/lib
[junit4] 2> 3106953 INFO (TEST-TestReqParamsAPI.test-seed#[E1109D68B30CE67D]) [ ] o.a.s.h.c.HttpShardHandlerFactory created with socketTimeout : 90000,urlScheme : ,connTimeout : 15000,maxConnectionsPerHost : 20,maxConnections : 10000,corePoolSize : 0,maximumPoolSize : 2147483647,maxThreadIdleTime : 5,sizeOfQueue : -1,fairnessPolicy : false,
[junit4] 2> 3106960 INFO (TEST-TestReqParamsAPI.test-seed#[E1109D68B30CE67D]) [ ] o.a.s.u.UpdateShardHandler Created UpdateShardHandler HTTP client with params: socketTimeout=340000&connTimeout=45000&maxConnections=100000&maxConnectionsPerHost=100000
[junit4] 2> 3106961 INFO (TEST-TestReqParamsAPI.test-seed#[E1109D68B30CE67D]) [ ] o.a.s.l.LogWatcher SLF4J impl is org.slf4j.impl.Log4jLoggerFactory
[junit4] 2> 3106961 INFO (TEST-TestReqParamsAPI.test-seed#[E1109D68B30CE67D]) [ ] o.a.s.l.LogWatcher Registering Log Listener [Log4j (org.slf4j.impl.Log4jLoggerFactory)]
[junit4] 2> 3106961 INFO (TEST-TestReqParamsAPI.test-seed#[E1109D68B30CE67D]) [ ] o.a.s.c.ZkContainer Zookeeper client=127.0.0.1:52462/solr
[junit4] 2> 3106961 INFO (TEST-TestReqParamsAPI.test-seed#[E1109D68B30CE67D]) [ ] o.a.s.c.ZkController zkHost includes chroot
[junit4] 2> 3106961 INFO (TEST-TestReqParamsAPI.test-seed#[E1109D68B30CE67D]) [ ] o.a.s.c.c.SolrZkClient Using default ZkCredentialsProvider
[junit4] 2> 3106962 INFO (TEST-TestReqParamsAPI.test-seed#[E1109D68B30CE67D]) [ ] o.a.s.c.c.ConnectionManager Waiting for client to connect to ZooKeeper
[junit4] 2> 3106963 INFO (zkCallback-3286-thread-1) [ ] o.a.s.c.c.ConnectionManager Watcher org.apache.solr.common.cloud.ConnectionManager@a98a07d name:ZooKeeperConnection Watcher:127.0.0.1:52462 got event WatchedEvent state:SyncConnected type:None path:null path:null type:None
[junit4] 2> 3106964 INFO (TEST-TestReqParamsAPI.test-seed#[E1109D68B30CE67D]) [ ] o.a.s.c.c.ConnectionManager Client is connected to ZooKeeper
[junit4] 2> 3106964 INFO (TEST-TestReqParamsAPI.test-seed#[E1109D68B30CE67D]) [ ] o.a.s.c.c.SolrZkClient Using default ZkACLProvider
[junit4] 2> 3106966 INFO (TEST-TestReqParamsAPI.test-seed#[E1109D68B30CE67D]) [n:127.0.0.1:52467_ ] o.a.s.c.ZkController Added new OnReconnect listener org.apache.solr.cloud.ZkController$$Lambda$10/150066919@408cb37e
[junit4] 2> 3106968 INFO (TEST-TestReqParamsAPI.test-seed#[E1109D68B30CE67D]) [n:127.0.0.1:52467_ ] o.a.s.c.c.ConnectionManager Waiting for client to connect to ZooKeeper
[junit4] 2> 3106969 INFO (zkCallback-3287-thread-1-processing-n:127.0.0.1:52467_) [n:127.0.0.1:52467_ ] o.a.s.c.c.ConnectionManager Watcher org.apache.solr.common.cloud.ConnectionManager@164461fe name:ZooKeeperConnection Watcher:127.0.0.1:52462/solr got event WatchedEvent state:SyncConnected type:None path:null path:null type:None
[junit4] 2> 3106969 INFO (TEST-TestReqParamsAPI.test-seed#[E1109D68B30CE67D]) [n:127.0.0.1:52467_ ] o.a.s.c.c.ConnectionManager Client is connected to ZooKeeper
[junit4] 2> 3106972 INFO (TEST-TestReqParamsAPI.test-seed#[E1109D68B30CE67D]) [n:127.0.0.1:52467_ ] o.a.s.c.c.SolrZkClient makePath: /overseer/queue
[junit4] 2> 3106976 INFO (TEST-TestReqParamsAPI.test-seed#[E1109D68B30CE67D]) [n:127.0.0.1:52467_ ] o.a.s.c.c.SolrZkClient makePath: /overseer/collection-queue-work
[junit4] 2> 3106983 INFO (TEST-TestReqParamsAPI.test-seed#[E1109D68B30CE67D]) [n:127.0.0.1:52467_ ] o.a.s.c.c.SolrZkClient makePath: /overseer/collection-map-running
[junit4] 2> 3106988 INFO (TEST-TestReqParamsAPI.test-seed#[E1109D68B30CE67D]) [n:127.0.0.1:52467_ ] o.a.s.c.c.SolrZkClient makePath: /overseer/collection-map-completed
[junit4] 2> 3106993 INFO (TEST-TestReqParamsAPI.test-seed#[E1109D68B30CE67D]) [n:127.0.0.1:52467_ ] o.a.s.c.c.SolrZkClient makePath: /overseer/collection-map-failure
[junit4] 2> 3106997 INFO (TEST-TestReqParamsAPI.test-seed#[E1109D68B30CE67D]) [n:127.0.0.1:52467_ ] o.a.s.c.c.SolrZkClient makePath: /live_nodes
[junit4] 2> 3107001 INFO (TEST-TestReqParamsAPI.test-seed#[E1109D68B30CE67D]) [n:127.0.0.1:52467_ ] o.a.s.c.c.SolrZkClient makePath: /aliases.json
[junit4] 2> 3107005 INFO (TEST-TestReqParamsAPI.test-seed#[E1109D68B30CE67D]) [n:127.0.0.1:52467_ ] o.a.s.c.c.SolrZkClient makePath: /clusterstate.json
[junit4] 2> 3107009 INFO (TEST-TestReqParamsAPI.test-seed#[E1109D68B30CE67D]) [n:127.0.0.1:52467_ ] o.a.s.c.c.SolrZkClient makePath: /security.json
[junit4] 2> 3107011 INFO (TEST-TestReqParamsAPI.test-seed#[E1109D68B30CE67D]) [n:127.0.0.1:52467_ ] o.a.s.c.c.ZkStateReader Updating cluster state from ZooKeeper...
[junit4] 2> 3107012 INFO (TEST-TestReqParamsAPI.test-seed#[E1109D68B30CE67D]) [n:127.0.0.1:52467_ ] o.a.s.c.c.ZkStateReader Loaded empty cluster properties
[junit4] 2> 3107014 INFO (TEST-TestReqParamsAPI.test-seed#[E1109D68B30CE67D]) [n:127.0.0.1:52467_ ] o.a.s.c.c.ZkStateReader Updated live nodes from ZooKeeper... (0) -> (0)
[junit4] 2> 3107022 INFO (TEST-TestReqParamsAPI.test-seed#[E1109D68B30CE67D]) [n:127.0.0.1:52467_ ] o.a.s.c.c.SolrZkClient makePath: /overseer_elect
[junit4] 2> 3107025 INFO (TEST-TestReqParamsAPI.test-seed#[E1109D68B30CE67D]) [n:127.0.0.1:52467_ ] o.a.s.c.c.SolrZkClient makePath: /overseer_elect/election
[junit4] 2> 3107029 INFO (TEST-TestReqParamsAPI.test-seed#[E1109D68B30CE67D]) [n:127.0.0.1:52467_ ] o.a.s.c.Overseer Overseer (id=null) closing
[junit4] 2> 3107030 INFO (TEST-TestReqParamsAPI.test-seed#[E1109D68B30CE67D]) [n:127.0.0.1:52467_ ] o.a.s.c.LeaderElector Joined leadership election with path: /overseer_elect/election/96369616741793796-127.0.0.1:52467_-n_0000000000
[junit4] 2> 3107031 INFO (TEST-TestReqParamsAPI.test-seed#[E1109D68B30CE67D]) [n:127.0.0.1:52467_ ] o.a.s.c.OverseerElectionContext I am going to be the leader 127.0.0.1:52467_
[junit4] 2> 3107031 INFO (TEST-TestReqParamsAPI.test-seed#[E1109D68B30CE67D]) [n:127.0.0.1:52467_ ] o.a.s.c.c.SolrZkClient makePath: /overseer_elect/leader
[junit4] 2> 3107034 INFO (TEST-TestReqParamsAPI.test-seed#[E1109D68B30CE67D]) [n:127.0.0.1:52467_ ] o.a.s.c.Overseer Overseer (id=96369616741793796-127.0.0.1:52467_-n_0000000000) starting
[junit4] 2> 3107037 INFO (TEST-TestReqParamsAPI.test-seed#[E1109D68B30CE67D]) [n:127.0.0.1:52467_ ] o.a.s.c.c.SolrZkClient makePath: /overseer/queue-work
[junit4] 2> 3107052 INFO (TEST-TestReqParamsAPI.test-seed#[E1109D68B30CE67D]) [n:127.0.0.1:52467_ ] o.a.s.c.OverseerAutoReplicaFailoverThread Starting OverseerAutoReplicaFailoverThread autoReplicaFailoverWorkLoopDelay=10000 autoReplicaFailoverWaitAfterExpiration=10000 autoReplicaFailoverBadNodeExpiration=60000
[junit4] 2> 3107053 INFO (OverseerCollectionConfigSetProcessor-96369616741793796-127.0.0.1:52467_-n_0000000000) [n:127.0.0.1:52467_ ] o.a.s.c.OverseerTaskProcessor Process current queue of overseer operations
[junit4] 2> 3107054 INFO (OverseerStateUpdate-96369616741793796-127.0.0.1:52467_-n_0000000000) [n:127.0.0.1:52467_ ] o.a.s.c.Overseer Starting to work on the main queue
[junit4] 2> 3107055 INFO (TEST-TestReqParamsAPI.test-seed#[E1109D68B30CE67D]) [n:127.0.0.1:52467_ ] o.a.s.c.ZkController Register node as live in ZooKeeper:/live_nodes/127.0.0.1:52467_
[junit4] 2> 3107055 INFO (TEST-TestReqParamsAPI.test-seed#[E1109D68B30CE67D]) [n:127.0.0.1:52467_ ] o.a.s.c.c.SolrZkClient makePath: /live_nodes/127.0.0.1:52467_
[junit4] 2> 3107058 INFO (OverseerStateUpdate-96369616741793796-127.0.0.1:52467_-n_0000000000) [n:127.0.0.1:52467_ ] o.a.s.c.c.ZkStateReader Updated live nodes from ZooKeeper... (0) -> (0)
[junit4] 2> 3107058 INFO (zkCallback-3287-thread-1-processing-n:127.0.0.1:52467_) [n:127.0.0.1:52467_ ] o.a.s.c.c.ZkStateReader A live node change: [WatchedEvent state:SyncConnected type:NodeChildrenChanged path:/live_nodes], has occurred - updating... (live nodes size: [0])
[junit4] 2> 3107059 INFO (zkCallback-3287-thread-1-processing-n:127.0.0.1:52467_) [n:127.0.0.1:52467_ ] o.a.s.c.c.ZkStateReader Updated live nodes from ZooKeeper... (0) -> (1)
[junit4] 2> 3107074 INFO (TEST-TestReqParamsAPI.test-seed#[E1109D68B30CE67D]) [n:127.0.0.1:52467_ ] o.a.s.c.CoreContainer Security conf doesn't exist. Skipping setup for authorization module.
[junit4] 2> 3107074 INFO (TEST-TestReqParamsAPI.test-seed#[E1109D68B30CE67D]) [n:127.0.0.1:52467_ ] o.a.s.c.CoreContainer No authentication plugin used.
[junit4] 2> 3107076 INFO (TEST-TestReqParamsAPI.test-seed#[E1109D68B30CE67D]) [n:127.0.0.1:52467_ ] o.a.s.c.CorePropertiesLocator Looking for core definitions underneath /Users/jenkins/workspace/Lucene-Solr-master-MacOSX/solr/build/solr-core/test/J0/../../../../../../../../../Users/jenkins/workspace/Lucene-Solr-master-MacOSX/solr/build/solr-core/test/J0/temp/solr.handler.TestReqParamsAPI_E1109D68B30CE67D-001/control-001/cores
[junit4] 2> 3107079 INFO (TEST-TestReqParamsAPI.test-seed#[E1109D68B30CE67D]) [n:127.0.0.1:52467_ ] o.a.s.c.CoreDescriptor Created CoreDescriptor: {name=collection1, config=solrconfig.xml, transient=false, schema=schema.xml, loadOnStartup=true, configSetProperties=configsetprops.json, collection=control_collection, coreNodeName=, dataDir=data/, shard=}
[junit4] 2> 3107079 INFO (TEST-TestReqParamsAPI.test-seed#[E1109D68B30CE67D]) [n:127.0.0.1:52467_ ] o.a.s.c.CorePropertiesLocator Found core collection1 in /Users/jenkins/workspace/Lucene-Solr-master-MacOSX/solr/build/solr-core/test/J0/../../../../../../../../../Users/jenkins/workspace/Lucene-Solr-master-MacOSX/solr/build/solr-core/test/J0/temp/solr.handler.TestReqParamsAPI_E1109D68B30CE67D-001/control-001/cores/collection1
[junit4] 2> 3107079 INFO (TEST-TestReqParamsAPI.test-seed#[E1109D68B30CE67D]) [n:127.0.0.1:52467_ ] o.a.s.c.CorePropertiesLocator Found 1 core definitions
[junit4] 2> 3107081 INFO (coreLoadExecutor-8336-thread-1-processing-n:127.0.0.1:52467_) [n:127.0.0.1:52467_ c:control_collection x:collection1] o.a.s.c.ZkController publishing state=down
[junit4] 2> 3107081 INFO (TEST-TestReqParamsAPI.test-seed#[E1109D68B30CE67D]) [n:127.0.0.1:52467_ ] o.a.s.s.SolrDispatchFilter user.dir=/Users/jenkins/workspace/Lucene-Solr-master-MacOSX/solr/build/solr-core/test/J0
[junit4] 2> 3107081 INFO (coreLoadExecutor-8336-thread-1-processing-n:127.0.0.1:52467_) [n:127.0.0.1:52467_ c:control_collection x:collection1] o.a.s.c.ZkController numShards not found on descriptor - reading it from system property
[junit4] 2> 3107081 INFO (TEST-TestReqParamsAPI.test-seed#[E1109D68B30CE67D]) [n:127.0.0.1:52467_ ] o.a.s.s.SolrDispatchFilter SolrDispatchFilter.init() done
[junit4] 2> 3107088 INFO (coreLoadExecutor-8336-thread-1-processing-n:127.0.0.1:52467_) [n:127.0.0.1:52467_ c:control_collection x:collection1] o.a.s.c.ZkController Collection control_collection not visible yet, but flagging it so a watch is registered when it becomes visible
[junit4] 2> 3107089 INFO (OverseerStateUpdate-96369616741793796-127.0.0.1:52467_-n_0000000000) [n:127.0.0.1:52467_ ] o.a.s.c.Overseer processMessage: queueSize: 1, message = {
[junit4] 2> "core":"collection1",
[junit4] 2> "roles":null,
[junit4] 2> "base_url":"http://127.0.0.1:52467",
[junit4] 2> "node_name":"127.0.0.1:52467_",
[junit4] 2> "numShards":"1",
[junit4] 2> "state":"down",
[junit4] 2> "shard":null,
[junit4] 2> "collection":"control_collection",
[junit4] 2> "operation":"state"} current state version: 0
[junit4] 2> 3107089 INFO (OverseerStateUpdate-96369616741793796-127.0.0.1:52467_-n_0000000000) [n:127.0.0.1:52467_ ] o.a.s.c.o.ReplicaMutator Update state numShards=1 message={
[junit4] 2> "core":"collection1",
[junit4] 2> "roles":null,
[junit4] 2> "base_url":"http://127.0.0.1:52467",
[junit4] 2> "node_name":"127.0.0.1:52467_",
[junit4] 2> "numShards":"1",
[junit4] 2> "state":"down",
[junit4] 2> "shard":null,
[junit4] 2> "collection":"control_collection",
[junit4] 2> "operation":"state"}
[junit4] 2> 3107090 INFO (coreLoadExecutor-8336-thread-1-processing-n:127.0.0.1:52467_) [n:127.0.0.1:52467_ c:control_collection x:collection1] o.a.s.c.c.ZkStateReader Deleting data for [control_collection]
[junit4] 2> 3107090 INFO (OverseerStateUpdate-96369616741793796-127.0.0.1:52467_-n_0000000000) [n:127.0.0.1:52467_ ] o.a.s.c.o.ClusterStateMutator building a new cName: control_collection
[junit4] 2> 3107091 INFO (OverseerStateUpdate-96369616741793796-127.0.0.1:52467_-n_0000000000) [n:127.0.0.1:52467_ ] o.a.s.c.o.ReplicaMutator Assigning new node to shard shard=shard1
[junit4] 2> 3107093 INFO (coreLoadExecutor-8336-thread-1-processing-n:127.0.0.1:52467_) [n:127.0.0.1:52467_ c:control_collection x:collection1] o.a.s.c.ZkController look for our core node name
[junit4] 2> 3107094 INFO (zkCallback-3287-thread-1-processing-n:127.0.0.1:52467_) [n:127.0.0.1:52467_ ] o.a.s.c.c.ZkStateReader A cluster state change: [WatchedEvent state:SyncConnected type:NodeDataChanged path:/clusterstate.json], has occurred - updating... (live nodes size: [1])
[junit4] 2> 3108096 INFO (coreLoadExecutor-8336-thread-1-processing-n:127.0.0.1:52467_) [n:127.0.0.1:52467_ c:control_collection x:collection1] o.a.s.c.ZkController waiting to find shard id in clusterstate for collection1
[junit4] 2> 3108096 INFO (coreLoadExecutor-8336-thread-1-processing-n:127.0.0.1:52467_) [n:127.0.0.1:52467_ c:control_collection x:collection1] o.a.s.c.ZkController Check for collection zkNode:control_collection
[junit4] 2> 3108097 INFO (coreLoadExecutor-8336-thread-1-processing-n:127.0.0.1:52467_) [n:127.0.0.1:52467_ c:control_collection x:collection1] o.a.s.c.ZkController Collection zkNode exists
[junit4] 2> 3108097 INFO (coreLoadExecutor-8336-thread-1-processing-n:127.0.0.1:52467_) [n:127.0.0.1:52467_ c:control_collection x:collection1] o.a.s.c.c.ZkStateReader Load collection config from: [/collections/control_collection]
[junit4] 2> 3108099 INFO (coreLoadExecutor-8336-thread-1-processing-n:127.0.0.1:52467_) [n:127.0.0.1:52467_ c:control_collection x:collection1] o.a.s.c.c.ZkStateReader path=[/collections/control_collection] [configName]=[conf1] specified config exists in ZooKeeper
[junit4] 2> 3108099 INFO (coreLoadExecutor-8336-thread-1-processing-n:127.0.0.1:52467_) [n:127.0.0.1:52467_ c:control_collection x:collection1] o.a.s.c.SolrResourceLoader new SolrResourceLoader for directory: '/Users/jenkins/workspace/Lucene-Solr-master-MacOSX/solr/build/solr-core/test/J0/temp/solr.handler.TestReqParamsAPI_E1109D68B30CE67D-001/control-001/cores/collection1'
[junit4] 2> 3108099 INFO (coreLoadExecutor-8336-thread-1-processing-n:127.0.0.1:52467_) [n:127.0.0.1:52467_ c:control_collection x:collection1] o.a.s.c.SolrResourceLoader JNDI not configured for solr (NoInitialContextEx)
[junit4] 2> 3108099 INFO (coreLoadExecutor-8336-thread-1-processing-n:127.0.0.1:52467_) [n:127.0.0.1:52467_ c:control_collection x:collection1] o.a.s.c.SolrResourceLoader solr home defaulted to 'solr/' (could not find system property or JNDI)
[junit4] 2> 3108102 INFO (coreLoadExecutor-8336-thread-1-processing-n:127.0.0.1:52467_) [n:127.0.0.1:52467_ c:control_collection x:collection1] o.a.s.c.Config loaded config solrconfig.xml with version 0
[junit4] 2> 3108112 INFO (coreLoadExecutor-8336-thread-1-processing-n:127.0.0.1:52467_) [n:127.0.0.1:52467_ c:control_collection x:collection1] o.a.s.c.SolrConfig current version of requestparams : -1
[junit4] 2> 3108116 WARN (coreLoadExecutor-8336-thread-1-processing-n:127.0.0.1:52467_) [n:127.0.0.1:52467_ c:control_collection x:collection1] o.a.s.c.Config Beginning with Solr 5.5, <mergePolicy> is deprecated, use <mergePolicyFactory> instead.
[junit4] 2> 3108117 INFO (coreLoadExecutor-8336-thread-1-processing-n:127.0.0.1:52467_) [n:127.0.0.1:52467_ c:control_collection x:collection1] o.a.s.c.SolrConfig Using Lucene MatchVersion: 7.0.0
[junit4] 2> 3108127 INFO (coreLoadExecutor-8336-thread-1-processing-n:127.0.0.1:52467_) [n:127.0.0.1:52467_ c:control_collection x:collection1] o.a.s.c.SolrConfig Loaded SolrConfig: solrconfig.xml
[junit4] 2> 3108136 INFO (coreLoadExecutor-8336-thread-1-processing-n:127.0.0.1:52467_) [n:127.0.0.1:52467_ c:control_collection x:collection1] o.a.s.s.IndexSchema [collection1] Schema name=test
[junit4] 2> 3108250 INFO (coreLoadExecutor-8336-thread-1-processing-n:127.0.0.1:52467_) [n:127.0.0.1:52467_ c:control_collection x:collection1] o.a.s.s.OpenExchangeRatesOrgProvider Initialized with rates=open-exchange-rates.json, refreshInterval=1440.
[junit4] 2> 3108261 INFO (coreLoadExecutor-8336-thread-1-processing-n:127.0.0.1:52467_) [n:127.0.0.1:52467_ c:control_collection x:collection1] o.a.s.s.IndexSchema default search field in schema is text
[junit4] 2> 3108263 INFO (coreLoadExecutor-8336-thread-1-processing-n:127.0.0.1:52467_) [n:127.0.0.1:52467_ c:control_collection x:collection1] o.a.s.s.IndexSchema unique key field: id
[junit4] 2> 3108294 INFO (coreLoadExecutor-8336-thread-1-processing-n:127.0.0.1:52467_) [n:127.0.0.1:52467_ c:control_collection x:collection1] o.a.s.s.FileExchangeRateProvider Reloading exchange rates from file currency.xml
[junit4] 2> 3108298 INFO (coreLoadExecutor-8336-thread-1-processing-n:127.0.0.1:52467_) [n:127.0.0.1:52467_ c:control_collection x:collection1] o.a.s.s.FileExchangeRateProvider Reloading exchange rates from file currency.xml
[junit4] 2> 3108302 INFO (coreLoadExecutor-8336-thread-1-processing-n:127.0.0.1:52467_) [n:127.0.0.1:52467_ c:control_collection x:collection1] o.a.s.s.OpenExchangeRatesOrgProvider Reloading exchange rates from open-exchange-rates.json
[junit4] 2> 3108304 INFO (coreLoadExecutor-8336-thread-1-processing-n:127.0.0.1:52467_) [n:127.0.0.1:52467_ c:control_collection x:collection1] o.a.s.s.OpenExchangeRatesOrgProvider Reloading exchange rates from open-exchange-rates.json
[junit4] 2> 3108308 INFO (coreLoadExecutor-8336-thread-1-processing-n:127.0.0.1:52467_) [n:127.0.0.1:52467_ c:control_collection x:collection1] o.a.s.c.ConfigSetProperties Did not find ConfigSet properties, assuming default properties: Can't find resource 'configsetprops.json' in classpath or '/configs/conf1', cwd=/Users/jenkins/workspace/Lucene-Solr-master-MacOSX/solr/build/solr-core/test/J0
[junit4] 2> 3108308 INFO (coreLoadExecutor-8336-thread-1-processing-n:127.0.0.1:52467_) [n:127.0.0.1:52467_ c:control_collection x:collection1] o.a.s.c.CoreContainer Creating SolrCore 'collection1' using configuration from collection control_collection
[junit4] 2> 3108308 INFO (coreLoadExecutor-8336-thread-1-processing-n:127.0.0.1:52467_) [n:127.0.0.1:52467_ c:control_collection s:shard1 r:core_node1 x:collection1] o.a.s.c.SolrCore org.apache.solr.core.MockDirectoryFactory
[junit4] 2> 3108309 INFO (coreLoadExecutor-8336-thread-1-processing-n:127.0.0.1:52467_) [n:127.0.0.1:52467_ c:control_collection s:shard1 r:core_node1 x:collection1] o.a.s.c.SolrCore [[collection1] ] Opening new SolrCore at [/Users/jenkins/workspace/Lucene-Solr-master-MacOSX/solr/build/solr-core/test/J0/temp/solr.handler.TestReqParamsAPI_E1109D68B30CE67D-001/control-001/cores/collection1], dataDir=[/Users/jenkins/workspace/Lucene-Solr-master-MacOSX/solr/build/solr-core/test/J0/../../../../../../../../../Users/jenkins/workspace/Lucene-Solr-master-MacOSX/solr/build/solr-core/test/J0/temp/solr.handler.TestReqParamsAPI_E1109D68B30CE67D-001/control-001/cores/collection1/data/]
[junit4] 2> 3108309 INFO (coreLoadExecutor-8336-thread-1-processing-n:127.0.0.1:52467_) [n:127.0.0.1:52467_ c:control_collection s:shard1 r:core_node1 x:collection1] o.a.s.c.JmxMonitoredMap JMX monitoring is enabled. Adding Solr mbeans to JMX Server: com.sun.jmx.mbeanserver.JmxMBeanServer@735d30bb
[junit4] 2> 3108309 INFO (coreLoadExecutor-8336-thread-1-processing-n:127.0.0.1:52467_) [n:127.0.0.1:52467_ c:control_collection s:shard1 r:core_node1 x:collection1] o.a.s.c.CachingDirectoryFactory return new directory for /Users/jenkins/workspace/Lucene-Solr-master-MacOSX/solr/build/solr-core/test/J0/../../../../../../../../../Users/jenkins/workspace/Lucene-Solr-master-MacOSX/solr/build/solr-core/test/J0/temp/solr.handler.TestReqParamsAPI_E1109D68B30CE67D-001/control-001/cores/collection1/data/snapshot_metadata
[junit4] 2> 3108310 INFO (coreLoadExecutor-8336-thread-1-processing-n:127.0.0.1:52467_) [n:127.0.0.1:52467_ c:control_collection s:shard1 r:core_node1 x:collection1] o.a.s.c.s.SolrSnapshotMetaDataManager Loading from snapshot metadata file...
[junit4] 2> 3108310 INFO (coreLoadExecutor-8336-thread-1-processing-n:127.0.0.1:52467_) [n:127.0.0.1:52467_ c:control_collection s:shard1 r:core_node1 x:collection1] o.a.s.c.CachingDirectoryFactory return new directory for /Users/jenkins/workspace/Lucene-Solr-master-MacOSX/solr/build/solr-core/test/J0/../../../../../../../../../Users/jenkins/workspace/Lucene-Solr-master-MacOSX/solr/build/solr-core/test/J0/temp/solr.handler.TestReqParamsAPI_E1109D68B30CE67D-001/control-001/cores/collection1/data
[junit4] 2> 3108310 INFO (coreLoadExecutor-8336-thread-1-processing-n:127.0.0.1:52467_) [n:127.0.0.1:52467_ c:control_collection s:shard1 r:core_node1 x:collection1] o.a.s.c.SolrCore New index directory detected: old=null new=/Users/jenkins/workspace/Lucene-Solr-master-MacOSX/solr/build/solr-core/test/J0/../../../../../../../../../Users/jenkins/workspace/Lucene-Solr-master-MacOSX/solr/build/solr-core/test/J0/temp/solr.handler.TestReqParamsAPI_E1109D68B30CE67D-001/control-001/cores/collection1/data/index/
[junit4] 2> 3108310 WARN (coreLoadExecutor-8336-thread-1-processing-n:127.0.0.1:52467_) [n:127.0.0.1:52467_ c:control_collection s:shard1 r:core_node1 x:collection1] o.a.s.c.SolrCore [collection1] Solr index directory '/Users/jenkins/workspace/Lucene-Solr-master-MacOSX/solr/build/solr-core/test/J0/../../../../../../../../../Users/jenkins/workspace/Lucene-Solr-master-MacOSX/solr/build/solr-core/test/J0/temp/solr.handler.TestReqParamsAPI_E1109D68B30CE67D-001/control-001/cores/collection1/data/index' doesn't exist. Creating new index...
[junit4] 2> 3108310 INFO (coreLoadExecutor-8336-thread-1-processing-n:127.0.0.1:52467_) [n:127.0.0.1:52467_ c:control_collection s:shard1 r:core_node1 x:collection1] o.a.s.c.CachingDirectoryFactory return new directory for /Users/jenkins/workspace/Lucene-Solr-master-MacOSX/solr/build/solr-core/test/J0/../../../../../../../../../Users/jenkins/workspace/Lucene-Solr-master-MacOSX/solr/build/solr-core/test/J0/temp/solr.handler.TestReqParamsAPI_E1109D68B30CE67D-001/control-001/cores/collection1/data/index
[junit4] 2> 3108311 INFO (coreLoadExecutor-8336-thread-1-processing-n:127.0.0.1:52467_) [n:127.0.0.1:52467_ c:control_collection s:shard1 r:core_node1 x:collection1] o.a.s.u.RandomMergePolicy RandomMergePolicy wrapping class org.apache.lucene.index.AlcoholicMergePolicy: [AlcoholicMergePolicy: minMergeSize=0, mergeFactor=10, maxMergeSize=396959635, maxMergeSizeForForcedMerge=9223372036854775807, calibrateSizeByDeletes=true, maxMergeDocs=2147483647, maxCFSSegmentSizeMB=8.796093022207999E12, noCFSRatio=0.1]
[junit4] 2> 3108311 INFO (coreLoadExecutor-8336-thread-1-processing-n:127.0.0.1:52467_) [n:127.0.0.1:52467_ c:control_collection s:shard1 r:core_node1 x:collection1] o.a.s.c.SolrDeletionPolicy SolrDeletionPolicy.onCommit: commits: num=1
[junit4] 2> commit{dir=MockDirectoryWrapper(RAMDirectory@592fb746 lockFactory=org.apache.lucene.store.SingleInstanceLockFactory@3f390c2d),segFN=segments_1,generation=1}
[junit4] 2> 3108311 INFO (coreLoadExecutor-8336-thread-1-processing-n:127.0.0.1:52467_) [n:127.0.0.1:52467_ c:control_collection s:shard1 r:core_node1 x:collection1] o.a.s.c.SolrDeletionPolicy newest commit generation = 1
[junit4] 2> 3108312 INFO (OldIndexDirectoryCleanupThreadForCore-collection1) [n:127.0.0.1:52467_ c:control_collection s:shard1 r:core_node1 x:collection1] o.a.s.c.SolrCore Looking for old index directories to cleanup for core collection1 in /Users/jenkins/workspace/Lucene-Solr-master-MacOSX/solr/build/solr-core/test/J0/../../../../../../../../../Users/jenkins/workspace/Lucene-Solr-master-MacOSX/solr/build/solr-core/test/J0/temp/solr.handler.TestReqParamsAPI_E1109D68B30CE67D-001/control-001/cores/collection1/data/
[junit4] 2> 3108312 WARN (OldIndexDirectoryCleanupThreadForCore-collection1) [n:127.0.0.1:52467_ c:control_collection s:shard1 r:core_node1 x:collection1] o.a.s.c.DirectoryFactory /Users/jenkins/workspace/Lucene-Solr-master-MacOSX/solr/build/solr-core/test/J0/../../../../../../../../../Users/jenkins/workspace/Lucene-Solr-master-MacOSX/solr/build/solr-core/test/J0/temp/solr.handler.TestReqParamsAPI_E1109D68B30CE67D-001/control-001/cores/collection1/data/ does not point to a valid data directory; skipping clean-up of old index directories.
[junit4] 2> 3108315 INFO (coreLoadExecutor-8336-thread-1-processing-n:127.0.0.1:52467_) [n:127.0.0.1:52467_ c:control_collection s:shard1 r:core_node1 x:collection1] o.a.s.u.p.UpdateRequestProcessorChain creating updateRequestProcessorChain "nodistrib"
[junit4] 2> 3108316 INFO (coreLoadExecutor-8336-thread-1-processing-n:127.0.0.1:52467_) [n:127.0.0.1:52467_ c:control_collection s:shard1 r:core_node1 x:collection1] o.a.s.u.p.UpdateRequestProcessorChain creating updateRequestProcessorChain "dedupe"
[junit4] 2> 3108316 INFO (coreLoadExecutor-8336-thread-1-processing-n:127.0.0.1:52467_) [n:127.0.0.1:52467_ c:control_collection s:shard1 r:core_node1 x:collection1] o.a.s.u.p.UpdateRequestProcessorChain inserting DistributedUpdateProcessorFactory into updateRequestProcessorChain "dedupe"
[junit4] 2> 3108316 INFO (coreLoadExecutor-8336-thread-1-processing-n:127.0.0.1:52467_) [n:127.0.0.1:52467_ c:control_collection s:shard1 r:core_node1 x:collection1] o.a.s.u.p.UpdateRequestProcessorChain creating updateRequestProcessorChain "stored_sig"
[junit4] 2> 3108316 INFO (coreLoadExecutor-8336-thread-1-processing-n:127.0.0.1:52467_) [n:127.0.0.1:52467_ c:control_collection s:shard1 r:core_node1 x:collection1] o.a.s.u.p.UpdateRequestProcessorChain inserting DistributedUpdateProcessorFactory into updateRequestProcessorChain "stored_sig"
[junit4] 2> 3108316 INFO (coreLoadExecutor-8336-thread-1-processing-n:127.0.0.1:52467_) [n:127.0.0.1:52467_ c:control_collection s:shard1 r:core_node1 x:collection1] o.a.s.u.p.UpdateRequestProcessorChain creating updateRequestProcessorChain "distrib-dup-test-chain-explicit"
[junit4] 2> 3108316 INFO (coreLoadExecutor-8336-thread-1-processing-n:127.0.0.1:52467_) [n:127.0.0.1:52467_ c:control_collection s:shard1 r:core_node1 x:collection1] o.a.s.u.p.UpdateRequestProcessorChain creating updateRequestProcessorChain "distrib-dup-test-chain-implicit"
[junit4] 2> 3108316 INFO (coreLoadExecutor-8336-thread-1-processing-n:127.0.0.1:52467_) [n:127.0.0.1:52467_ c:control_collection s:shard1 r:core_node1 x:collection1] o.a.s.u.p.UpdateRequestProcessorChain inserting DistributedUpdateProcessorFactory into updateRequestProcessorChain "distrib-dup-test-chain-implicit"
[junit4] 2> 3108317 INFO (coreLoadExecutor-8336-thread-1-processing-n:127.0.0.1:52467_) [n:127.0.0.1:52467_ c:control_collection s:shard1 r:core_node1 x:collection1] o.a.s.c.SolrCore no updateRequestProcessorChain defined as default, creating implicit default
[junit4] 2> 3108317 WARN (coreLoadExecutor-8336-thread-1-processing-n:127.0.0.1:52467_) [n:127.0.0.1:52467_ c:control_collection s:shard1 r:core_node1 x:collection1] o.a.s.c.RequestHandlers INVALID paramSet a in requestHandler {type = requestHandler,name = /dump,class = DumpRequestHandler,args = {defaults={a=A,b=B}}}
[junit4] 2> 3108324 INFO (coreLoadExecutor-8336-thread-1-processing-n:127.0.0.1:52467_) [n:127.0.0.1:52467_ c:control_collection s:shard1 r:core_node1 x:collection1] o.a.s.h.l.XMLLoader xsltCacheLifetimeSeconds=60
[junit4] 2> 3108326 INFO (coreLoadExecutor-8336-thread-1-processing-n:127.0.0.1:52467_) [n:127.0.0.1:52467_ c:control_collection s:shard1 r:core_node1 x:collection1] o.a.s.h.l.XMLLoader xsltCacheLifetimeSeconds=60
[junit4] 2> 3108328 INFO (coreLoadExecutor-8336-thread-1-processing-n:127.0.0.1:52467_) [n:127.0.0.1:52467_ c:control_collection s:shard1 r:core_node1 x:collection1] o.a.s.h.l.XMLLoader xsltCacheLifetimeSeconds=60
[junit4] 2> 3108330 INFO (coreLoadExecutor-8336-thread-1-processing-n:127.0.0.1:52467_) [n:127.0.0.1:52467_ c:control_collection s:shard1 r:core_node1 x:collection1] o.a.s.h.l.XMLLoader xsltCacheLifetimeSeconds=60
[junit4] 2> 3108337 INFO (coreLoadExecutor-8336-thread-1-processing-n:127.0.0.1:52467_) [n:127.0.0.1:52467_ c:control_collection s:shard1 r:core_node1 x:collection1] o.a.s.c.RequestHandlers Registered paths: /admin/mbeans,standard,/update/json/docs,/admin/luke,/export,/get,/admin/properties,/update/json,/admin/threads,/dump,/update/csv,/sql,/graph,/admin/segments,/admin/system,/replication,/config,/stream,/schema,/admin/plugins,/admin/logging,/admin/ping,/update,/admin/file,/terms
[junit4] 2> 3108337 INFO (coreLoadExecutor-8336-thread-1-processing-n:127.0.0.1:52467_) [n:127.0.0.1:52467_ c:control_collection s:shard1 r:core_node1 x:collection1] o.a.s.c.SolrCore Using default statsCache cache: org.apache.solr.search.stats.LocalStatsCache
[junit4] 2> 3108339 INFO (coreLoadExecutor-8336-thread-1-processing-n:127.0.0.1:52467_) [n:127.0.0.1:52467_ c:control_collection s:shard1 r:core_node1 x:collection1] o.a.s.u.UpdateHandler Using UpdateLog implementation: org.apache.solr.update.UpdateLog
[junit4] 2> 3108339 INFO (coreLoadExecutor-8336-thread-1-processing-n:127.0.0.1:52467_) [n:127.0.0.1:52467_ c:control_collection s:shard1 r:core_node1 x:collection1] o.a.s.u.UpdateLog Initializing UpdateLog: dataDir= defaultSyncLevel=FLUSH numRecordsToKeep=100 maxNumLogsToKeep=10 numVersionBuckets=65536
[junit4] 2> 3108340 INFO (coreLoadExecutor-8336-thread-1-processing-n:127.0.0.1:52467_) [n:127.0.0.1:52467_ c:control_collection s:shard1 r:core_node1 x:collection1] o.a.s.u.CommitTracker Hard AutoCommit: disabled
[junit4] 2> 3108340 INFO (coreLoadExecutor-8336-thread-1-processing-n:127.0.0.1:52467_) [n:127.0.0.1:52467_ c:control_collection s:shard1 r:core_node1 x:collection1] o.a.s.u.CommitTracker Soft AutoCommit: disabled
[junit4] 2> 3108341 INFO (coreLoadExecutor-8336-thread-1-processing-n:127.0.0.1:52467_) [n:127.0.0.1:52467_ c:control_collection s:shard1 r:core_node1 x:collection1] o.a.s.u.RandomMergePolicy RandomMergePolicy wrapping class org.apache.lucene.index.TieredMergePolicy: [TieredMergePolicy: maxMergeAtOnce=37, maxMergeAtOnceExplicit=47, maxMergedSegmentMB=84.8603515625, floorSegmentMB=1.0166015625, forceMergeDeletesPctAllowed=1.0245527746262661, segmentsPerTier=11.0, maxCFSSegmentSizeMB=8.796093022207999E12, noCFSRatio=1.0
[junit4] 2> 3108341 INFO (coreLoadExecutor-8336-thread-1-processing-n:127.0.0.1:52467_) [n:127.0.0.1:52467_ c:control_collection s:shard1 r:core_node1 x:collection1] o.a.s.c.SolrDeletionPolicy SolrDeletionPolicy.onInit: commits: num=1
[junit4] 2> commit{dir=MockDirectoryWrapper(RAMDirectory@592fb746 lockFactory=org.apache.lucene.store.SingleInstanceLockFactory@3f390c2d),segFN=segments_1,generation=1}
[junit4] 2> 3108341 INFO (coreLoadExecutor-8336-thread-1-processing-n:127.0.0.1:52467_) [n:127.0.0.1:52467_ c:control_collection s:shard1 r:core_node1 x:collection1] o.a.s.c.SolrDeletionPolicy newest commit generation = 1
[junit4] 2> 3108341 INFO (coreLoadExecutor-8336-thread-1-processing-n:127.0.0.1:52467_) [n:127.0.0.1:52467_ c:control_collection s:shard1 r:core_node1 x:collection1] o.a.s.s.SolrIndexSearcher Opening [Searcher@213440e9[collection1] main]
[junit4] 2> 3108342 INFO (coreLoadExecutor-8336-thread-1-processing-n:127.0.0.1:52467_) [n:127.0.0.1:52467_ c:control_collection s:shard1 r:core_node1 x:collection1] o.a.s.c.c.ZkStateReader Load collection config from: [/collections/control_collection]
[junit4] 2> 3108344 INFO (coreLoadExecutor-8336-thread-1-processing-n:127.0.0.1:52467_) [n:127.0.0.1:52467_ c:control_collection s:shard1 r:core_node1 x:collection1] o.a.s.c.c.ZkStateReader path=[/collections/control_collection] [configName]=[conf1] specified config exists in ZooKeeper
[junit4] 2> 3108344 INFO (coreLoadExecutor-8336-thread-1-processing-n:127.0.0.1:52467_) [n:127.0.0.1:52467_ c:control_collection s:shard1 r:core_node1 x:collection1] o.a.s.r.ManagedResourceStorage Setting up ZooKeeper-based storage for the RestManager with znodeBase: /configs/conf1
[junit4] 2> 3108345 INFO (coreLoadExecutor-8336-thread-1-processing-n:127.0.0.1:52467_) [n:127.0.0.1:52467_ c:control_collection s:shard1 r:core_node1 x:collection1] o.a.s.r.ManagedResourceStorage Configured ZooKeeperStorageIO with znodeBase: /configs/conf1
[junit4] 2> 3108345 INFO (coreLoadExecutor-8336-thread-1-processing-n:127.0.0.1:52467_) [n:127.0.0.1:52467_ c:control_collection s:shard1 r:core_node1 x:collection1] o.a.s.r.RestManager Initializing RestManager with initArgs: {}
[junit4] 2> 3108345 INFO (coreLoadExecutor-8336-thread-1-processing-n:127.0.0.1:52467_) [n:127.0.0.1:52467_ c:control_collection s:shard1 r:core_node1 x:collection1] o.a.s.r.ManagedResourceStorage Reading _rest_managed.json using ZooKeeperStorageIO:path=/configs/conf1
[junit4] 2> 3108346 INFO (coreLoadExecutor-8336-thread-1-processing-n:127.0.0.1:52467_) [n:127.0.0.1:52467_ c:control_collection s:shard1 r:core_node1 x:collection1] o.a.s.r.ManagedResourceStorage No data found for znode /configs/conf1/_rest_managed.json
[junit4] 2> 3108346 INFO (coreLoadExecutor-8336-thread-1-processing-n:127.0.0.1:52467_) [n:127.0.0.1:52467_ c:control_collection s:shard1 r:core_node1 x:collection1] o.a.s.r.ManagedResourceStorage Loaded null at path _rest_managed.json using ZooKeeperStorageIO:path=/configs/conf1
[junit4] 2> 3108346 INFO (coreLoadExecutor-8336-thread-1-processing-n:127.0.0.1:52467_) [n:127.0.0.1:52467_ c:control_collection s:shard1 r:core_node1 x:collection1] o.a.s.r.RestManager Initializing 0 registered ManagedResources
[junit4] 2> 3108346 INFO (coreLoadExecutor-8336-thread-1-processing-n:127.0.0.1:52467_) [n:127.0.0.1:52467_ c:control_collection s:shard1 r:core_node1 x:collection1] o.a.s.h.ReplicationHandler Commits will be reserved for 10000
[junit4] 2> 3108348 INFO (searcherExecutor-8337-thread-1-processing-n:127.0.0.1:52467_ x:collection1 s:shard1 c:control_collection r:core_node1) [n:127.0.0.1:52467_ c:control_collection s:shard1 r:core_node1 x:collection1] o.a.s.c.SolrCore [collection1] Registered new searcher Searcher@213440e9[collection1] main{ExitableDirectoryReader(UninvertingDirectoryReader())}
[junit4] 2> 3108348 INFO (coreLoadExecutor-8336-thread-1-processing-n:127.0.0.1:52467_) [n:127.0.0.1:52467_ c:control_collection s:shard1 r:core_node1 x:collection1] o.a.s.u.UpdateLog Looking up max value of version field to seed version buckets
[junit4] 2> 3108348 INFO (coreLoadExecutor-8336-thread-1-processing-n:127.0.0.1:52467_) [n:127.0.0.1:52467_ c:control_collection s:shard1 r:core_node1 x:collection1] o.a.s.u.VersionInfo Refreshing highest value of _version_ for 65536 version buckets from index
[junit4] 2> 3108348 INFO (coreLoadExecutor-8336-thread-1-processing-n:127.0.0.1:52467_) [n:127.0.0.1:52467_ c:control_collection s:shard1 r:core_node1 x:collection1] o.a.s.u.VersionInfo No terms found for _version_, cannot seed version bucket highest value from index
[junit4] 2> 3108348 INFO (coreLoadExecutor-8336-thread-1-processing-n:127.0.0.1:52467_) [n:127.0.0.1:52467_ c:control_collection s:shard1 r:core_node1 x:collection1] o.a.s.u.UpdateLog Could not find max version in index or recent updates, using new clock 1541913871018622976
[junit4] 2> 3108350 INFO (coreLoadExecutor-8336-thread-1-processing-n:127.0.0.1:52467_) [n:127.0.0.1:52467_ c:control_collection s:shard1 r:core_node1 x:collection1] o.a.s.u.UpdateLog Took 1.0ms to seed version buckets with highest version 1541913871018622976
[junit4] 2> 3108350 INFO (coreLoadExecutor-8336-thread-1-processing-n:127.0.0.1:52467_) [n:127.0.0.1:52467_ c:control_collection s:shard1 r:core_node1 x:collection1] o.a.s.c.ZkController watch zkdir /configs/conf1
[junit4] 2> 3108351 INFO (coreLoadExecutor-8336-thread-1-processing-n:127.0.0.1:52467_) [n:127.0.0.1:52467_ c:control_collection s:shard1 r:core_node1 x:collection1] o.a.s.c.CoreContainer registering core: collection1
[junit4] 2> 3108352 INFO (coreZkRegister-8330-thread-1-processing-n:127.0.0.1:52467_ x:collection1 s:shard1 c:control_collection r:core_node1) [n:127.0.0.1:52467_ c:control_collection s:shard1 r:core_node1 x:collection1] o.a.s.c.ZkController Register replica - core:collection1 address:http://127.0.0.1:52467 collection:control_collection shard:shard1
[junit4] 2> 3108354 INFO (coreZkRegister-8330-thread-1-processing-n:127.0.0.1:52467_ x:collection1 s:shard1 c:control_collection r:core_node1) [n:127.0.0.1:52467_ c:control_collection s:shard1 r:core_node1 x:collection1] o.a.s.c.c.SolrZkClient makePath: /collections/control_collection/leader_elect/shard1/election
[junit4] 2> 3108362 INFO (coreZkRegister-8330-thread-1-processing-n:127.0.0.1:52467_ x:collection1 s:shard1 c:control_collection r:core_node1) [n:127.0.0.1:52467_ c:control_collection s:shard1 r:core_node1 x:collection1] o.a.s.c.LeaderElector Joined leadership election with path: /collections/control_collection/leader_elect/shard1/election/96369616741793796-core_node1-n_0000000000
[junit4] 2> 3108363 INFO (coreZkRegister-8330-thread-1-processing-n:127.0.0.1:52467_ x:collection1 s:shard1 c:control_collection r:core_node1) [n:127.0.0.1:52467_ c:control_collection s:shard1 r:core_node1 x:collection1] o.a.s.c.ShardLeaderElectionContext Running the leader process for shard=shard1 and weAreReplacement=false and leaderVoteWait=10000
[junit4] 2> 3108367 INFO (coreZkRegister-8330-thread-1-processing-n:127.0.0.1:52467_ x:collection1 s:shard1 c:control_collection r:core_node1) [n:127.0.0.1:52467_ c:control_collection s:shard1 r:core_node1 x:collection1] o.a.s.c.ShardLeaderElectionContext Enough replicas found to continue.
[junit4] 2> 3108367 INFO (coreZkRegister-8330-thread-1-processing-n:127.0.0.1:52467_ x:collection1 s:shard1 c:control_collection r:core_node1) [n:127.0.0.1:52467_ c:control_collection s:shard1 r:core_node1 x:collection1] o.a.s.c.ShardLeaderElectionContext I may be the new leader - try and sync
[junit4] 2> 3108367 INFO (coreZkRegister-8330-thread-1-processing-n:127.0.0.1:52467_ x:collection1 s:shard1 c:control_collection r:core_node1) [n:127.0.0.1:52467_ c:control_collection s:shard1 r:core_node1 x:collection1] o.a.s.c.SyncStrategy Sync replicas to http://127.0.0.1:52467/collection1/
[junit4] 2> 3108367 INFO (coreZkRegister-8330-thread-1-processing-n:127.0.0.1:52467_ x:collection1 s:shard1 c:control_collection r:core_node1) [n:127.0.0.1:52467_ c:control_collection s:shard1 r:core_node1 x:collection1] o.a.s.c.SyncStrategy Sync Success - now sync replicas to me
[junit4] 2> 3108367 INFO (coreZkRegister-8330-thread-1-processing-n:127.0.0.1:52467_ x:collection1 s:shard1 c:control_collection r:core_node1) [n:127.0.0.1:52467_ c:control_collection s:shard1 r:core_node1 x:collection1] o.a.s.c.SyncStrategy http://127.0.0.1:52467/collection1/ has no replicas
[junit4] 2> 3108375 INFO (OverseerStateUpdate-96369616741793796-127.0.0.1:52467_-n_0000000000) [n:127.0.0.1:52467_ ] o.a.s.c.Overseer processMessage: queueSize: 1, message = {
[junit4] 2> "operation":"leader",
[junit4] 2> "shard":"shard1",
[junit4] 2> "collection":"control_collection"} current state version: 1
[junit4] 2> 3108377 INFO (coreZkRegister-8330-thread-1-processing-n:127.0.0.1:52467_ x:collection1 s:shard1 c:control_collection r:core_node1) [n:127.0.0.1:52467_ c:control_collection s:shard1 r:core_node1 x:collection1] o.a.s.c.c.SolrZkClient makePath: /collections/control_collection/leaders/shard1
[junit4] 2> 3108400 INFO (coreZkRegister-8330-thread-1-processing-n:127.0.0.1:52467_ x:collection1 s:shard1 c:control_collection r:core_node1) [n:127.0.0.1:52467_ c:control_collection s:shard1 r:core_node1 x:collection1] o.a.s.c.ShardLeaderElectionContextBase Creating leader registration node /collections/control_collection/leaders/shard1/leader after winning as /collections/control_collection/leader_elect/shard1/election/96369616741793796-core_node1-n_0000000000
[junit4] 2> 3108406 INFO (coreZkRegister-8330-thread-1-processing-n:127.0.0.1:52467_ x:collection1 s:shard1 c:control_collection r:core_node1) [n:127.0.0.1:52467_ c:control_collection s:shard1 r:core_node1 x:collection1] o.a.s.c.ShardLeaderElectionContext I am the new leader: http://127.0.0.1:52467/collection1/ shard1
[junit4] 2> 3108421 INFO (OverseerStateUpdate-96369616741793796-127.0.0.1:52467_-n_0000000000) [n:127.0.0.1:52467_ ] o.a.s.c.Overseer processMessage: queueSize: 1, message = {
[junit4] 2> "operation":"leader",
[junit4] 2> "shard":"shard1",
[junit4] 2> "collection":"control_collection",
[junit4] 2> "base_url":"http://127.0.0.1:52467",
[junit4] 2> "core":"collection1",
[junit4] 2> "state":"active"} current state version: 1
[junit4] 2> 3108541 INFO (zkCallback-3287-thread-2-processing-n:127.0.0.1:52467_) [n:127.0.0.1:52467_ ] o.a.s.c.c.ZkStateReader A cluster state change: [WatchedEvent state:SyncConnected type:NodeDataChanged path:/clusterstate.json], has occurred - updating... (live nodes size: [1])
[junit4] 2> 3108574 INFO (coreZkRegister-8330-thread-1-processing-n:127.0.0.1:52467_ x:collection1 s:shard1 c:control_collection r:core_node1) [n:127.0.0.1:52467_ c:control_collection s:shard1 r:core_node1 x:collection1] o.a.s.c.ZkController We are http://127.0.0.1:52467/collection1/ and leader is http://127.0.0.1:52467/collection1/
[junit4] 2> 3108575 INFO (coreZkRegister-8330-thread-1-processing-n:127.0.0.1:52467_ x:collection1 s:shard1 c:control_collection r:core_node1) [n:127.0.0.1:52467_ c:control_collection s:shard1 r:core_node1 x:collection1] o.a.s.c.ZkController No LogReplay needed for core=collection1 baseURL=http://127.0.0.1:52467
[junit4] 2> 3108575 INFO (coreZkRegister-8330-thread-1-processing-n:127.0.0.1:52467_ x:collection1 s:shard1 c:control_collection r:core_node1) [n:127.0.0.1:52467_ c:control_collection s:shard1 r:core_node1 x:collection1] o.a.s.c.ZkController I am the leader, no recovery necessary
[junit4] 2> 3108575 INFO (coreZkRegister-8330-thread-1-processing-n:127.0.0.1:52467_ x:collection1 s:shard1 c:control_collection r:core_node1) [n:127.0.0.1:52467_ c:control_collection s:shard1 r:core_node1 x:collection1] o.a.s.c.ZkController publishing state=active
[junit4] 2> 3108575 INFO (coreZkRegister-8330-thread-1-processing-n:127.0.0.1:52467_ x:collection1 s:shard1 c:control_collection r:core_node1) [n:127.0.0.1:52467_ c:control_collection s:shard1 r:core_node1 x:collection1] o.a.s.c.ZkController numShards not found on descriptor - reading it from system property
[junit4] 2> 3108582 INFO (coreZkRegister-8330-thread-1-processing-n:127.0.0.1:52467_ x:collection1 s:shard1 c:control_collection r:core_node1) [n:127.0.0.1:52467_ c:control_collection s:shard1 r:core_node1 x:collection1] o.a.s.c.c.ZkStateReader Checking legacy cluster state for collection control_collection
[junit4] 2> 3108585 INFO (OverseerStateUpdate-96369616741793796-127.0.0.1:52467_-n_0000000000) [n:127.0.0.1:52467_ ] o.a.s.c.Overseer processMessage: queueSize: 1, message = {
[junit4] 2> "core":"collection1",
[junit4] 2> "core_node_name":"core_node1",
[junit4] 2> "roles":null,
[junit4] 2> "base_url":"http://127.0.0.1:52467",
[junit4] 2> "node_name":"127.0.0.1:52467_",
[junit4] 2> "numShards":"1",
[junit4] 2> "state":"active",
[junit4] 2> "shard":"shard1",
[junit4] 2> "collection":"control_collection",
[junit4] 2> "operation":"state"} current state version: 2
[junit4] 2> 3108585 INFO (OverseerStateUpdate-96369616741793796-127.0.0.1:52467_-n_0000000000) [n:127.0.0.1:52467_ ] o.a.s.c.o.ReplicaMutator Update state numShards=1 message={
[junit4] 2> "core":"collection1",
[junit4] 2> "core_node_name":"core_node1",
[junit4] 2> "roles":null,
[junit4] 2> "base_url":"http://127.0.0.1:52467",
[junit4] 2> "node_name":"127.0.0.1:52467_",
[junit4] 2> "numShards":"1",
[junit4] 2> "state":"active",
[junit4] 2> "shard":"shard1",
[junit4] 2> "collection":"control_collection",
[junit4] 2> "operation":"state"}
[junit4] 2> 3108596 INFO (TEST-TestReqParamsAPI.test-seed#[E1109D68B30CE67D]) [ ] o.a.s.c.c.SolrZkClient Using default ZkCredentialsProvider
[junit4] 2> 3108597 INFO (TEST-TestReqParamsAPI.test-seed#[E1109D68B30CE67D]) [ ] o.a.s.c.c.ConnectionManager Waiting for client to connect to ZooKeeper
[junit4] 2> 3108601 INFO (zkCallback-3291-thread-1) [ ] o.a.s.c.c.ConnectionManager Watcher org.apache.solr.common.cloud.ConnectionManager@3f545528 name:ZooKeeperConnection Watcher:127.0.0.1:52462/solr got event WatchedEvent state:SyncConnected type:None path:null path:null type:None
[junit4] 2> 3108601 INFO (TEST-TestReqParamsAPI.test-seed#[E1109D68B30CE67D]) [ ] o.a.s.c.c.ConnectionManager Client is connected to ZooKeeper
[junit4] 2> 3108602 INFO (TEST-TestReqParamsAPI.test-seed#[E1109D68B30CE67D]) [ ] o.a.s.c.c.SolrZkClient Using default ZkACLProvider
[junit4] 2> 3108602 INFO (TEST-TestReqParamsAPI.test-seed#[E1109D68B30CE67D]) [ ] o.a.s.c.c.ZkStateReader Updating cluster state from ZooKeeper...
[junit4] 2> 3108605 INFO (TEST-TestReqParamsAPI.test-seed#[E1109D68B30CE67D]) [ ] o.a.s.c.c.ZkStateReader Loaded empty cluster properties
[junit4] 2> 3108609 INFO (TEST-TestReqParamsAPI.test-seed#[E1109D68B30CE67D]) [ ] o.a.s.c.c.ZkStateReader Updated live nodes from ZooKeeper... (0) -> (1)
[junit4] 2> 3108614 INFO (TEST-TestReqParamsAPI.test-seed#[E1109D68B30CE67D]) [ ] o.a.s.c.ChaosMonkey monkey: init - expire sessions:false cause connection loss:false
[junit4] 2> 3108713 INFO (zkCallback-3291-thread-1) [ ] o.a.s.c.c.ZkStateReader A cluster state change: [WatchedEvent state:SyncConnected type:NodeDataChanged path:/clusterstate.json], has occurred - updating... (live nodes size: [1])
[junit4] 2> 3108713 INFO (zkCallback-3287-thread-3-processing-n:127.0.0.1:52467_) [n:127.0.0.1:52467_ ] o.a.s.c.c.ZkStateReader A cluster state change: [WatchedEvent state:SyncConnected type:NodeDataChanged path:/clusterstate.json], has occurred - updating... (live nodes size: [1])
[junit4] 2> 3108995 INFO (TEST-TestReqParamsAPI.test-seed#[E1109D68B30CE67D]) [ ] o.a.s.SolrTestCaseJ4 Writing core.properties file to /Users/jenkins/workspace/Lucene-Solr-master-MacOSX/solr/build/solr-core/test/J0/temp/solr.handler.TestReqParamsAPI_E1109D68B30CE67D-001/shard-1-001/cores/collection1
[junit4] 2> 3108996 INFO (TEST-TestReqParamsAPI.test-seed#[E1109D68B30CE67D]) [ ] o.a.s.c.AbstractFullDistribZkTestBase create jetty 1 in directory /Users/jenkins/workspace/Lucene-Solr-master-MacOSX/solr/build/solr-core/test/J0/temp/solr.handler.TestReqParamsAPI_E1109D68B30CE67D-001/shard-1-001
[junit4] 2> 3108997 INFO (TEST-TestReqParamsAPI.test-seed#[E1109D68B30CE67D]) [ ] o.e.j.s.Server jetty-9.3.8.v20160314
[junit4] 2> 3108999 INFO (TEST-TestReqParamsAPI.test-seed#[E1109D68B30CE67D]) [ ] o.e.j.s.h.ContextHandler Started o.e.j.s.ServletContextHandler@390c3152{/,null,AVAILABLE}
[junit4] 2> 3109000 INFO (TEST-TestReqParamsAPI.test-seed#[E1109D68B30CE67D]) [ ] o.e.j.s.ServerConnector Started ServerConnector@3b315b7b{HTTP/1.1,[http/1.1]}{127.0.0.1:52474}
[junit4] 2> 3109000 INFO (TEST-TestReqParamsAPI.test-seed#[E1109D68B30CE67D]) [ ] o.e.j.s.Server Started @3115024ms
[junit4] 2> 3109000 INFO (TEST-TestReqParamsAPI.test-seed#[E1109D68B30CE67D]) [ ] o.a.s.c.s.e.JettySolrRunner Jetty properties: {solr.data.dir=/Users/jenkins/workspace/Lucene-Solr-master-MacOSX/solr/build/solr-core/test/J0/temp/solr.handler.TestReqParamsAPI_E1109D68B30CE67D-001/tempDir-001/jetty1, solrconfig=solrconfig.xml, hostContext=/, hostPort=52474, coreRootDirectory=/Users/jenkins/workspace/Lucene-Solr-master-MacOSX/solr/build/solr-core/test/J0/../../../../../../../../../Users/jenkins/workspace/Lucene-Solr-master-MacOSX/solr/build/solr-core/test/J0/temp/solr.handler.TestReqParamsAPI_E1109D68B30CE67D-001/shard-1-001/cores}
[junit4] 2> 3109002 INFO (TEST-TestReqParamsAPI.test-seed#[E1109D68B30CE67D]) [ ] o.a.s.s.SolrDispatchFilter SolrDispatchFilter.init(): sun.misc.Launcher$AppClassLoader@4554617c
[junit4] 2> 3109002 INFO (TEST-TestReqParamsAPI.test-seed#[E1109D68B30CE67D]) [ ] o.a.s.c.SolrResourceLoader new SolrResourceLoader for directory: '/Users/jenkins/workspace/Lucene-Solr-master-MacOSX/solr/build/solr-core/test/J0/temp/solr.handler.TestReqParamsAPI_E1109D68B30CE67D-001/shard-1-001'
[junit4] 2> 3109002 INFO (TEST-TestReqParamsAPI.test-seed#[E1109D68B30CE67D]) [ ] o.a.s.c.SolrResourceLoader JNDI not configured for solr (NoInitialContextEx)
[junit4] 2> 3109002 INFO (TEST-TestReqParamsAPI.test-seed#[E1109D68B30CE67D]) [ ] o.a.s.c.SolrResourceLoader solr home defaulted to 'solr/' (could not find system property or JNDI)
[junit4] 2> 3109003 INFO (TEST-TestReqParamsAPI.test-seed#[E1109D68B30CE67D]) [ ] o.a.s.c.c.SolrZkClient Using default ZkCredentialsProvider
[junit4] 2> 3109005 INFO (TEST-TestReqParamsAPI.test-seed#[E1109D68B30CE67D]) [ ] o.a.s.c.c.ConnectionManager Waiting for client to connect to ZooKeeper
[junit4] 2> 3109006 INFO (zkCallback-3292-thread-1) [ ] o.a.s.c.c.ConnectionManager Watcher org.apache.solr.common.cloud.ConnectionManager@4c9d3f08 name:ZooKeeperConnection Watcher:127.0.0.1:52462/solr got event WatchedEvent state:SyncConnected type:None path:null path:null type:None
[junit4] 2> 3109006 INFO (TEST-TestReqParamsAPI.test-seed#[E1109D68B30CE67D]) [ ] o.a.s.c.c.ConnectionManager Client is connected to ZooKeeper
[junit4] 2> 3109006 INFO (TEST-TestReqParamsAPI.test-seed#[E1109D68B30CE67D]) [ ] o.a.s.c.c.SolrZkClient Using default ZkACLProvider
[junit4] 2> 3109009 INFO (TEST-TestReqParamsAPI.test-seed#[E1109D68B30CE67D]) [ ] o.a.s.s.SolrDispatchFilter Loading solr.xml from SolrHome (not found in ZooKeeper)
[junit4] 2> 3109009 INFO (TEST-TestReqParamsAPI.test-seed#[E1109D68B30CE67D]) [ ] o.a.s.c.SolrXmlConfig Loading container configuration from /Users/jenkins/workspace/Lucene-Solr-master-MacOSX/solr/build/solr-core/test/J0/temp/solr.handler.TestReqParamsAPI_E1109D68B30CE67D-001/shard-1-001/solr.xml
[junit4] 2> 3109041 INFO (TEST-TestReqParamsAPI.test-seed#[E1109D68B30CE67D]) [ ] o.a.s.c.CorePropertiesLocator Config-defined core root directory: /Users/jenkins/workspace/Lucene-Solr-master-MacOSX/solr/build/solr-core/test/J0/../../../../../../../../../Users/jenkins/workspace/Lucene-Solr-master-MacOSX/solr/build/solr-core/test/J0/temp/solr.handler.TestReqParamsAPI_E1109D68B30CE67D-001/shard-1-001/cores
[junit4] 2> 3109041 INFO (TEST-TestReqParamsAPI.test-seed#[E1109D68B30CE67D]) [ ] o.a.s.c.CoreContainer New CoreContainer 517127420
[junit4] 2> 3109041 INFO (TEST-TestReqParamsAPI.test-seed#[E1109D68B30CE67D]) [ ] o.a.s.c.CoreContainer Loading cores into CoreContainer [instanceDir=/Users/jenkins/workspace/Lucene-Solr-master-MacOSX/solr/build/solr-core/test/J0/temp/solr.handler.TestReqParamsAPI_E1109D68B30CE67D-001/shard-1-001]
[junit4] 2> 3109041 WARN (TEST-TestReqParamsAPI.test-seed#[E1109D68B30CE67D]) [ ] o.a.s.c.CoreContainer Couldn't add files from /Users/jenkins/workspace/Lucene-Solr-master-MacOSX/solr/build/solr-core/test/J0/temp/solr.handler.TestReqParamsAPI_E1109D68B30CE67D-001/shard-1-001/lib to classpath: /Users/jenkins/workspace/Lucene-Solr-master-MacOSX/solr/build/solr-core/test/J0/temp/solr.handler.TestReqParamsAPI_E1109D68B30CE67D-001/shard-1-001/lib
[junit4] 2> 3109041 INFO (TEST-TestReqParamsAPI.test-seed#[E1109D68B30CE67D]) [ ] o.a.s.h.c.HttpShardHandlerFactory created with socketTimeout : 90000,urlScheme : ,connTimeout : 15000,maxConnectionsPerHost : 20,maxConnections : 10000,corePoolSize : 0,maximumPoolSize : 2147483647,maxThreadIdleTime : 5,sizeOfQueue : -1,fairnessPolicy : false,
[junit4] 2> 3109048 INFO (TEST-TestReqParamsAPI.test-seed#[E1109D68B30CE67D]) [ ] o.a.s.u.UpdateShardHandler Created UpdateShardHandler HTTP client with params: socketTimeout=340000&connTimeout=45000&maxConnections=100000&maxConnectionsPerHost=100000
[junit4] 2> 3109048 INFO (TEST-TestReqParamsAPI.test-seed#[E1109D68B30CE67D]) [ ] o.a.s.l.LogWatcher SLF4J impl is org.slf4j.impl.Log4jLoggerFactory
[junit4] 2> 3109048 INFO (TEST-TestReqParamsAPI.test-seed#[E1109D68B30CE67D]) [ ] o.a.s.l.LogWatcher Registering Log Listener [Log4j (org.slf4j.impl.Log4jLoggerFactory)]
[junit4] 2> 3109048 INFO (TEST-TestReqParamsAPI.test-seed#[E1109D68B30CE67D]) [ ] o.a.s.c.ZkContainer Zookeeper client=127.0.0.1:52462/solr
[junit4] 2> 3109048 INFO (TEST-TestReqParamsAPI.test-seed#[E1109D68B30CE67D]) [ ] o.a.s.c.ZkController zkHost includes chroot
[junit4] 2> 3109048 INFO (TEST-TestReqParamsAPI.test-seed#[E1109D68B30CE67D]) [ ] o.a.s.c.c.SolrZkClient Using default ZkCredentialsProvider
[junit4] 2> 3109048 INFO (TEST-TestReqParamsAPI.test-seed#[E1109D68B30CE67D]) [ ] o.a.s.c.c.ConnectionManager Waiting for client to connect to ZooKeeper
[junit4] 2> 3109050 INFO (zkCallback-3295-thread-1) [ ] o.a.s.c.c.ConnectionManager Watcher org.apache.solr.common.cloud.ConnectionManager@30751f40 name:ZooKeeperConnection Watcher:127.0.0.1:52462 got event WatchedEvent state:SyncConnected type:None path:null path:null type:None
[junit4] 2> 3109050 INFO (TEST-TestReqParamsAPI.test-seed#[E1109D68B30CE67D]) [ ] o.a.s.c.c.ConnectionManager Client is connected to ZooKeeper
[junit4] 2> 3109051 INFO (TEST-TestReqParamsAPI.test-seed#[E1109D68B30CE67D]) [ ] o.a.s.c.c.SolrZkClient Using default ZkACLProvider
[junit4] 2> 3109052 INFO (TEST-TestReqParamsAPI.test-seed#[E1109D68B30CE67D]) [n:127.0.0.1:52474_ ] o.a.s.c.ZkController Added new OnReconnect listener org.apache.solr.cloud.ZkController$$Lambda$10/150066919@60f47704
[junit4] 2> 3109053 INFO (TEST-TestReqParamsAPI.test-seed#[E1109D68B30CE67D]) [n:127.0.0.1:52474_ ] o.a.s.c.c.ConnectionManager Waiting for client to connect to ZooKeeper
[junit4] 2> 3109055 INFO (zkCallback-3296-thread-1-processing-n:127.0.0.1:52474_) [n:127.0.0.1:52474_ ] o.a.s.c.c.ConnectionManager Watcher org.apache.solr.common.cloud.ConnectionManager@f35a020 name:ZooKeeperConnection Watcher:127.0.0.1:52462/solr got event WatchedEvent state:SyncConnected type:None path:null path:null type:None
[junit4] 2> 3109055 INFO (TEST-TestReqParamsAPI.test-seed#[E1109D68B30CE67D]) [n:127.0.0.1:52474_ ] o.a.s.c.c.ConnectionManager Client is connected to ZooKeeper
[junit4] 2> 3109069 INFO (TEST-TestReqParamsAPI.test-seed#[E1109D68B30CE67D]) [n:127.0.0.1:52474_ ] o.a.s.c.c.ZkStateReader Updating cluster state from ZooKeeper...
[junit4] 2> 3109071 INFO (TEST-TestReqParamsAPI.test-seed#[E1109D68B30CE67D]) [n:127.0.0.1:52474_ ] o.a.s.c.c.ZkStateReader Loaded empty cluster properties
[junit4] 2> 3109073 INFO (TEST-TestReqParamsAPI.test-seed#[E1109D68B30CE67D]) [n:127.0.0.1:52474_ ] o.a.s.c.c.ZkStateReader Updated live nodes from ZooKeeper... (0) -> (1)
[junit4] 2> 3109080 INFO (TEST-TestReqParamsAPI.test-seed#[E1109D68B30CE67D]) [n:127.0.0.1:52474_ ] o.a.s.c.Overseer Overseer (id=null) closing
[junit4] 2> 3109081 INFO (TEST-TestReqParamsAPI.test-seed#[E1109D68B30CE67D]) [n:127.0.0.1:52474_ ] o.a.s.c.LeaderElector Joined leadership election with path: /overseer_elect/election/96369616741793800-127.0.0.1:52474_-n_0000000001
[junit4] 2> 3109083 INFO (TEST-TestReqParamsAPI.test-seed#[E1109D68B30CE67D]) [n:127.0.0.1:52474_ ] o.a.s.c.LeaderElector Watching path /overseer_elect/election/96369616741793796-127.0.0.1:52467_-n_0000000000 to know if I could be the leader
[junit4] 2> 3109084 INFO (TEST-TestReqParamsAPI.test-seed#[E1109D68B30CE67D]) [n:127.0.0.1:52474_ ] o.a.s.c.ZkController Publish node=127.0.0.1:52474_ as DOWN
[junit4] 2> 3109087 INFO (TEST-TestReqParamsAPI.test-seed#[E1109D68B30CE67D]) [n:127.0.0.1:52474_ ] o.a.s.c.ZkController Register node as live in ZooKeeper:/live_nodes/127.0.0.1:52474_
[junit4] 2> 3109087 INFO (TEST-TestReqParamsAPI.test-seed#[E1109D68B30CE67D]) [n:127.0.0.1:52474_ ] o.a.s.c.c.SolrZkClient makePath: /live_nodes/127.0.0.1:52474_
[junit4] 2> 3109088 INFO (OverseerStateUpdate-96369616741793796-127.0.0.1:52467_-n_0000000000) [n:127.0.0.1:52467_ ] o.a.s.c.Overseer processMessage: queueSize: 1, message = {
[junit4] 2> "operation":"downnode",
[junit4] 2> "node_name":"127.0.0.1:52474_"} current state version: 3
[junit4] 2> 3109088 INFO (OverseerStateUpdate-96369616741793796-127.0.0.1:52467_-n_0000000000) [n:127.0.0.1:52467_ ] o.a.s.c.o.NodeMutator DownNode state invoked for node: 127.0.0.1:52474_
[junit4] 2> 3109089 INFO (zkCallback-3287-thread-3-processing-n:127.0.0.1:52467_) [n:127.0.0.1:52467_ ] o.a.s.c.c.ZkStateReader A live node change: [WatchedEvent state:SyncConnected type:NodeChildrenChanged path:/live_nodes], has occurred - updating... (live nodes size: [1])
[junit4] 2> 3109089 INFO (zkCallback-3291-thread-1) [ ] o.a.s.c.c.ZkStateReader A live node change: [WatchedEvent state:SyncConnected type:NodeChildrenChanged path:/live_nodes], has occurred - updating... (live nodes size: [1])
[junit4] 2> 3109090 INFO (zkCallback-3287-thread-3-processing-n:127.0.0.1:52467_) [n:127.0.0.1:52467_ ] o.a.s.c.c.ZkStateReader Updated live nodes from ZooKeeper... (1) -> (2)
[junit4] 2> 3109090 INFO (zkCallback-3296-thread-1-processing-n:127.0.0.1:52474_) [n:127.0.0.1:52474_ ] o.a.s.c.c.ZkStateReader A live node change: [WatchedEvent state:SyncConnected type:NodeChildrenChanged path:/live_nodes], has occurred - updating... (live nodes size: [1])
[junit4] 2> 3109091 INFO (zkCallback-3291-thread-1) [ ] o.a.s.c.c.ZkStateReader Updated live nodes from ZooKeeper... (1) -> (2)
[junit4] 2> 3109093 INFO (zkCallback-3296-thread-1-processing-n:127.0.0.1:52474_) [n:127.0.0.1:52474_ ] o.a.s.c.c.ZkStateReader Updated live nodes from ZooKeeper... (1) -> (2)
[junit4] 2> 3109102 INFO (TEST-TestReqParamsAPI.test-seed#[E1109D68B30CE67D]) [n:127.0.0.1:52474_ ] o.a.s.c.CoreContainer Security conf doesn't exist. Skipping setup for authorization module.
[junit4] 2> 3109103 INFO (TEST-TestReqParamsAPI.test-seed#[E1109D68B30CE67D]) [n:127.0.0.1:52474_ ] o.a.s.c.CoreContainer No authentication plugin used.
[junit4] 2> 3109108 INFO (TEST-TestReqParamsAPI.test-seed#[E1109D68B30CE67D]) [n:127.0.0.1:52474_ ] o.a.s.c.CorePropertiesLocator Looking for core definitions underneath /Users/jenkins/workspace/Lucene-Solr-master-MacOSX/solr/build/solr-core/test/J0/../../../../../../../../../Users/jenkins/workspace/Lucene-Solr-master-MacOSX/solr/build/solr-core/test/J0/temp/solr.handler.TestReqParamsAPI_E1109D68B30CE67D-001/shard-1-001/cores
[junit4] 2> 3109110 INFO (TEST-TestReqParamsAPI.test-seed#[E1109D68B30CE67D]) [n:127.0.0.1:52474_ ] o.a.s.c.CoreDescriptor Created CoreDescriptor: {name=collection1, config=solrconfig.xml, transient=false, schema=schema.xml, loadOnStartup=true, configSetProperties=configsetprops.json, collection=collection1, coreNodeName=, dataDir=data/, shard=}
[junit4] 2> 3109111 INFO (TEST-TestReqParamsAPI.test-seed#[E1109D68B30CE67D]) [n:127.0.0.1:52474_ ] o.a.s.c.CorePropertiesLocator Found core collection1 in /Users/jenkins/workspace/Lucene-Solr-master-MacOSX/solr/build/solr-core/test/J0/../../../../../../../../../Users/jenkins/workspace/Lucene-Solr-master-MacOSX/solr/build/solr-core/test/J0/temp/solr.handler.TestReqParamsAPI_E1109D68B30CE67D-001/shard-1-001/cores/collection1
[junit4] 2> 3109111 INFO (TEST-TestReqParamsAPI.test-seed#[E1109D68B30CE67D]) [n:127.0.0.1:52474_ ] o.a.s.c.CorePropertiesLocator Found 1 core definitions
[junit4] 2> 3109112 INFO (coreLoadExecutor-8347-thread-1-processing-n:127.0.0.1:52474_) [n:127.0.0.1:52474_ c:collection1 x:collection1] o.a.s.c.ZkController publishing state=down
[junit4] 2> 3109112 INFO (TEST-TestReqParamsAPI.test-seed#[E1109D68B30CE67D]) [n:127.0.0.1:52474_ ] o.a.s.s.SolrDispatchFilter user.dir=/Users/jenkins/workspace/Lucene-Solr-master-MacOSX/solr/build/solr-core/test/J0
[junit4] 2> 3109112 INFO (TEST-TestReqParamsAPI.test-seed#[E1109D68B30CE67D]) [n:127.0.0.1:52474_ ] o.a.s.s.SolrDispatchFilter SolrDispatchFilter.init() done
[junit4] 2> 3109112 INFO (coreLoadExecutor-8347-thread-1-processing-n:127.0.0.1:52474_) [n:127.0.0.1:52474_ c:collection1 x:collection1] o.a.s.c.ZkController numShards not found on descriptor - reading it from system property
[junit4] 2> 3109114 INFO (coreLoadExecutor-8347-thread-1-processing-n:127.0.0.1:52474_) [n:127.0.0.1:52474_ c:collection1 x:collection1] o.a.s.c.ZkController Collection collection1 not visible yet, but flagging it so a watch is registered when it becomes visible
[junit4] 2> 3109115 INFO (OverseerStateUpdate-96369616741793796-127.0.0.1:52467_-n_0000000000) [n:127.0.0.1:52467_ ] o.a.s.c.Overseer processMessage: queueSize: 1, message = {
[junit4] 2> "core":"collection1",
[junit4] 2> "roles":null,
[junit4] 2> "base_url":"http://127.0.0.1:52474",
[junit4] 2> "node_name":"127.0.0.1:52474_",
[junit4] 2> "numShards":"2",
[junit4] 2> "state":"down",
[junit4] 2> "shard":null,
[junit4] 2> "collection":"collection1",
[junit4] 2> "operation":"state"} current state version: 3
[junit4] 2> 3109115 INFO (OverseerStateUpdate-96369616741793796-127.0.0.1:52467_-n_0000000000) [n:127.0.0.1:52467_ ] o.a.s.c.o.ReplicaMutator Update state numShards=2 message={
[junit4] 2> "core":"collection1",
[junit4] 2> "roles":null,
[junit4] 2> "base_url":"http://127.0.0.1:52474",
[junit4] 2> "node_name":"127.0.0.1:52474_",
[junit4] 2> "numShards":"2",
[junit4] 2> "state":"down",
[junit4] 2> "shard":null,
[junit4] 2> "collection":"collection1",
[junit4] 2> "operation":"state"}
[junit4] 2> 3109115 INFO (OverseerStateUpdate-96369616741793796-127.0.0.1:52467_-n_0000000000) [n:127.0.0.1:52467_ ] o.a.s.c.o.ClusterStateMutator building a new cName: collection1
[junit4] 2> 3109115 INFO (OverseerStateUpdate-96369616741793796-127.0.0.1:52467_-n_0000000000) [n:127.0.0.1:52467_ ] o.a.s.c.o.ReplicaMutator Assigning new node to shard shard=shard2
[junit4] 2> 3109120 INFO (coreLoadExecutor-8347-thread-1-processing-n:127.0.0.1:52474_) [n:127.0.0.1:52474_ c:collection1 x:collection1] o.a.s.c.c.ZkStateReader Deleting data for [collection1]
[junit4] 2> 3109121 INFO (coreLoadExecutor-8347-thread-1-processing-n:127.0.0.1:52474_) [n:127.0.0.1:52474_ c:collection1 x:collection1] o.a.s.c.ZkController look for our core node name
[junit4] 2> 3109225 INFO (zkCallback-3287-thread-3-processing-n:127.0.0.1:52467_) [n:127.0.0.1:52467_ ] o.a.s.c.c.ZkStateReader A cluster state change: [WatchedEvent state:SyncConnected type:NodeDataChanged path:/clusterstate.json], has occurred - updating... (live nodes size: [2])
[junit4] 2> 3109225 INFO (zkCallback-3296-thread-1-processing-n:127.0.0.1:52474_) [n:127.0.0.1:52474_ ] o.a.s.c.c.ZkStateReader A cluster state change: [WatchedEvent state:SyncConnected type:NodeDataChanged path:/clusterstate.json], has occurred - updating... (live nodes size: [2])
[junit4] 2> 3109225 INFO (zkCallback-3291-thread-1) [ ] o.a.s.c.c.ZkStateReader A cluster state change: [WatchedEvent state:SyncConnected type:NodeDataChanged path:/clusterstate.json], has occurred - updating... (live nodes size: [2])
[junit4] 2> 3110130 INFO (coreLoadExecutor-8347-thread-1-processing-n:127.0.0.1:52474_) [n:127.0.0.1:52474_ c:collection1 x:collection1] o.a.s.c.ZkController waiting to find shard id in clusterstate for collection1
[junit4] 2> 3110130 INFO (coreLoadExecutor-8347-thread-1-processing-n:127.0.0.1:52474_) [n:127.0.0.1:52474_ c:collection1 x:collection1] o.a.s.c.ZkController Check for collection zkNode:collection1
[junit4] 2> 3110131 INFO (coreLoadExecutor-8347-thread-1-processing-n:127.0.0.1:52474_) [n:127.0.0.1:52474_ c:collection1 x:collection1] o.a.s.c.ZkController Collection zkNode exists
[junit4] 2> 3110131 INFO (coreLoadExecutor-8347-thread-1-processing-n:127.0.0.1:52474_) [n:127.0.0.1:52474_ c:collection1 x:collection1] o.a.s.c.c.ZkStateReader Load collection config from: [/collections/collection1]
[junit4] 2> 3110133 INFO (coreLoadExecutor-8347-thread-1-processing-n:127.0.0.1:52474_) [n:127.0.0.1:52474_ c:collection1 x:collection1] o.a.s.c.c.ZkStateReader path=[/collections/collection1] [configName]=[conf1] specified config exists in ZooKeeper
[junit4] 2> 3110133 INFO (coreLoadExecutor-8347-thread-1-processing-n:127.0.0.1:52474_) [n:127.0.0.1:52474_ c:collection1 x:collection1] o.a.s.c.SolrResourceLoader new SolrResourceLoader for directory: '/Users/jenkins/workspace/Lucene-Solr-master-MacOSX/solr/build/solr-core/test/J0/temp/solr.handler.TestReqParamsAPI_E1109D68B30CE67D-001/shard-1-001/cores/collection1'
[junit4] 2> 3110133 INFO (coreLoadExecutor-8347-thread-1-processing-n:127
[...truncated too long message...]
0.1:54669_solr ] o.a.s.c.o.ZkStateWriter going to update_collection /collections/testcollection/state.json version: 13
[junit4] 2> 223045 INFO (zkCallback-674-thread-3-processing-n:127.0.0.1:54669_solr) [n:127.0.0.1:54669_solr ] o.a.s.c.c.ZkStateReader A live node change: [WatchedEvent state:SyncConnected type:NodeChildrenChanged path:/live_nodes], has occurred - updating... (live nodes size: [4])
[junit4] 2> 223045 INFO (zkCallback-710-thread-1-processing-n:127.0.0.1:54737_solr) [n:127.0.0.1:54737_solr ] o.a.s.c.c.ZkStateReader A live node change: [WatchedEvent state:SyncConnected type:NodeChildrenChanged path:/live_nodes], has occurred - updating... (live nodes size: [4])
[junit4] 2> 223045 WARN (zkCallback-710-thread-1-processing-n:127.0.0.1:54737_solr) [n:127.0.0.1:54737_solr ] o.a.s.c.c.ZkStateReader ZooKeeper watch triggered, but Solr cannot talk to ZK: [KeeperErrorCode = Session expired for /live_nodes]
[junit4] 2> 223047 INFO (zkCallback-704-thread-1-processing-n:127.0.0.1:54670_solr) [n:127.0.0.1:54670_solr ] o.a.s.c.c.ZkStateReader A live node change: [WatchedEvent state:SyncConnected type:NodeChildrenChanged path:/live_nodes], has occurred - updating... (live nodes size: [4])
[junit4] 2> 223048 INFO (jetty-launcher-656-thread-3) [ ] o.e.j.s.h.ContextHandler Stopped o.e.j.s.ServletContextHandler@7f8a47f0{/solr,null,UNAVAILABLE}
[junit4] 2> 223048 INFO (zkCallback-677-thread-2-processing-n:127.0.0.1:54668_solr) [n:127.0.0.1:54668_solr ] o.a.s.c.c.ZkStateReader A live node change: [WatchedEvent state:SyncConnected type:NodeChildrenChanged path:/live_nodes], has occurred - updating... (live nodes size: [4])
[junit4] 2> 223049 INFO (zkCallback-674-thread-3-processing-n:127.0.0.1:54669_solr) [n:127.0.0.1:54669_solr ] o.a.s.c.c.ZkStateReader Updated live nodes from ZooKeeper... (4) -> (1)
[junit4] 2> 223049 INFO (zkCallback-674-thread-1-processing-n:127.0.0.1:54669_solr) [n:127.0.0.1:54669_solr ] o.a.s.c.c.ZkStateReader A cluster state change: [WatchedEvent state:SyncConnected type:NodeDataChanged path:/collections/testcollection/state.json] for collection [testcollection] has occurred - updating... (live nodes size: [1])
[junit4] 2> 223049 INFO (zkCallback-677-thread-1-processing-n:127.0.0.1:54668_solr) [n:127.0.0.1:54668_solr ] o.a.s.c.c.ZkStateReader A cluster state change: [WatchedEvent state:SyncConnected type:NodeDataChanged path:/collections/testcollection/state.json] for collection [testcollection] has occurred - updating... (live nodes size: [4])
[junit4] 2> 223050 WARN (zkCallback-677-thread-1-processing-n:127.0.0.1:54668_solr) [n:127.0.0.1:54668_solr ] o.a.s.c.c.ZkStateReader ZooKeeper watch triggered, but Solr cannot talk to ZK: [KeeperErrorCode = Session expired for /collections/testcollection/state.json]
[junit4] 2> 223051 INFO (jetty-launcher-656-thread-4) [ ] o.a.s.c.Overseer Overseer (id=96369653214281737-127.0.0.1:54669_solr-n_0000000000) closing
[junit4] 2> 223051 INFO (OverseerStateUpdate-96369653214281737-127.0.0.1:54669_solr-n_0000000000) [n:127.0.0.1:54669_solr ] o.a.s.c.Overseer Overseer Loop exiting : 127.0.0.1:54669_solr
[junit4] 2> 223052 ERROR (TEST-TestCollectionStateWatchers.testWaitForStateWatcherIsRetainedOnPredicateFailure-seed#[881B9CDCC6E447B1]-EventThread) [n:127.0.0.1:54670_solr ] o.a.z.ClientCnxn Error while calling watcher
[junit4] 2> java.util.concurrent.RejectedExecutionException: Task org.apache.solr.common.util.ExecutorUtil$MDCAwareThreadPoolExecutor$$Lambda$30/850707251@7e13d7f7 rejected from org.apache.solr.common.util.ExecutorUtil$MDCAwareThreadPoolExecutor@3b115651[Shutting down, pool size = 1, active threads = 1, queued tasks = 0, completed tasks = 23]
[junit4] 2> at java.util.concurrent.ThreadPoolExecutor$AbortPolicy.rejectedExecution(ThreadPoolExecutor.java:2047)
[junit4] 2> at java.util.concurrent.ThreadPoolExecutor.reject(ThreadPoolExecutor.java:823)
[junit4] 2> at java.util.concurrent.ThreadPoolExecutor.execute(ThreadPoolExecutor.java:1369)
[junit4] 2> at org.apache.solr.common.util.ExecutorUtil$MDCAwareThreadPoolExecutor.execute(ExecutorUtil.java:214)
[junit4] 2> at java.util.concurrent.AbstractExecutorService.submit(AbstractExecutorService.java:112)
[junit4] 2> at org.apache.solr.common.cloud.SolrZkClient$3.process(SolrZkClient.java:266)
[junit4] 2> at org.apache.zookeeper.ClientCnxn$EventThread.processEvent(ClientCnxn.java:522)
[junit4] 2> at org.apache.zookeeper.ClientCnxn$EventThread.run(ClientCnxn.java:498)
[junit4] 2> 223053 INFO (zkCallback-674-thread-1-processing-n:127.0.0.1:54669_solr) [n:127.0.0.1:54669_solr ] o.a.s.c.c.ZkStateReader Updating data for [testcollection] from [13] to [14]
[junit4] 2> 223055 INFO (zkCallback-674-thread-1-processing-n:127.0.0.1:54669_solr) [n:127.0.0.1:54669_solr ] o.a.s.c.c.ZkStateReader A live node change: [WatchedEvent state:SyncConnected type:NodeChildrenChanged path:/live_nodes], has occurred - updating... (live nodes size: [1])
[junit4] 2> 223055 WARN (zkCallback-674-thread-1-processing-n:127.0.0.1:54669_solr) [n:127.0.0.1:54669_solr ] o.a.s.c.c.ZkStateReader ZooKeeper watch triggered, but Solr cannot talk to ZK: [KeeperErrorCode = Session expired for /live_nodes]
[junit4] 2> 223056 INFO (jetty-launcher-656-thread-4) [ ] o.e.j.s.h.ContextHandler Stopped o.e.j.s.ServletContextHandler@2b7059d4{/solr,null,UNAVAILABLE}
[junit4] 2> 224557 WARN (zkCallback-704-thread-1-processing-n:127.0.0.1:54670_solr) [n:127.0.0.1:54670_solr ] o.a.s.c.c.ZkStateReader ZooKeeper watch triggered, but Solr cannot talk to ZK: [KeeperErrorCode = Session expired for /live_nodes]
[junit4] 2> 224557 WARN (zkCallback-677-thread-2-processing-n:127.0.0.1:54668_solr) [n:127.0.0.1:54668_solr ] o.a.s.c.c.ZkStateReader ZooKeeper watch triggered, but Solr cannot talk to ZK: [KeeperErrorCode = Session expired for /live_nodes]
[junit4] 2> 224558 INFO (jetty-launcher-656-thread-1) [ ] o.e.j.s.h.ContextHandler Stopped o.e.j.s.ServletContextHandler@28e5049c{/solr,null,UNAVAILABLE}
[junit4] 2> 224558 INFO (jetty-launcher-656-thread-2) [ ] o.e.j.s.h.ContextHandler Stopped o.e.j.s.ServletContextHandler@66a7ea13{/solr,null,UNAVAILABLE}
[junit4] 2> 224561 INFO (SUITE-TestCollectionStateWatchers-seed#[881B9CDCC6E447B1]-worker) [ ] o.a.s.c.ZkTestServer connecting to 127.0.0.1:54662 54662
[junit4] 2> 224576 INFO (Thread-572) [ ] o.a.s.c.ZkTestServer connecting to 127.0.0.1:54662 54662
[junit4] 2> 227722 WARN (Thread-572) [ ] o.a.s.c.ZkTestServer Watch limit violations:
[junit4] 2> Maximum concurrent create/delete watches above limit:
[junit4] 2>
[junit4] 2> 8 /solr/aliases.json
[junit4] 2> 8 /solr/clusterprops.json
[junit4] 2> 7 /solr/security.json
[junit4] 2> 7 /solr/configs/config
[junit4] 2>
[junit4] 2> Maximum concurrent data watches above limit:
[junit4] 2>
[junit4] 2> 17 /solr/collections/falsepredicate/state.json
[junit4] 2> 12 /solr/collections/waitforstate/state.json
[junit4] 2> 8 /solr/clusterstate.json
[junit4] 2> 6 /solr/collections/testcollection/state.json
[junit4] 2> 3 /solr/overseer_elect/election/96369653214281740-127.0.0.1:54668_solr-n_0000000001
[junit4] 2> 3 /solr/collections/currentstate/state.json
[junit4] 2> 2 /solr/collections/delayed/state.json
[junit4] 2> 2 /solr/collections/tobedeleted/state.json
[junit4] 2> 2 /solr/overseer_elect/election/96369653214281739-127.0.0.1:54670_solr-n_0000000002
[junit4] 2>
[junit4] 2> Maximum concurrent children watches above limit:
[junit4] 2>
[junit4] 2> 62 /solr/overseer/queue
[junit4] 2> 17 /solr/overseer/queue-work
[junit4] 2> 13 /solr/overseer/collection-queue-work
[junit4] 2> 8 /solr/collections
[junit4] 2> 5 /solr/live_nodes
[junit4] 2>
[junit4] 2> 227722 INFO (SUITE-TestCollectionStateWatchers-seed#[881B9CDCC6E447B1]-worker) [ ] o.a.s.SolrTestCaseJ4 ###deleteCore
[junit4] 2> NOTE: leaving temporary files on disk at: /Users/jenkins/workspace/Lucene-Solr-master-MacOSX/solr/build/solr-solrj/test/J1/temp/solr.common.cloud.TestCollectionStateWatchers_881B9CDCC6E447B1-001
[junit4] 2> NOTE: test params are: codec=Asserting(Lucene62): {}, docValues:{}, maxPointsInLeafNode=1666, maxMBSortInHeap=5.881533392150542, sim=ClassicSimilarity, locale=es-MX, timezone=Africa/Bujumbura
[junit4] 2> NOTE: Mac OS X 10.11.6 x86_64/Oracle Corporation 1.8.0_102 (64-bit)/cpus=3,threads=1,free=158106544,total=260046848
[junit4] 2> NOTE: All tests run in this JVM: [ClientUtilsTest, BasicHttpSolrClientTest, SolrParamTest, TestSuggesterResponse, ContentStreamTest, TestConfigSetAdminRequest, LargeVolumeJettyTest, LargeVolumeEmbeddedTest, TestZkConfigManager, FacetFieldTest, GetByIdTest, TestCloudSolrClientConnections, CommonParamsTest, TestClusteringResponse, SolrZkClientTest, LargeVolumeBinaryJettyTest, GraphTest, SolrPingTest, MergeIndexesEmbeddedTest, StreamExpressionToExplanationTest, SolrExampleStreamingBinaryTest, SolrExampleBinaryTest, SolrExampleXMLTest, SolrExampleJettyTest, TestBatchUpdate, TestEmbeddedSolrServer, QueryResponseTest, TestCoreAdmin, DocumentAnalysisResponseTest, SolrExceptionTest, AnlysisResponseBaseTest, TestSolrJErrorHandling, CloudSolrClientBuilderTest, CloudSolrClientMultiConstructorTest, ConcurrentUpdateSolrClientBuilderTest, HttpSolrClientBuilderTest, LBHttpSolrClientBuilderTest, GraphExpressionTest, JdbcDriverTest, JdbcTest, StreamExpressionToExpessionTest, StreamingTest, StreamExpressionParserTest, ConcatOperationTest, OperationsTest, SchemaTest, TestCollectionAdminRequest, NoOpResponseParserTest, TestCollectionStateWatchers]
[junit4] Completed [85/85 (1!)] on J1 in 36.30s, 9 tests, 1 failure <<< FAILURES!
[...truncated 59430 lines...]