You are viewing a plain text version of this content. The canonical link for it is here.
Posted to builds@beam.apache.org by Apache Jenkins Server <je...@builds.apache.org> on 2022/09/20 18:12:35 UTC

Build failed in Jenkins: beam_PostCommit_XVR_Samza #1692

See <https://ci-beam.apache.org/job/beam_PostCommit_XVR_Samza/1692/display/redirect>

Changes:


------------------------------------------
[...truncated 988.36 KB...]
        urn: "beam:coders:javasdk:0.1"
        payload: "\202SNAPPY\000\000\000\000\001\000\000\000\001\000\000\001.\307\003\360@\254\355\000\005sr\000&org.apache.beam.sdk.coders.SnappyCoder1\033\243\356\177\362\366,\002\000\001L\000\ninner\005\030 t\000\"Lorg/a\005B\000/\001B\020/sdk/\tB\000/\005$\020;xr\000*ng\000 tructured\005/8s\277\022\016\325\3246\021\002\000\000xr\000 j9\000\005/\034C\335\325\211\256\274~\370\001/\020psr\000,j1\000,Serializable\005= \010\364 \216\305ynl\002\001\327\\\004typet\000\021Ljava/lang/Class\001\300n'\001\024Custom\005PPj\260\010\235\013;\035\013\002\000\000xq\000~\000\003vr\000$N\221\000\\io.BoundedSource!`v\023\177\370QA\0019\010r\000\035Z3\000\t,0\020\213\372\020Y\214\347\323\002\000\000xp"
      >
    >
  >
  coders: <
    key: "UjEnWsBUUHTimestampedValueCoder"
    value: <
      spec: <
        urn: "beam:coders:javasdk:0.1"
        payload: "\202SNAPPY\000\000\000\000\001\000\000\000\001\000\000\001?\315\003\270\254\355\000\005sr\000Aorg.apache.beam.sdk.values.TimestampedV\001\022\000$>\021\000LCoder\364\376\202p\274iX-\002\000\001L\000\nv\001)\005\030\034t\000\"Lorg/\t]\000/\001],/sdk/coders/\005$\020;xr\000*N\202\000\t%(.Structured\005/8s\277\022\016\325\3246\021\002\000\000xr\000 j9\000\005/\034C\335\325\211\256\274~\370\001/\020psr\000,j1\000(Serializabl\t\277\034\010\364 \216\305ynl\005\327\\\004typet\000\021Ljava/lang/Class\001\300\000&jV\000\024Custom\005\215Pj\260\010\235\013;\035\013\002\000\000xq\000~\000\003vr\000;N;\000Pio.BoundedReadFromUnb\t\021`Source$Shardd\236\240U\205\000j\363\002\000\000xp"
      >
    >
  >
  coders: <
    key: "UjEnWsBUUHValueWithRecordIdCoder"
    value: <
      spec: <
        urn: "beam:coders:javasdk:0.1"
        payload: "\202SNAPPY\000\000\000\000\001\000\000\000\001\000\000\001\213\311\005\320\254\355\000\005sr\000Corg.apache.beam.sdk.values.ValueWithRecordId$B\022\000LCoder{\343\376bQ\014\204>\002\000\002L\000\007i\t\025\034t\000+Lorg/\t\\\000/\001\\\024/sdk/c\0012(s/ByteArray\005B\014;L\000\n\005u\005\016\010t\000\"n;\000\005$\020;xr\000*N\274\000\t`(.Structured\005/8s\277\022\016\325\3246\021\002\000\000xr\000 j9\000\005/\034C\335\325\211\256\274~\370\001/\020psr\000)j1\0006\312\000\034\351\277\005|\263\3746\333\001:\010r\000&j8\000\024Atomic\005o\034\307\354\265\314\205tPF\0015 q\000~\000\003sr\000-N;\000$io.kafka.K\001\006\000R%\227\005B<I\320\251Y\032\341{#\002\000\001L\000\007kv\005\025\010t\000$nH\001\000K\t&\000;\025s\000\"Ns\000-P\r- j\000\275\271\035\243\3126\002!\353\010\010ke)\277\001\264\000\0022\303\001\005\022\025Y\000(jY\000\030Nullabl)\372\034E\333\0336>\220\247\007\005\307]\022.O\000\001\014,\006sq\000~\000\016q\000~\000\020"
      >
    >
  >
  coders: <
    key: "UjEnWsBUUHVarIntCoder"
    value: <
      spec: <
        urn: "beam:coders:javasdk:0.1"
        payload: "\202SNAPPY\000\000\000\000\001\000\000\000\001\000\000\000\210\330\001\350\254\355\000\005sr\000&org.apache.beam.sdk.coders.VarIntCoder\300K2\332\251KVh\002\000\000xrr5\000\024Atomic\0055 \307\354\265\314\205tPF\002\0055\000*jj\000$Structured\0059\034s\277\022\016\325\3246\021\t9\000 j9\000\005/0C\335\325\211\256\274~\370\002\000\000xp"
      >
    >
  >
  coders: <
    key: "UjEnWsBUUHVoidCoder"
    value: <
      spec: <
        urn: "beam:coders:javasdk:0.1"
        payload: "\202SNAPPY\000\000\000\000\001\000\000\000\001\000\000\000\210\326\001\350\254\355\000\005sr\000$org.apache.beam.sdk.coders.VoidCoder\271\277U\233\350\r\257U\002\000\000xr\000&j3\000\024Atomic\0055 \307\354\265\314\205tPF\002\0055\000*j5\000$Structured\0059\034s\277\022\016\325\3246\021\t9\000 j9\000\005/0C\335\325\211\256\274~\370\002\000\000xp"
      >
    >
  >
  coders: <
    key: "c0"
    value: <
      spec: <
        urn: "beam:coder:bytes:v1"
      >
    >
  >
  coders: <
    key: "c1"
    value: <
      spec: <
        urn: "beam:coder:global_window:v1"
      >
    >
  >
  coders: <
    key: "c2"
    value: <
      spec: <
        urn: "beam:go:coder:custom:v1"
        payload: "Cgd2YXJpbnR6EgIIAhpdCklnaXRodWIuY29tL2FwYWNoZS9iZWFtL3Nka3MvdjIvZ28vcGtnL2JlYW0vY29yZS9ydW50aW1lL2NvZGVyeC5lbmNWYXJJbnRaEhAIFiIECBlADyoGCBQSAggIImkKSWdpdGh1Yi5jb20vYXBhY2hlL2JlYW0vc2Rrcy92Mi9nby9wa2cvYmVhbS9jb3JlL3J1bnRpbWUvY29kZXJ4LmRlY1ZhckludFoSHAgWIgQIGUADIgYIFBICCAgqBAgZQA8qBAgZQAE="
      >
    >
  >
  coders: <
    key: "c3"
    value: <
      spec: <
        urn: "beam:coder:length_prefix:v1"
      >
      component_coder_ids: "c2"
    >
  >
  coders: <
    key: "c4"
    value: <
      spec: <
        urn: "beam:coder:kv:v1"
      >
      component_coder_ids: "c0"
      component_coder_ids: "c0"
    >
  >
  environments: <
    key: "UjEnWsBUUHbeam:env:docker:v1"
    value: <
      urn: "beam:env:docker:v1"
      payload: "\n apache/beam_java8_sdk:2.43.0.dev"
      capabilities: "beam:coder:bytes:v1"
      capabilities: "beam:coder:bool:v1"
      capabilities: "beam:coder:varint:v1"
      capabilities: "beam:coder:string_utf8:v1"
      capabilities: "beam:coder:iterable:v1"
      capabilities: "beam:coder:timer:v1"
      capabilities: "beam:coder:kv:v1"
      capabilities: "beam:coder:length_prefix:v1"
      capabilities: "beam:coder:global_window:v1"
      capabilities: "beam:coder:interval_window:v1"
      capabilities: "beam:coder:custom_window:v1"
      capabilities: "beam:coder:windowed_value:v1"
      capabilities: "beam:coder:double:v1"
      capabilities: "beam:coder:row:v1"
      capabilities: "beam:coder:param_windowed_value:v1"
      capabilities: "beam:coder:state_backed_iterable:v1"
      capabilities: "beam:coder:sharded_key:v1"
      capabilities: "beam:coder:nullable:v1"
      capabilities: "beam:protocol:multi_core_bundle_processing:v1"
      capabilities: "beam:protocol:progress_reporting:v1"
      capabilities: "beam:protocol:harness_monitoring_infos:v1"
      capabilities: "beam:protocol:control_request_elements_embedding:v1"
      capabilities: "beam:protocol:state_caching:v1"
      capabilities: "beam:version:sdk_base:apache/beam_java8_sdk:2.43.0.dev"
      capabilities: "beam:transform:sdf_truncate_sized_restrictions:v1"
      capabilities: "beam:transform:to_string:v1"
      dependencies: <
        type_urn: "beam:artifact:type:file:v1"
        type_payload: "\nL/tmp/artifacts/icedtea-sound-CGRxIE9edPHnbxQhM-L5mp8h21H-ySB79uQtSquPV_Q.jar\022@086471204f5e74f1e76f142133e2f99a9f21db51fec9207bf6e42d4aab8f57f4"
        role_urn: "beam:artifact:role:staging_to:v1"
        role_payload: "\n=icedtea-sound-CGRxIE9edPHnbxQhM-L5mp8h21H-ySB79uQtSquPV_Q.jar"
      >
      dependencies: <
        type_urn: "beam:artifact:type:file:v1"
        type_payload: "\nF/tmp/artifacts/jaccess-FBI0Bb27lF3oEBieWAi7SP8X1zBR8k4BJQOVpsoK9a0.jar\022@14123405bdbb945de810189e5808bb48ff17d73051f24e01250395a6ca0af5ad"
        role_urn: "beam:artifact:role:staging_to:v1"
        role_payload: "\n7jaccess-FBI0Bb27lF3oEBieWAi7SP8X1zBR8k4BJQOVpsoK9a0.jar"
      >
      dependencies: <
        type_urn: "beam:artifact:type:file:v1"
        type_payload: "\nI/tmp/artifacts/localedata-kJ2mc8rBH5-IklhfR1XzNotlIQ_mnVMA-pgaXv2r8Ag.jar\022@909da673cac11f9f8892585f4755f3368b65210fe69d5300fa981a5efdabf008"
        role_urn: "beam:artifact:role:staging_to:v1"
        role_payload: "\n:localedata-kJ2mc8rBH5-IklhfR1XzNotlIQ_mnVMA-pgaXv2r8Ag.jar"
      >
      dependencies: <
        type_urn: "beam:artifact:type:file:v1"
        type_payload: "\nF/tmp/artifacts/nashorn-B0CAb3QpJET_6VsT3hcC_89VtvhV616H8N2bHAIaqWo.jar\022@0740806f74292444ffe95b13de1702ffcf55b6f855eb5e87f0dd9b1c021aa96a"
        role_urn: "beam:artifact:role:staging_to:v1"
        role_payload: "\n7nashorn-B0CAb3QpJET_6VsT3hcC_89VtvhV616H8N2bHAIaqWo.jar"
      >
      dependencies: <
        type_urn: "beam:artifact:type:file:v1"
        type_payload: "\nG/tmp/artifacts/cldrdata-gclqV9lOGqQOKesG-a6TAUTGEYlyIDqpyd4M_k7gtWo.jar\022@81c96a57d94e1aa40e29eb06f9ae930144c6118972203aa9c9de0cfe4ee0b56a"
        role_urn: "beam:artifact:role:staging_to:v1"
        role_payload: "\n8cldrdata-gclqV9lOGqQOKesG-a6TAUTGEYlyIDqpyd4M_k7gtWo.jar"
      >
      dependencies: <
        type_urn: "beam:artifact:type:file:v1"
        type_payload: "\nD/tmp/artifacts/dnsns-byzoQxdXengTvA5IlbH9gSIzfhNQElRYltuMJN0vjcc.jar\022@6f2ce84317577a7813bc0e4895b1fd8122337e135012545896db8c24dd2f8dc7"
        role_urn: "beam:artifact:role:staging_to:v1"
        role_payload: "\n5dnsns-byzoQxdXengTvA5IlbH9gSIzfhNQElRYltuMJN0vjcc.jar"
      >
      dependencies: <
        type_urn: "beam:artifact:type:file:v1"
        type_payload: "\nr/tmp/artifacts/beam-sdks-java-io-expansion-service-2.43.0-SNAPSHOT-wafbc-s8NjC9GYh1S6flL_8n1jlalnrUP6fvu6JgEuM.jar\022@c1a7db73eb3c3630bd1988754ba7e52fff27d6395a967ad43fa7efbba26012e3"
        role_urn: "beam:artifact:role:staging_to:v1"
        role_payload: "\ncbeam-sdks-java-io-expansion-service-2.43.0-SNAPSHOT-wafbc-s8NjC9GYh1S6flL_8n1jlalnrUP6fvu6JgEuM.jar"
      >
    >
  >
  environments: <
    key: "go"
    value: <
      urn: "beam:env:docker:v1"
      payload: "\n\026apache/beam_go_sdk:dev"
      capabilities: "beam:protocol:progress_reporting:v1"
      capabilities: "beam:protocol:multi_core_bundle_processing:v1"
      capabilities: "beam:transform:sdf_truncate_sized_restrictions:v1"
      capabilities: "beam:protocol:worker_status:v1"
      capabilities: "beam:protocol:monitoring_info_short_ids:v1"
      capabilities: "beam:version:sdk_base:go"
      capabilities: "beam:coder:bytes:v1"
      capabilities: "beam:coder:bool:v1"
      capabilities: "beam:coder:varint:v1"
      capabilities: "beam:coder:double:v1"
      capabilities: "beam:coder:string_utf8:v1"
      capabilities: "beam:coder:length_prefix:v1"
      capabilities: "beam:coder:kv:v1"
      capabilities: "beam:coder:iterable:v1"
      capabilities: "beam:coder:state_backed_iterable:v1"
      capabilities: "beam:coder:windowed_value:v1"
      capabilities: "beam:coder:global_window:v1"
      capabilities: "beam:coder:interval_window:v1"
      capabilities: "beam:coder:row:v1"
      capabilities: "beam:coder:nullable:v1"
      dependencies: <
        type_urn: "beam:artifact:type:file:v1"
        role_urn: "beam:artifact:role:go_worker_binary:v1"
      >
    >
  >
>
root_transform_ids: "e4"
root_transform_ids: "s1"
root_transform_ids: "e5"
root_transform_ids: "s3"
requirements: "beam:requirement:pardo:splittable_dofn:v1"
2022/09/20 17:57:23 Cross-compiling <https://ci-beam.apache.org/job/beam_PostCommit_XVR_Samza/ws/src/sdks/go/test/integration/io/xlang/kafka/kafka_test.go> as /tmp/worker-2-1663696643654958243
2022/09/20 17:57:25 Prepared job with id: go-testkafkaio_basicreadwrite-476_497ab0b0-fbf2-4dc4-8918-a828b17763fe and staging token: go-testkafkaio_basicreadwrite-476_497ab0b0-fbf2-4dc4-8918-a828b17763fe
2022/09/20 17:57:25 Staged binary artifact with token: 
2022/09/20 17:57:25 Submitted job: go0testkafkaio0basicreadwrite0476-jenkins-0920175725-3a3cf993_89c2c2b5-5daf-49cf-b4d1-cf0a74445e17
2022/09/20 17:57:25 Job state: STOPPED
2022/09/20 17:57:25 Job state: STARTING
2022/09/20 17:57:25 Job state: RUNNING
2022/09/20 17:57:35 Job state: DONE
--- PASS: TestKafkaIO_BasicReadWrite (28.24s)
PASS
ok  	github.com/apache/beam/sdks/v2/go/test/integration/io/xlang/kafka	34.275s
FAIL

> Task :runners:samza:job-server:validatesCrossLanguageRunnerGoUsingJava FAILED
> Task :runners:samza:job-server:validatesCrossLanguageRunnerJavaUsingPython
> Task :runners:samza:job-server:validatesCrossLanguageRunnerPythonUsingJava
> Task :runners:samza:job-server:validatesCrossLanguageRunnerPythonUsingSql
> Task :runners:samza:job-server:samzaJobServerCleanup
> Task :runners:samza:job-server:validatesCrossLanguageRunnerCleanup

FAILURE: Build failed with an exception.

* Where:
Build file '<https://ci-beam.apache.org/job/beam_PostCommit_XVR_Samza/ws/src/sdks/go/test/build.gradle'> line: 195

* What went wrong:
Execution failed for task ':runners:samza:job-server:validatesCrossLanguageRunnerGoUsingJava'.
> Process 'command 'sh'' finished with non-zero exit value 1

* Try:
> Run with --stacktrace option to get the stack trace.
> Run with --info or --debug option to get more log output.

* Get more help at https://help.gradle.org

Deprecated Gradle features were used in this build, making it incompatible with Gradle 8.0.

You can use '--warning-mode all' to show the individual deprecation warnings and determine if they come from your own scripts or plugins.

See https://docs.gradle.org/7.5.1/userguide/command_line_interface.html#sec:command_line_warnings

Execution optimizations have been disabled for 1 invalid unit(s) of work during this build to ensure correctness.
Please consult deprecation warnings for more details.

BUILD FAILED in 30m 6s
260 actionable tasks: 171 executed, 77 from cache, 12 up-to-date

Publishing build scan...
https://gradle.com/s/miy4e4n5ry2iw

Build step 'Invoke Gradle script' changed build result to FAILURE
Build step 'Invoke Gradle script' marked build as failure

---------------------------------------------------------------------
To unsubscribe, e-mail: builds-unsubscribe@beam.apache.org
For additional commands, e-mail: builds-help@beam.apache.org


Jenkins build is back to normal : beam_PostCommit_XVR_Samza #1701

Posted by Apache Jenkins Server <je...@builds.apache.org>.
See <https://ci-beam.apache.org/job/beam_PostCommit_XVR_Samza/1701/display/redirect?page=changes>


---------------------------------------------------------------------
To unsubscribe, e-mail: builds-unsubscribe@beam.apache.org
For additional commands, e-mail: builds-help@beam.apache.org


Build failed in Jenkins: beam_PostCommit_XVR_Samza #1700

Posted by Apache Jenkins Server <je...@builds.apache.org>.
See <https://ci-beam.apache.org/job/beam_PostCommit_XVR_Samza/1700/display/redirect?page=changes>

Changes:

[Steve Niemitz] use avro DataFileReader to read avro container files


------------------------------------------
[...truncated 1.48 MB...]
INFO     apache_beam.utils.subprocess_server:subprocess_server.py:126 Sep 22, 2022 6:11:24 PM org.apache.beam.sdk.expansion.service.ExpansionService$ExternalTransformRegistrarLoader payloadToConfig
INFO     apache_beam.utils.subprocess_server:subprocess_server.py:126 WARNING: Configuration class 'org.apache.beam.sdk.extensions.sql.expansion.ExternalSqlTransformRegistrar$Configuration' has no schema registered. Attempting to construct with setter approach.
INFO     apache_beam.utils.subprocess_server:subprocess_server.py:126 Sep 22, 2022 6:11:24 PM org.apache.beam.sdk.expansion.service.ExpansionService$ExternalTransformRegistrarLoader payloadToConfig
INFO     apache_beam.utils.subprocess_server:subprocess_server.py:126 WARNING: Configuration class 'org.apache.beam.sdk.extensions.sql.expansion.ExternalSqlTransformRegistrar$Configuration' has no schema registered. Attempting to construct with setter approach.
INFO     apache_beam.utils.subprocess_server:subprocess_server.py:126 Sep 22, 2022 6:11:26 PM org.apache.beam.sdk.extensions.sql.impl.CalciteQueryPlanner convertToBeamRel
INFO     apache_beam.utils.subprocess_server:subprocess_server.py:126 INFO: SQL:
INFO     apache_beam.utils.subprocess_server:subprocess_server.py:126 SELECT `PCOLLECTION`.`a` * `PCOLLECTION`.`a` AS `s`, `LENGTH`(`PCOLLECTION`.`b`) AS `c`
INFO     apache_beam.utils.subprocess_server:subprocess_server.py:126 FROM `beam`.`PCOLLECTION` AS `PCOLLECTION`
INFO     apache_beam.utils.subprocess_server:subprocess_server.py:126 Sep 22, 2022 6:11:26 PM org.apache.beam.sdk.extensions.sql.impl.CalciteQueryPlanner convertToBeamRel
INFO     apache_beam.utils.subprocess_server:subprocess_server.py:126 INFO: SQLPlan>
INFO     apache_beam.utils.subprocess_server:subprocess_server.py:126 LogicalProject(s=[*($0, $0)], c=[LENGTH($1)])
INFO     apache_beam.utils.subprocess_server:subprocess_server.py:126   BeamIOSourceRel(table=[[beam, PCOLLECTION]])
INFO     apache_beam.utils.subprocess_server:subprocess_server.py:126 
INFO     apache_beam.utils.subprocess_server:subprocess_server.py:126 Sep 22, 2022 6:11:27 PM org.apache.beam.sdk.extensions.sql.impl.CalciteQueryPlanner convertToBeamRel
INFO     apache_beam.utils.subprocess_server:subprocess_server.py:126 INFO: BEAMPlan>
INFO     apache_beam.utils.subprocess_server:subprocess_server.py:126 BeamCalcRel(expr#0..1=[{inputs}], expr#2=[*($t0, $t0)], expr#3=[LENGTH($t1)], s=[$t2], c=[$t3])
INFO     apache_beam.utils.subprocess_server:subprocess_server.py:126   BeamIOSourceRel(table=[[beam, PCOLLECTION]])
INFO     apache_beam.utils.subprocess_server:subprocess_server.py:126 
INFO     root:environments.py:376 Default Python SDK image for environment is apache/beam_python3.7_sdk:2.43.0.dev
INFO     root:environments.py:299 No image given, using default Python SDK image
INFO     root:environments.py:376 Default Python SDK image for environment is apache/beam_python3.7_sdk:2.43.0.dev
INFO     root:environments.py:304 Python SDK container image set to "apache/beam_python3.7_sdk:2.43.0.dev" for Docker environment
INFO     apache_beam.runners.portability.fn_api_runner.translations:translations.py:714 ==================== <function pack_combiners at 0x7fee7d08d710> ====================
INFO     apache_beam.runners.portability.fn_api_runner.translations:translations.py:714 ==================== <function lift_combiners at 0x7fee7d08d7a0> ====================
INFO     apache_beam.runners.portability.fn_api_runner.translations:translations.py:714 ==================== <function sort_stages at 0x7fee7d08def0> ====================
INFO     apache_beam.runners.portability.portable_runner:portable_runner.py:583 Job state changed to STOPPED
INFO     apache_beam.runners.portability.portable_runner:portable_runner.py:583 Job state changed to STARTING
INFO     apache_beam.runners.portability.portable_runner:portable_runner.py:583 Job state changed to RUNNING
INFO     apache_beam.runners.portability.portable_runner:portable_runner.py:583 Job state changed to DONE
PASSED                                                                   [ 66%]
apache_beam/transforms/sql_test.py::SqlTransformTest::test_tagged_join 
-------------------------------- live log call ---------------------------------
INFO     apache_beam.utils.subprocess_server:subprocess_server.py:239 Using pre-built snapshot at <https://ci-beam.apache.org/job/beam_PostCommit_XVR_Samza/ws/src/sdks/java/extensions/sql/expansion-service/build/libs/beam-sdks-java-extensions-sql-expansion-service-2.43.0-SNAPSHOT.jar>
INFO     root:external.py:773 Starting a JAR-based expansion service from JAR <https://ci-beam.apache.org/job/beam_PostCommit_XVR_Samza/ws/src/sdks/java/extensions/sql/expansion-service/build/libs/beam-sdks-java-extensions-sql-expansion-service-2.43.0-SNAPSHOT.jar> 
INFO     apache_beam.utils.subprocess_server:subprocess_server.py:116 Starting service with ['java' '-jar' '<https://ci-beam.apache.org/job/beam_PostCommit_XVR_Samza/ws/src/sdks/java/extensions/sql/expansion-service/build/libs/beam-sdks-java-extensions-sql-expansion-service-2.43.0-SNAPSHOT.jar'> '50711' '--filesToStage=<https://ci-beam.apache.org/job/beam_PostCommit_XVR_Samza/ws/src/sdks/java/extensions/sql/expansion-service/build/libs/beam-sdks-java-extensions-sql-expansion-service-2.43.0-SNAPSHOT.jar']>
INFO     apache_beam.utils.subprocess_server:subprocess_server.py:126 Starting expansion service at localhost:50711
INFO     apache_beam.utils.subprocess_server:subprocess_server.py:126 Sep 22, 2022 6:11:49 PM org.apache.beam.sdk.expansion.service.ExpansionService loadRegisteredTransforms
INFO     apache_beam.utils.subprocess_server:subprocess_server.py:126 INFO: Registering external transforms: [beam:external:java:sql:v1, beam:transform:org.apache.beam:pubsub_read:v1, beam:transform:org.apache.beam:pubsub_write:v1, beam:transform:org.apache.beam:pubsublite_write:v1, beam:transform:org.apache.beam:pubsublite_read:v1, beam:transform:org.apache.beam:spanner_insert:v1, beam:transform:org.apache.beam:spanner_update:v1, beam:transform:org.apache.beam:spanner_replace:v1, beam:transform:org.apache.beam:spanner_insert_or_update:v1, beam:transform:org.apache.beam:spanner_delete:v1, beam:transform:org.apache.beam:spanner_read:v1, beam:transform:org.apache.beam:kafka_read_with_metadata:v1, beam:transform:org.apache.beam:kafka_read_without_metadata:v1, beam:transform:org.apache.beam:kafka_write:v1, beam:external:java:generate_sequence:v1]
INFO     apache_beam.utils.subprocess_server:subprocess_server.py:126 	beam:external:java:sql:v1: org.apache.beam.sdk.expansion.service.ExpansionService$ExternalTransformRegistrarLoader$1@47eaca72
INFO     apache_beam.utils.subprocess_server:subprocess_server.py:126 	beam:transform:org.apache.beam:pubsub_read:v1: org.apache.beam.sdk.expansion.service.ExpansionService$ExternalTransformRegistrarLoader$1@55141def
INFO     apache_beam.utils.subprocess_server:subprocess_server.py:126 	beam:transform:org.apache.beam:pubsub_write:v1: org.apache.beam.sdk.expansion.service.ExpansionService$ExternalTransformRegistrarLoader$1@55182842
INFO     apache_beam.utils.subprocess_server:subprocess_server.py:126 	beam:transform:org.apache.beam:pubsublite_write:v1: org.apache.beam.sdk.expansion.service.ExpansionService$ExternalTransformRegistrarLoader$1@3270d194
INFO     apache_beam.utils.subprocess_server:subprocess_server.py:126 	beam:transform:org.apache.beam:pubsublite_read:v1: org.apache.beam.sdk.expansion.service.ExpansionService$ExternalTransformRegistrarLoader$1@235834f2
INFO     apache_beam.utils.subprocess_server:subprocess_server.py:126 	beam:transform:org.apache.beam:spanner_insert:v1: org.apache.beam.sdk.expansion.service.ExpansionService$ExternalTransformRegistrarLoader$1@5656be13
INFO     apache_beam.utils.subprocess_server:subprocess_server.py:126 	beam:transform:org.apache.beam:spanner_update:v1: org.apache.beam.sdk.expansion.service.ExpansionService$ExternalTransformRegistrarLoader$1@4218d6a3
INFO     apache_beam.utils.subprocess_server:subprocess_server.py:126 	beam:transform:org.apache.beam:spanner_replace:v1: org.apache.beam.sdk.expansion.service.ExpansionService$ExternalTransformRegistrarLoader$1@76505305
INFO     apache_beam.utils.subprocess_server:subprocess_server.py:126 	beam:transform:org.apache.beam:spanner_insert_or_update:v1: org.apache.beam.sdk.expansion.service.ExpansionService$ExternalTransformRegistrarLoader$1@14cd1699
INFO     apache_beam.utils.subprocess_server:subprocess_server.py:126 	beam:transform:org.apache.beam:spanner_delete:v1: org.apache.beam.sdk.expansion.service.ExpansionService$ExternalTransformRegistrarLoader$1@77888435
INFO     apache_beam.utils.subprocess_server:subprocess_server.py:126 	beam:transform:org.apache.beam:spanner_read:v1: org.apache.beam.sdk.expansion.service.ExpansionService$ExternalTransformRegistrarLoader$1@73a1e9a9
INFO     apache_beam.utils.subprocess_server:subprocess_server.py:126 	beam:transform:org.apache.beam:kafka_read_with_metadata:v1: org.apache.beam.sdk.expansion.service.ExpansionService$ExternalTransformRegistrarLoader$1@71d44a3
INFO     apache_beam.utils.subprocess_server:subprocess_server.py:126 	beam:transform:org.apache.beam:kafka_read_without_metadata:v1: org.apache.beam.sdk.expansion.service.ExpansionService$ExternalTransformRegistrarLoader$1@7b98f307
INFO     apache_beam.utils.subprocess_server:subprocess_server.py:126 	beam:transform:org.apache.beam:kafka_write:v1: org.apache.beam.sdk.expansion.service.ExpansionService$ExternalTransformRegistrarLoader$1@4802796d
INFO     apache_beam.utils.subprocess_server:subprocess_server.py:126 	beam:external:java:generate_sequence:v1: org.apache.beam.sdk.expansion.service.ExpansionService$ExternalTransformRegistrarLoader$1@34123d65
INFO     apache_beam.utils.subprocess_server:subprocess_server.py:126 Sep 22, 2022 6:11:50 PM org.apache.beam.sdk.expansion.service.ExpansionService expand
INFO     apache_beam.utils.subprocess_server:subprocess_server.py:126 INFO: Expanding 'SqlTransform(beam:external:java:sql:v1)' with URN 'beam:external:java:sql:v1'
INFO     apache_beam.utils.subprocess_server:subprocess_server.py:126 Sep 22, 2022 6:11:50 PM org.apache.beam.sdk.expansion.service.ExpansionService$ExternalTransformRegistrarLoader payloadToConfig
INFO     apache_beam.utils.subprocess_server:subprocess_server.py:126 WARNING: Configuration class 'org.apache.beam.sdk.extensions.sql.expansion.ExternalSqlTransformRegistrar$Configuration' has no schema registered. Attempting to construct with setter approach.
INFO     apache_beam.utils.subprocess_server:subprocess_server.py:126 Sep 22, 2022 6:11:50 PM org.apache.beam.sdk.expansion.service.ExpansionService$ExternalTransformRegistrarLoader payloadToConfig
INFO     apache_beam.utils.subprocess_server:subprocess_server.py:126 WARNING: Configuration class 'org.apache.beam.sdk.extensions.sql.expansion.ExternalSqlTransformRegistrar$Configuration' has no schema registered. Attempting to construct with setter approach.
INFO     apache_beam.utils.subprocess_server:subprocess_server.py:126 Sep 22, 2022 6:11:52 PM org.apache.beam.sdk.extensions.sql.impl.CalciteQueryPlanner convertToBeamRel
INFO     apache_beam.utils.subprocess_server:subprocess_server.py:126 INFO: SQL:
INFO     apache_beam.utils.subprocess_server:subprocess_server.py:126 SELECT `simple`.`id` AS `id`, `enrich`.`metadata` AS `metadata`
INFO     apache_beam.utils.subprocess_server:subprocess_server.py:126 FROM `beam`.`simple` AS `simple`
INFO     apache_beam.utils.subprocess_server:subprocess_server.py:126 INNER JOIN `beam`.`enrich` AS `enrich` ON `simple`.`id` = `enrich`.`id`
INFO     apache_beam.utils.subprocess_server:subprocess_server.py:126 Sep 22, 2022 6:11:52 PM org.apache.beam.sdk.extensions.sql.impl.CalciteQueryPlanner convertToBeamRel
INFO     apache_beam.utils.subprocess_server:subprocess_server.py:126 INFO: SQLPlan>
INFO     apache_beam.utils.subprocess_server:subprocess_server.py:126 LogicalProject(id=[$0], metadata=[$4])
INFO     apache_beam.utils.subprocess_server:subprocess_server.py:126   LogicalJoin(condition=[=($0, $3)], joinType=[inner])
INFO     apache_beam.utils.subprocess_server:subprocess_server.py:126     BeamIOSourceRel(table=[[beam, simple]])
INFO     apache_beam.utils.subprocess_server:subprocess_server.py:126     BeamIOSourceRel(table=[[beam, enrich]])
INFO     apache_beam.utils.subprocess_server:subprocess_server.py:126 
INFO     apache_beam.utils.subprocess_server:subprocess_server.py:126 Sep 22, 2022 6:11:52 PM org.apache.beam.sdk.extensions.sql.impl.CalciteQueryPlanner convertToBeamRel
INFO     apache_beam.utils.subprocess_server:subprocess_server.py:126 INFO: BEAMPlan>
INFO     apache_beam.utils.subprocess_server:subprocess_server.py:126 BeamCalcRel(expr#0..4=[{inputs}], id=[$t0], metadata=[$t4])
INFO     apache_beam.utils.subprocess_server:subprocess_server.py:126   BeamCoGBKJoinRel(condition=[=($0, $3)], joinType=[inner])
INFO     apache_beam.utils.subprocess_server:subprocess_server.py:126     BeamIOSourceRel(table=[[beam, simple]])
INFO     apache_beam.utils.subprocess_server:subprocess_server.py:126     BeamIOSourceRel(table=[[beam, enrich]])
INFO     apache_beam.utils.subprocess_server:subprocess_server.py:126 
INFO     root:environments.py:376 Default Python SDK image for environment is apache/beam_python3.7_sdk:2.43.0.dev
INFO     root:environments.py:299 No image given, using default Python SDK image
INFO     root:environments.py:376 Default Python SDK image for environment is apache/beam_python3.7_sdk:2.43.0.dev
INFO     root:environments.py:304 Python SDK container image set to "apache/beam_python3.7_sdk:2.43.0.dev" for Docker environment
INFO     apache_beam.runners.portability.fn_api_runner.translations:translations.py:714 ==================== <function pack_combiners at 0x7fee7d08d710> ====================
INFO     apache_beam.runners.portability.fn_api_runner.translations:translations.py:714 ==================== <function lift_combiners at 0x7fee7d08d7a0> ====================
INFO     apache_beam.runners.portability.fn_api_runner.translations:translations.py:714 ==================== <function sort_stages at 0x7fee7d08def0> ====================
INFO     apache_beam.runners.portability.portable_runner:portable_runner.py:583 Job state changed to STOPPED
INFO     apache_beam.runners.portability.portable_runner:portable_runner.py:583 Job state changed to STARTING
INFO     apache_beam.runners.portability.portable_runner:portable_runner.py:583 Job state changed to RUNNING
INFO     apache_beam.runners.portability.portable_runner:portable_runner.py:583 Job state changed to DONE
PASSED                                                                   [ 77%]
apache_beam/transforms/sql_test.py::SqlTransformTest::test_windowing_before_sql 
-------------------------------- live log call ---------------------------------
INFO     apache_beam.utils.subprocess_server:subprocess_server.py:239 Using pre-built snapshot at <https://ci-beam.apache.org/job/beam_PostCommit_XVR_Samza/ws/src/sdks/java/extensions/sql/expansion-service/build/libs/beam-sdks-java-extensions-sql-expansion-service-2.43.0-SNAPSHOT.jar>
INFO     root:external.py:773 Starting a JAR-based expansion service from JAR <https://ci-beam.apache.org/job/beam_PostCommit_XVR_Samza/ws/src/sdks/java/extensions/sql/expansion-service/build/libs/beam-sdks-java-extensions-sql-expansion-service-2.43.0-SNAPSHOT.jar> 
INFO     apache_beam.utils.subprocess_server:subprocess_server.py:116 Starting service with ['java' '-jar' '<https://ci-beam.apache.org/job/beam_PostCommit_XVR_Samza/ws/src/sdks/java/extensions/sql/expansion-service/build/libs/beam-sdks-java-extensions-sql-expansion-service-2.43.0-SNAPSHOT.jar'> '55379' '--filesToStage=<https://ci-beam.apache.org/job/beam_PostCommit_XVR_Samza/ws/src/sdks/java/extensions/sql/expansion-service/build/libs/beam-sdks-java-extensions-sql-expansion-service-2.43.0-SNAPSHOT.jar']>
INFO     apache_beam.utils.subprocess_server:subprocess_server.py:126 Starting expansion service at localhost:55379
INFO     apache_beam.utils.subprocess_server:subprocess_server.py:126 Sep 22, 2022 6:12:15 PM org.apache.beam.sdk.expansion.service.ExpansionService loadRegisteredTransforms
INFO     apache_beam.utils.subprocess_server:subprocess_server.py:126 INFO: Registering external transforms: [beam:external:java:sql:v1, beam:transform:org.apache.beam:pubsub_read:v1, beam:transform:org.apache.beam:pubsub_write:v1, beam:transform:org.apache.beam:pubsublite_write:v1, beam:transform:org.apache.beam:pubsublite_read:v1, beam:transform:org.apache.beam:spanner_insert:v1, beam:transform:org.apache.beam:spanner_update:v1, beam:transform:org.apache.beam:spanner_replace:v1, beam:transform:org.apache.beam:spanner_insert_or_update:v1, beam:transform:org.apache.beam:spanner_delete:v1, beam:transform:org.apache.beam:spanner_read:v1, beam:transform:org.apache.beam:kafka_read_with_metadata:v1, beam:transform:org.apache.beam:kafka_read_without_metadata:v1, beam:transform:org.apache.beam:kafka_write:v1, beam:external:java:generate_sequence:v1]
INFO     apache_beam.utils.subprocess_server:subprocess_server.py:126 	beam:external:java:sql:v1: org.apache.beam.sdk.expansion.service.ExpansionService$ExternalTransformRegistrarLoader$1@47eaca72
INFO     apache_beam.utils.subprocess_server:subprocess_server.py:126 	beam:transform:org.apache.beam:pubsub_read:v1: org.apache.beam.sdk.expansion.service.ExpansionService$ExternalTransformRegistrarLoader$1@55141def
INFO     apache_beam.utils.subprocess_server:subprocess_server.py:126 	beam:transform:org.apache.beam:pubsub_write:v1: org.apache.beam.sdk.expansion.service.ExpansionService$ExternalTransformRegistrarLoader$1@55182842
INFO     apache_beam.utils.subprocess_server:subprocess_server.py:126 	beam:transform:org.apache.beam:pubsublite_write:v1: org.apache.beam.sdk.expansion.service.ExpansionService$ExternalTransformRegistrarLoader$1@3270d194
INFO     apache_beam.utils.subprocess_server:subprocess_server.py:126 	beam:transform:org.apache.beam:pubsublite_read:v1: org.apache.beam.sdk.expansion.service.ExpansionService$ExternalTransformRegistrarLoader$1@235834f2
INFO     apache_beam.utils.subprocess_server:subprocess_server.py:126 	beam:transform:org.apache.beam:spanner_insert:v1: org.apache.beam.sdk.expansion.service.ExpansionService$ExternalTransformRegistrarLoader$1@5656be13
INFO     apache_beam.utils.subprocess_server:subprocess_server.py:126 	beam:transform:org.apache.beam:spanner_update:v1: org.apache.beam.sdk.expansion.service.ExpansionService$ExternalTransformRegistrarLoader$1@4218d6a3
INFO     apache_beam.utils.subprocess_server:subprocess_server.py:126 	beam:transform:org.apache.beam:spanner_replace:v1: org.apache.beam.sdk.expansion.service.ExpansionService$ExternalTransformRegistrarLoader$1@76505305
INFO     apache_beam.utils.subprocess_server:subprocess_server.py:126 	beam:transform:org.apache.beam:spanner_insert_or_update:v1: org.apache.beam.sdk.expansion.service.ExpansionService$ExternalTransformRegistrarLoader$1@14cd1699
INFO     apache_beam.utils.subprocess_server:subprocess_server.py:126 	beam:transform:org.apache.beam:spanner_delete:v1: org.apache.beam.sdk.expansion.service.ExpansionService$ExternalTransformRegistrarLoader$1@77888435
INFO     apache_beam.utils.subprocess_server:subprocess_server.py:126 	beam:transform:org.apache.beam:spanner_read:v1: org.apache.beam.sdk.expansion.service.ExpansionService$ExternalTransformRegistrarLoader$1@73a1e9a9
INFO     apache_beam.utils.subprocess_server:subprocess_server.py:126 	beam:transform:org.apache.beam:kafka_read_with_metadata:v1: org.apache.beam.sdk.expansion.service.ExpansionService$ExternalTransformRegistrarLoader$1@71d44a3
INFO     apache_beam.utils.subprocess_server:subprocess_server.py:126 	beam:transform:org.apache.beam:kafka_read_without_metadata:v1: org.apache.beam.sdk.expansion.service.ExpansionService$ExternalTransformRegistrarLoader$1@7b98f307
INFO     apache_beam.utils.subprocess_server:subprocess_server.py:126 	beam:transform:org.apache.beam:kafka_write:v1: org.apache.beam.sdk.expansion.service.ExpansionService$ExternalTransformRegistrarLoader$1@4802796d
INFO     apache_beam.utils.subprocess_server:subprocess_server.py:126 	beam:external:java:generate_sequence:v1: org.apache.beam.sdk.expansion.service.ExpansionService$ExternalTransformRegistrarLoader$1@34123d65
INFO     apache_beam.utils.subprocess_server:subprocess_server.py:126 Sep 22, 2022 6:12:16 PM org.apache.beam.sdk.expansion.service.ExpansionService expand
INFO     apache_beam.utils.subprocess_server:subprocess_server.py:126 INFO: Expanding 'SqlTransform(beam:external:java:sql:v1)' with URN 'beam:external:java:sql:v1'
INFO     apache_beam.utils.subprocess_server:subprocess_server.py:126 Sep 22, 2022 6:12:16 PM org.apache.beam.sdk.expansion.service.ExpansionService$ExternalTransformRegistrarLoader payloadToConfig
INFO     apache_beam.utils.subprocess_server:subprocess_server.py:126 WARNING: Configuration class 'org.apache.beam.sdk.extensions.sql.expansion.ExternalSqlTransformRegistrar$Configuration' has no schema registered. Attempting to construct with setter approach.
INFO     apache_beam.utils.subprocess_server:subprocess_server.py:126 Sep 22, 2022 6:12:17 PM org.apache.beam.sdk.expansion.service.ExpansionService$ExternalTransformRegistrarLoader payloadToConfig
INFO     apache_beam.utils.subprocess_server:subprocess_server.py:126 WARNING: Configuration class 'org.apache.beam.sdk.extensions.sql.expansion.ExternalSqlTransformRegistrar$Configuration' has no schema registered. Attempting to construct with setter approach.
INFO     apache_beam.utils.subprocess_server:subprocess_server.py:126 Sep 22, 2022 6:12:18 PM org.apache.beam.sdk.extensions.sql.impl.CalciteQueryPlanner convertToBeamRel
INFO     apache_beam.utils.subprocess_server:subprocess_server.py:126 INFO: SQL:
INFO     apache_beam.utils.subprocess_server:subprocess_server.py:126 SELECT COUNT(*) AS `count`
INFO     apache_beam.utils.subprocess_server:subprocess_server.py:126 FROM `beam`.`PCOLLECTION` AS `PCOLLECTION`
INFO     apache_beam.utils.subprocess_server:subprocess_server.py:126 Sep 22, 2022 6:12:19 PM org.apache.beam.sdk.extensions.sql.impl.CalciteQueryPlanner convertToBeamRel
INFO     apache_beam.utils.subprocess_server:subprocess_server.py:126 INFO: SQLPlan>
INFO     apache_beam.utils.subprocess_server:subprocess_server.py:126 LogicalAggregate(group=[{}], count=[COUNT()])
INFO     apache_beam.utils.subprocess_server:subprocess_server.py:126   BeamIOSourceRel(table=[[beam, PCOLLECTION]])
INFO     apache_beam.utils.subprocess_server:subprocess_server.py:126 
INFO     apache_beam.utils.subprocess_server:subprocess_server.py:126 Sep 22, 2022 6:12:19 PM org.apache.beam.sdk.extensions.sql.impl.CalciteQueryPlanner convertToBeamRel
INFO     apache_beam.utils.subprocess_server:subprocess_server.py:126 INFO: BEAMPlan>
INFO     apache_beam.utils.subprocess_server:subprocess_server.py:126 BeamAggregationRel(group=[{}], count=[COUNT()])
INFO     apache_beam.utils.subprocess_server:subprocess_server.py:126   BeamIOSourceRel(table=[[beam, PCOLLECTION]])
INFO     apache_beam.utils.subprocess_server:subprocess_server.py:126 
INFO     root:environments.py:376 Default Python SDK image for environment is apache/beam_python3.7_sdk:2.43.0.dev
INFO     root:environments.py:299 No image given, using default Python SDK image
INFO     root:environments.py:376 Default Python SDK image for environment is apache/beam_python3.7_sdk:2.43.0.dev
INFO     root:environments.py:304 Python SDK container image set to "apache/beam_python3.7_sdk:2.43.0.dev" for Docker environment
INFO     apache_beam.runners.portability.fn_api_runner.translations:translations.py:714 ==================== <function pack_combiners at 0x7fee7d08d710> ====================
INFO     apache_beam.runners.portability.fn_api_runner.translations:translations.py:714 ==================== <function lift_combiners at 0x7fee7d08d7a0> ====================
INFO     apache_beam.runners.portability.fn_api_runner.translations:translations.py:714 ==================== <function sort_stages at 0x7fee7d08def0> ====================
INFO     apache_beam.runners.portability.portable_runner:portable_runner.py:583 Job state changed to STOPPED
INFO     apache_beam.runners.portability.portable_runner:portable_runner.py:583 Job state changed to STARTING
INFO     apache_beam.runners.portability.portable_runner:portable_runner.py:583 Job state changed to RUNNING
INFO     apache_beam.runners.portability.portable_runner:portable_runner.py:583 Job state changed to DONE
PASSED                                                                   [ 88%]
apache_beam/transforms/sql_test.py::SqlTransformTest::test_zetasql_generate_data 
-------------------------------- live log call ---------------------------------
INFO     apache_beam.utils.subprocess_server:subprocess_server.py:239 Using pre-built snapshot at <https://ci-beam.apache.org/job/beam_PostCommit_XVR_Samza/ws/src/sdks/java/extensions/sql/expansion-service/build/libs/beam-sdks-java-extensions-sql-expansion-service-2.43.0-SNAPSHOT.jar>
INFO     root:external.py:773 Starting a JAR-based expansion service from JAR <https://ci-beam.apache.org/job/beam_PostCommit_XVR_Samza/ws/src/sdks/java/extensions/sql/expansion-service/build/libs/beam-sdks-java-extensions-sql-expansion-service-2.43.0-SNAPSHOT.jar> 
INFO     apache_beam.utils.subprocess_server:subprocess_server.py:116 Starting service with ['java' '-jar' '<https://ci-beam.apache.org/job/beam_PostCommit_XVR_Samza/ws/src/sdks/java/extensions/sql/expansion-service/build/libs/beam-sdks-java-extensions-sql-expansion-service-2.43.0-SNAPSHOT.jar'> '59521' '--filesToStage=<https://ci-beam.apache.org/job/beam_PostCommit_XVR_Samza/ws/src/sdks/java/extensions/sql/expansion-service/build/libs/beam-sdks-java-extensions-sql-expansion-service-2.43.0-SNAPSHOT.jar']>
INFO     apache_beam.utils.subprocess_server:subprocess_server.py:126 Starting expansion service at localhost:59521
INFO     apache_beam.utils.subprocess_server:subprocess_server.py:126 Sep 22, 2022 6:12:38 PM org.apache.beam.sdk.expansion.service.ExpansionService loadRegisteredTransforms
INFO     apache_beam.utils.subprocess_server:subprocess_server.py:126 INFO: Registering external transforms: [beam:external:java:sql:v1, beam:transform:org.apache.beam:pubsub_read:v1, beam:transform:org.apache.beam:pubsub_write:v1, beam:transform:org.apache.beam:pubsublite_write:v1, beam:transform:org.apache.beam:pubsublite_read:v1, beam:transform:org.apache.beam:spanner_insert:v1, beam:transform:org.apache.beam:spanner_update:v1, beam:transform:org.apache.beam:spanner_replace:v1, beam:transform:org.apache.beam:spanner_insert_or_update:v1, beam:transform:org.apache.beam:spanner_delete:v1, beam:transform:org.apache.beam:spanner_read:v1, beam:transform:org.apache.beam:kafka_read_with_metadata:v1, beam:transform:org.apache.beam:kafka_read_without_metadata:v1, beam:transform:org.apache.beam:kafka_write:v1, beam:external:java:generate_sequence:v1]
INFO     apache_beam.utils.subprocess_server:subprocess_server.py:126 	beam:external:java:sql:v1: org.apache.beam.sdk.expansion.service.ExpansionService$ExternalTransformRegistrarLoader$1@47eaca72
INFO     apache_beam.utils.subprocess_server:subprocess_server.py:126 	beam:transform:org.apache.beam:pubsub_read:v1: org.apache.beam.sdk.expansion.service.ExpansionService$ExternalTransformRegistrarLoader$1@55141def
INFO     apache_beam.utils.subprocess_server:subprocess_server.py:126 	beam:transform:org.apache.beam:pubsub_write:v1: org.apache.beam.sdk.expansion.service.ExpansionService$ExternalTransformRegistrarLoader$1@55182842
INFO     apache_beam.utils.subprocess_server:subprocess_server.py:126 	beam:transform:org.apache.beam:pubsublite_write:v1: org.apache.beam.sdk.expansion.service.ExpansionService$ExternalTransformRegistrarLoader$1@3270d194
INFO     apache_beam.utils.subprocess_server:subprocess_server.py:126 	beam:transform:org.apache.beam:pubsublite_read:v1: org.apache.beam.sdk.expansion.service.ExpansionService$ExternalTransformRegistrarLoader$1@235834f2
INFO     apache_beam.utils.subprocess_server:subprocess_server.py:126 	beam:transform:org.apache.beam:spanner_insert:v1: org.apache.beam.sdk.expansion.service.ExpansionService$ExternalTransformRegistrarLoader$1@5656be13
INFO     apache_beam.utils.subprocess_server:subprocess_server.py:126 	beam:transform:org.apache.beam:spanner_update:v1: org.apache.beam.sdk.expansion.service.ExpansionService$ExternalTransformRegistrarLoader$1@4218d6a3
INFO     apache_beam.utils.subprocess_server:subprocess_server.py:126 	beam:transform:org.apache.beam:spanner_replace:v1: org.apache.beam.sdk.expansion.service.ExpansionService$ExternalTransformRegistrarLoader$1@76505305
INFO     apache_beam.utils.subprocess_server:subprocess_server.py:126 	beam:transform:org.apache.beam:spanner_insert_or_update:v1: org.apache.beam.sdk.expansion.service.ExpansionService$ExternalTransformRegistrarLoader$1@14cd1699
INFO     apache_beam.utils.subprocess_server:subprocess_server.py:126 	beam:transform:org.apache.beam:spanner_delete:v1: org.apache.beam.sdk.expansion.service.ExpansionService$ExternalTransformRegistrarLoader$1@77888435
INFO     apache_beam.utils.subprocess_server:subprocess_server.py:126 	beam:transform:org.apache.beam:spanner_read:v1: org.apache.beam.sdk.expansion.service.ExpansionService$ExternalTransformRegistrarLoader$1@73a1e9a9
INFO     apache_beam.utils.subprocess_server:subprocess_server.py:126 	beam:transform:org.apache.beam:kafka_read_with_metadata:v1: org.apache.beam.sdk.expansion.service.ExpansionService$ExternalTransformRegistrarLoader$1@71d44a3
INFO     apache_beam.utils.subprocess_server:subprocess_server.py:126 	beam:transform:org.apache.beam:kafka_read_without_metadata:v1: org.apache.beam.sdk.expansion.service.ExpansionService$ExternalTransformRegistrarLoader$1@7b98f307
INFO     apache_beam.utils.subprocess_server:subprocess_server.py:126 	beam:transform:org.apache.beam:kafka_write:v1: org.apache.beam.sdk.expansion.service.ExpansionService$ExternalTransformRegistrarLoader$1@4802796d
INFO     apache_beam.utils.subprocess_server:subprocess_server.py:126 	beam:external:java:generate_sequence:v1: org.apache.beam.sdk.expansion.service.ExpansionService$ExternalTransformRegistrarLoader$1@34123d65
INFO     apache_beam.utils.subprocess_server:subprocess_server.py:126 Sep 22, 2022 6:12:40 PM org.apache.beam.sdk.expansion.service.ExpansionService expand
INFO     apache_beam.utils.subprocess_server:subprocess_server.py:126 INFO: Expanding 'SqlTransform(beam:external:java:sql:v1)' with URN 'beam:external:java:sql:v1'
INFO     apache_beam.utils.subprocess_server:subprocess_server.py:126 Sep 22, 2022 6:12:40 PM org.apache.beam.sdk.expansion.service.ExpansionService$ExternalTransformRegistrarLoader payloadToConfig
INFO     apache_beam.utils.subprocess_server:subprocess_server.py:126 WARNING: Configuration class 'org.apache.beam.sdk.extensions.sql.expansion.ExternalSqlTransformRegistrar$Configuration' has no schema registered. Attempting to construct with setter approach.
INFO     apache_beam.utils.subprocess_server:subprocess_server.py:126 Sep 22, 2022 6:12:40 PM org.apache.beam.sdk.expansion.service.ExpansionService$ExternalTransformRegistrarLoader payloadToConfig
INFO     apache_beam.utils.subprocess_server:subprocess_server.py:126 WARNING: Configuration class 'org.apache.beam.sdk.extensions.sql.expansion.ExternalSqlTransformRegistrar$Configuration' has no schema registered. Attempting to construct with setter approach.
INFO     apache_beam.utils.subprocess_server:subprocess_server.py:126 Sep 22, 2022 6:12:42 PM com.google.zetasql.io.grpc.NameResolverRegistry getDefaultRegistry
INFO     apache_beam.utils.subprocess_server:subprocess_server.py:126 WARNING: No NameResolverProviders found via ServiceLoader, including for DNS. This is probably due to a broken build. If using ProGuard, check your configuration
INFO     apache_beam.utils.subprocess_server:subprocess_server.py:126 Sep 22, 2022 6:12:44 PM org.apache.beam.sdk.extensions.sql.zetasql.ZetaSQLQueryPlanner convertToBeamRelInternal
INFO     apache_beam.utils.subprocess_server:subprocess_server.py:126 INFO: BEAMPlan>
INFO     apache_beam.utils.subprocess_server:subprocess_server.py:126 BeamZetaSqlCalcRel(expr#0=[{inputs}], expr#1=[1:BIGINT], expr#2=['foo':VARCHAR], expr#3=[3.1400000000000001243E0:DOUBLE], int=[$t1], str=[$t2], flt=[$t3])
INFO     apache_beam.utils.subprocess_server:subprocess_server.py:126   BeamValuesRel(tuples=[[{ 0 }]])
INFO     apache_beam.utils.subprocess_server:subprocess_server.py:126 
INFO     root:environments.py:376 Default Python SDK image for environment is apache/beam_python3.7_sdk:2.43.0.dev
INFO     root:environments.py:299 No image given, using default Python SDK image
INFO     root:environments.py:376 Default Python SDK image for environment is apache/beam_python3.7_sdk:2.43.0.dev
INFO     root:environments.py:304 Python SDK container image set to "apache/beam_python3.7_sdk:2.43.0.dev" for Docker environment
INFO     apache_beam.runners.portability.fn_api_runner.translations:translations.py:714 ==================== <function pack_combiners at 0x7fee7d08d710> ====================
INFO     apache_beam.runners.portability.fn_api_runner.translations:translations.py:714 ==================== <function lift_combiners at 0x7fee7d08d7a0> ====================
INFO     apache_beam.runners.portability.fn_api_runner.translations:translations.py:714 ==================== <function sort_stages at 0x7fee7d08def0> ====================
INFO     apache_beam.runners.portability.portable_runner:portable_runner.py:583 Job state changed to STOPPED
INFO     apache_beam.runners.portability.portable_runner:portable_runner.py:583 Job state changed to STARTING
INFO     apache_beam.runners.portability.portable_runner:portable_runner.py:583 Job state changed to RUNNING
INFO     apache_beam.runners.portability.portable_runner:portable_runner.py:583 Job state changed to DONE
PASSED                                                                   [100%]

=============================== warnings summary ===============================
../../build/gradleenv/1922375555/lib/python3.7/site-packages/hdfs/config.py:15
  <https://ci-beam.apache.org/job/beam_PostCommit_XVR_Samza/ws/src/build/gradleenv/1922375555/lib/python3.7/site-packages/hdfs/config.py>:15: DeprecationWarning: the imp module is deprecated in favour of importlib; see the module's documentation for alternative uses
    from imp import load_source

../../build/gradleenv/1922375555/lib/python3.7/site-packages/google/api_core/grpc_helpers.py:42
  <https://ci-beam.apache.org/job/beam_PostCommit_XVR_Samza/ws/src/build/gradleenv/1922375555/lib/python3.7/site-packages/google/api_core/grpc_helpers.py>:42: DeprecationWarning: Support for grpcio-gcp is deprecated. This feature will be
              removed from `google-api-core` after January 1, 2024. If you need to
              continue to use this feature, please pin to a specific version of
              `google-api-core`.
    DeprecationWarning,

-- Docs: https://docs.pytest.org/en/stable/how-to/capture-warnings.html
- generated xml file: <https://ci-beam.apache.org/job/beam_PostCommit_XVR_Samza/ws/src/sdks/python/pytest_xlangSqlValidateRunner.xml> -
==== 9 passed, 3 skipped, 6657 deselected, 2 warnings in 235.35s (0:03:55) =====

> Task :runners:samza:job-server:samzaJobServerCleanup
Stopping job server pid: 3375869.

> Task :runners:samza:job-server:validatesCrossLanguageRunnerCleanup
Stopping expansion service pid: 3379005.
Stopping expansion service pid: 3379006.

FAILURE: Build failed with an exception.

* Where:
Build file '<https://ci-beam.apache.org/job/beam_PostCommit_XVR_Samza/ws/src/sdks/go/test/build.gradle'> line: 195

* What went wrong:
Execution failed for task ':runners:samza:job-server:validatesCrossLanguageRunnerGoUsingJava'.
> Process 'command 'sh'' finished with non-zero exit value 1

* Try:
> Run with --stacktrace option to get the stack trace.
> Run with --info or --debug option to get more log output.

* Get more help at https://help.gradle.org

Deprecated Gradle features were used in this build, making it incompatible with Gradle 8.0.

You can use '--warning-mode all' to show the individual deprecation warnings and determine if they come from your own scripts or plugins.

See https://docs.gradle.org/7.5.1/userguide/command_line_interface.html#sec:command_line_warnings

Execution optimizations have been disabled for 1 invalid unit(s) of work during this build to ensure correctness.
Please consult deprecation warnings for more details.

BUILD FAILED in 30m 35s
260 actionable tasks: 203 executed, 45 from cache, 12 up-to-date

Publishing build scan...
https://gradle.com/s/7i65ejhwfpdq4

Build step 'Invoke Gradle script' changed build result to FAILURE
Build step 'Invoke Gradle script' marked build as failure

---------------------------------------------------------------------
To unsubscribe, e-mail: builds-unsubscribe@beam.apache.org
For additional commands, e-mail: builds-help@beam.apache.org


Build failed in Jenkins: beam_PostCommit_XVR_Samza #1699

Posted by Apache Jenkins Server <je...@builds.apache.org>.
See <https://ci-beam.apache.org/job/beam_PostCommit_XVR_Samza/1699/display/redirect?page=changes>

Changes:

[bvolpato] Do not use .get() on ValueProvider during pipeline creation

[noreply] Improved pipeline translation in SparkStructuredStreamingRunner (#22446)


------------------------------------------
[...truncated 1.40 MB...]
        urn: "beam:coders:javasdk:0.1"
        payload: "\202SNAPPY\000\000\000\000\001\000\000\000\001\000\000\001.\307\003\360@\254\355\000\005sr\000&org.apache.beam.sdk.coders.SnappyCoder1\033\243\356\177\362\366,\002\000\001L\000\ninner\005\030 t\000\"Lorg/a\005B\000/\001B\020/sdk/\tB\000/\005$\020;xr\000*ng\000 tructured\005/8s\277\022\016\325\3246\021\002\000\000xr\000 j9\000\005/\034C\335\325\211\256\274~\370\001/\020psr\000,j1\000,Serializable\005= \010\364 \216\305ynl\002\001\327\\\004typet\000\021Ljava/lang/Class\001\300n'\001\024Custom\005PPj\260\010\235\013;\035\013\002\000\000xq\000~\000\003vr\000$N\221\000\\io.BoundedSource!`v\023\177\370QA\0019\010r\000\035Z3\000\t,0\020\213\372\020Y\214\347\323\002\000\000xp"
      >
    >
  >
  coders: <
    key: "XOIgHzEcHbTimestampedValueCoder"
    value: <
      spec: <
        urn: "beam:coders:javasdk:0.1"
        payload: "\202SNAPPY\000\000\000\000\001\000\000\000\001\000\000\001?\315\003\270\254\355\000\005sr\000Aorg.apache.beam.sdk.values.TimestampedV\001\022\000$>\021\000LCoder\364\376\202p\274iX-\002\000\001L\000\nv\001)\005\030\034t\000\"Lorg/\t]\000/\001],/sdk/coders/\005$\020;xr\000*N\202\000\t%(.Structured\005/8s\277\022\016\325\3246\021\002\000\000xr\000 j9\000\005/\034C\335\325\211\256\274~\370\001/\020psr\000,j1\000(Serializabl\t\277\034\010\364 \216\305ynl\005\327\\\004typet\000\021Ljava/lang/Class\001\300\000&jV\000\024Custom\005\215Pj\260\010\235\013;\035\013\002\000\000xq\000~\000\003vr\000;N;\000Pio.BoundedReadFromUnb\t\021`Source$Shardd\236\240U\205\000j\363\002\000\000xp"
      >
    >
  >
  coders: <
    key: "XOIgHzEcHbValueWithRecordIdCoder"
    value: <
      spec: <
        urn: "beam:coders:javasdk:0.1"
        payload: "\202SNAPPY\000\000\000\000\001\000\000\000\001\000\000\001\213\311\005\320\254\355\000\005sr\000Corg.apache.beam.sdk.values.ValueWithRecordId$B\022\000LCoder{\343\376bQ\014\204>\002\000\002L\000\007i\t\025\034t\000+Lorg/\t\\\000/\001\\\024/sdk/c\0012(s/ByteArray\005B\014;L\000\n\005u\005\016\010t\000\"n;\000\005$\020;xr\000*N\274\000\t`(.Structured\005/8s\277\022\016\325\3246\021\002\000\000xr\000 j9\000\005/\034C\335\325\211\256\274~\370\001/\020psr\000)j1\0006\312\000\034\351\277\005|\263\3746\333\001:\010r\000&j8\000\024Atomic\005o\034\307\354\265\314\205tPF\0015 q\000~\000\003sr\000-N;\000$io.kafka.K\001\006\000R%\227\005B<I\320\251Y\032\341{#\002\000\001L\000\007kv\005\025\010t\000$nH\001\000K\t&\000;\025s\000\"Ns\000-P\r- j\000\275\271\035\243\3126\002!\353\010\010ke)\277\001\264\000\0022\303\001\005\022\025Y\000(jY\000\030Nullabl)\372\034E\333\0336>\220\247\007\005\307]\022.O\000\001\014,\006sq\000~\000\016q\000~\000\020"
      >
    >
  >
  coders: <
    key: "XOIgHzEcHbVarIntCoder"
    value: <
      spec: <
        urn: "beam:coders:javasdk:0.1"
        payload: "\202SNAPPY\000\000\000\000\001\000\000\000\001\000\000\000\210\330\001\350\254\355\000\005sr\000&org.apache.beam.sdk.coders.VarIntCoder\300K2\332\251KVh\002\000\000xrr5\000\024Atomic\0055 \307\354\265\314\205tPF\002\0055\000*jj\000$Structured\0059\034s\277\022\016\325\3246\021\t9\000 j9\000\005/0C\335\325\211\256\274~\370\002\000\000xp"
      >
    >
  >
  coders: <
    key: "XOIgHzEcHbVoidCoder"
    value: <
      spec: <
        urn: "beam:coders:javasdk:0.1"
        payload: "\202SNAPPY\000\000\000\000\001\000\000\000\001\000\000\000\210\326\001\350\254\355\000\005sr\000$org.apache.beam.sdk.coders.VoidCoder\271\277U\233\350\r\257U\002\000\000xr\000&j3\000\024Atomic\0055 \307\354\265\314\205tPF\002\0055\000*j5\000$Structured\0059\034s\277\022\016\325\3246\021\t9\000 j9\000\005/0C\335\325\211\256\274~\370\002\000\000xp"
      >
    >
  >
  coders: <
    key: "c0"
    value: <
      spec: <
        urn: "beam:coder:bytes:v1"
      >
    >
  >
  coders: <
    key: "c1"
    value: <
      spec: <
        urn: "beam:coder:global_window:v1"
      >
    >
  >
  coders: <
    key: "c2"
    value: <
      spec: <
        urn: "beam:go:coder:custom:v1"
        payload: "Cgd2YXJpbnR6EgIIAhpdCklnaXRodWIuY29tL2FwYWNoZS9iZWFtL3Nka3MvdjIvZ28vcGtnL2JlYW0vY29yZS9ydW50aW1lL2NvZGVyeC5lbmNWYXJJbnRaEhAIFiIECBlADyoGCBQSAggIImkKSWdpdGh1Yi5jb20vYXBhY2hlL2JlYW0vc2Rrcy92Mi9nby9wa2cvYmVhbS9jb3JlL3J1bnRpbWUvY29kZXJ4LmRlY1ZhckludFoSHAgWIgQIGUADIgYIFBICCAgqBAgZQA8qBAgZQAE="
      >
    >
  >
  coders: <
    key: "c3"
    value: <
      spec: <
        urn: "beam:coder:length_prefix:v1"
      >
      component_coder_ids: "c2"
    >
  >
  coders: <
    key: "c4"
    value: <
      spec: <
        urn: "beam:coder:kv:v1"
      >
      component_coder_ids: "c0"
      component_coder_ids: "c0"
    >
  >
  environments: <
    key: "XOIgHzEcHbbeam:env:docker:v1"
    value: <
      urn: "beam:env:docker:v1"
      payload: "\n apache/beam_java8_sdk:2.43.0.dev"
      capabilities: "beam:coder:bytes:v1"
      capabilities: "beam:coder:bool:v1"
      capabilities: "beam:coder:varint:v1"
      capabilities: "beam:coder:string_utf8:v1"
      capabilities: "beam:coder:iterable:v1"
      capabilities: "beam:coder:timer:v1"
      capabilities: "beam:coder:kv:v1"
      capabilities: "beam:coder:length_prefix:v1"
      capabilities: "beam:coder:global_window:v1"
      capabilities: "beam:coder:interval_window:v1"
      capabilities: "beam:coder:custom_window:v1"
      capabilities: "beam:coder:windowed_value:v1"
      capabilities: "beam:coder:double:v1"
      capabilities: "beam:coder:row:v1"
      capabilities: "beam:coder:param_windowed_value:v1"
      capabilities: "beam:coder:state_backed_iterable:v1"
      capabilities: "beam:coder:sharded_key:v1"
      capabilities: "beam:coder:nullable:v1"
      capabilities: "beam:protocol:multi_core_bundle_processing:v1"
      capabilities: "beam:protocol:progress_reporting:v1"
      capabilities: "beam:protocol:harness_monitoring_infos:v1"
      capabilities: "beam:protocol:control_request_elements_embedding:v1"
      capabilities: "beam:protocol:state_caching:v1"
      capabilities: "beam:version:sdk_base:apache/beam_java8_sdk:2.43.0.dev"
      capabilities: "beam:transform:sdf_truncate_sized_restrictions:v1"
      capabilities: "beam:transform:to_string:v1"
      dependencies: <
        type_urn: "beam:artifact:type:file:v1"
        type_payload: "\nL/tmp/artifacts/icedtea-sound-CGRxIE9edPHnbxQhM-L5mp8h21H-ySB79uQtSquPV_Q.jar\022@086471204f5e74f1e76f142133e2f99a9f21db51fec9207bf6e42d4aab8f57f4"
        role_urn: "beam:artifact:role:staging_to:v1"
        role_payload: "\n=icedtea-sound-CGRxIE9edPHnbxQhM-L5mp8h21H-ySB79uQtSquPV_Q.jar"
      >
      dependencies: <
        type_urn: "beam:artifact:type:file:v1"
        type_payload: "\nF/tmp/artifacts/jaccess-FBI0Bb27lF3oEBieWAi7SP8X1zBR8k4BJQOVpsoK9a0.jar\022@14123405bdbb945de810189e5808bb48ff17d73051f24e01250395a6ca0af5ad"
        role_urn: "beam:artifact:role:staging_to:v1"
        role_payload: "\n7jaccess-FBI0Bb27lF3oEBieWAi7SP8X1zBR8k4BJQOVpsoK9a0.jar"
      >
      dependencies: <
        type_urn: "beam:artifact:type:file:v1"
        type_payload: "\nI/tmp/artifacts/localedata-kJ2mc8rBH5-IklhfR1XzNotlIQ_mnVMA-pgaXv2r8Ag.jar\022@909da673cac11f9f8892585f4755f3368b65210fe69d5300fa981a5efdabf008"
        role_urn: "beam:artifact:role:staging_to:v1"
        role_payload: "\n:localedata-kJ2mc8rBH5-IklhfR1XzNotlIQ_mnVMA-pgaXv2r8Ag.jar"
      >
      dependencies: <
        type_urn: "beam:artifact:type:file:v1"
        type_payload: "\nF/tmp/artifacts/nashorn-B0CAb3QpJET_6VsT3hcC_89VtvhV616H8N2bHAIaqWo.jar\022@0740806f74292444ffe95b13de1702ffcf55b6f855eb5e87f0dd9b1c021aa96a"
        role_urn: "beam:artifact:role:staging_to:v1"
        role_payload: "\n7nashorn-B0CAb3QpJET_6VsT3hcC_89VtvhV616H8N2bHAIaqWo.jar"
      >
      dependencies: <
        type_urn: "beam:artifact:type:file:v1"
        type_payload: "\nG/tmp/artifacts/cldrdata-gclqV9lOGqQOKesG-a6TAUTGEYlyIDqpyd4M_k7gtWo.jar\022@81c96a57d94e1aa40e29eb06f9ae930144c6118972203aa9c9de0cfe4ee0b56a"
        role_urn: "beam:artifact:role:staging_to:v1"
        role_payload: "\n8cldrdata-gclqV9lOGqQOKesG-a6TAUTGEYlyIDqpyd4M_k7gtWo.jar"
      >
      dependencies: <
        type_urn: "beam:artifact:type:file:v1"
        type_payload: "\nD/tmp/artifacts/dnsns-byzoQxdXengTvA5IlbH9gSIzfhNQElRYltuMJN0vjcc.jar\022@6f2ce84317577a7813bc0e4895b1fd8122337e135012545896db8c24dd2f8dc7"
        role_urn: "beam:artifact:role:staging_to:v1"
        role_payload: "\n5dnsns-byzoQxdXengTvA5IlbH9gSIzfhNQElRYltuMJN0vjcc.jar"
      >
      dependencies: <
        type_urn: "beam:artifact:type:file:v1"
        type_payload: "\nr/tmp/artifacts/beam-sdks-java-io-expansion-service-2.43.0-SNAPSHOT-tHeIUHwmCvFF1o46J-Bf8s1YRi70qM-8GKd9uwGn1iQ.jar\022@b47788507c260af145d68e3a27e05ff2cd58462ef4a8cfbc18a77dbb01a7d624"
        role_urn: "beam:artifact:role:staging_to:v1"
        role_payload: "\ncbeam-sdks-java-io-expansion-service-2.43.0-SNAPSHOT-tHeIUHwmCvFF1o46J-Bf8s1YRi70qM-8GKd9uwGn1iQ.jar"
      >
    >
  >
  environments: <
    key: "go"
    value: <
      urn: "beam:env:docker:v1"
      payload: "\n\026apache/beam_go_sdk:dev"
      capabilities: "beam:protocol:progress_reporting:v1"
      capabilities: "beam:protocol:multi_core_bundle_processing:v1"
      capabilities: "beam:transform:sdf_truncate_sized_restrictions:v1"
      capabilities: "beam:protocol:worker_status:v1"
      capabilities: "beam:protocol:monitoring_info_short_ids:v1"
      capabilities: "beam:version:sdk_base:go"
      capabilities: "beam:coder:bytes:v1"
      capabilities: "beam:coder:bool:v1"
      capabilities: "beam:coder:varint:v1"
      capabilities: "beam:coder:double:v1"
      capabilities: "beam:coder:string_utf8:v1"
      capabilities: "beam:coder:length_prefix:v1"
      capabilities: "beam:coder:kv:v1"
      capabilities: "beam:coder:iterable:v1"
      capabilities: "beam:coder:state_backed_iterable:v1"
      capabilities: "beam:coder:windowed_value:v1"
      capabilities: "beam:coder:global_window:v1"
      capabilities: "beam:coder:interval_window:v1"
      capabilities: "beam:coder:row:v1"
      capabilities: "beam:coder:nullable:v1"
      dependencies: <
        type_urn: "beam:artifact:type:file:v1"
        role_urn: "beam:artifact:role:go_worker_binary:v1"
      >
    >
  >
>
root_transform_ids: "s1"
root_transform_ids: "e4"
root_transform_ids: "e5"
root_transform_ids: "s3"
requirements: "beam:requirement:pardo:splittable_dofn:v1"
2022/09/22 11:58:58 Cross-compiling <https://ci-beam.apache.org/job/beam_PostCommit_XVR_Samza/ws/src/sdks/go/test/integration/io/xlang/kafka/kafka_test.go> as /tmp/worker-2-1663847938519454628
2022/09/22 11:59:00 Prepared job with id: go-testkafkaio_basicreadwrite-538_fce5e3ce-982c-4c23-873f-a2b71f20328c and staging token: go-testkafkaio_basicreadwrite-538_fce5e3ce-982c-4c23-873f-a2b71f20328c
2022/09/22 11:59:00 Staged binary artifact with token: 
2022/09/22 11:59:00 Submitted job: go0testkafkaio0basicreadwrite0538-jenkins-0922115900-cd5cb499_f2700165-d587-427f-a455-c0b1fb4132e1
2022/09/22 11:59:00 Job state: STOPPED
2022/09/22 11:59:00 Job state: STARTING
2022/09/22 11:59:00 Job state: RUNNING
2022/09/22 11:59:10 Job state: DONE
--- PASS: TestKafkaIO_BasicReadWrite (28.25s)
PASS
ok  	github.com/apache/beam/sdks/v2/go/test/integration/io/xlang/kafka	34.302s
FAIL

> Task :runners:samza:job-server:validatesCrossLanguageRunnerGoUsingJava FAILED
> Task :runners:samza:job-server:validatesCrossLanguageRunnerJavaUsingPython
> Task :runners:samza:job-server:validatesCrossLanguageRunnerPythonUsingJava
> Task :runners:samza:job-server:validatesCrossLanguageRunnerPythonUsingSql
> Task :runners:samza:job-server:samzaJobServerCleanup
> Task :runners:samza:job-server:validatesCrossLanguageRunnerCleanup

FAILURE: Build failed with an exception.

* Where:
Build file '<https://ci-beam.apache.org/job/beam_PostCommit_XVR_Samza/ws/src/sdks/go/test/build.gradle'> line: 195

* What went wrong:
Execution failed for task ':runners:samza:job-server:validatesCrossLanguageRunnerGoUsingJava'.
> Process 'command 'sh'' finished with non-zero exit value 1

* Try:
> Run with --stacktrace option to get the stack trace.
> Run with --info or --debug option to get more log output.

* Get more help at https://help.gradle.org

Deprecated Gradle features were used in this build, making it incompatible with Gradle 8.0.

You can use '--warning-mode all' to show the individual deprecation warnings and determine if they come from your own scripts or plugins.

See https://docs.gradle.org/7.5.1/userguide/command_line_interface.html#sec:command_line_warnings

Execution optimizations have been disabled for 1 invalid unit(s) of work during this build to ensure correctness.
Please consult deprecation warnings for more details.

BUILD FAILED in 31m 12s
260 actionable tasks: 187 executed, 61 from cache, 12 up-to-date

Publishing build scan...
https://gradle.com/s/nkcmbymeanbvg

Build step 'Invoke Gradle script' changed build result to FAILURE
Build step 'Invoke Gradle script' marked build as failure

---------------------------------------------------------------------
To unsubscribe, e-mail: builds-unsubscribe@beam.apache.org
For additional commands, e-mail: builds-help@beam.apache.org


Build failed in Jenkins: beam_PostCommit_XVR_Samza #1698

Posted by Apache Jenkins Server <je...@builds.apache.org>.
See <https://ci-beam.apache.org/job/beam_PostCommit_XVR_Samza/1698/display/redirect>

Changes:


------------------------------------------
[...truncated 987.63 KB...]
        urn: "beam:coders:javasdk:0.1"
        payload: "\202SNAPPY\000\000\000\000\001\000\000\000\001\000\000\001.\307\003\360@\254\355\000\005sr\000&org.apache.beam.sdk.coders.SnappyCoder1\033\243\356\177\362\366,\002\000\001L\000\ninner\005\030 t\000\"Lorg/a\005B\000/\001B\020/sdk/\tB\000/\005$\020;xr\000*ng\000 tructured\005/8s\277\022\016\325\3246\021\002\000\000xr\000 j9\000\005/\034C\335\325\211\256\274~\370\001/\020psr\000,j1\000,Serializable\005= \010\364 \216\305ynl\002\001\327\\\004typet\000\021Ljava/lang/Class\001\300n'\001\024Custom\005PPj\260\010\235\013;\035\013\002\000\000xq\000~\000\003vr\000$N\221\000\\io.BoundedSource!`v\023\177\370QA\0019\010r\000\035Z3\000\t,0\020\213\372\020Y\214\347\323\002\000\000xp"
      >
    >
  >
  coders: <
    key: "BjtNfsllWkTimestampedValueCoder"
    value: <
      spec: <
        urn: "beam:coders:javasdk:0.1"
        payload: "\202SNAPPY\000\000\000\000\001\000\000\000\001\000\000\001?\315\003\270\254\355\000\005sr\000Aorg.apache.beam.sdk.values.TimestampedV\001\022\000$>\021\000LCoder\364\376\202p\274iX-\002\000\001L\000\nv\001)\005\030\034t\000\"Lorg/\t]\000/\001],/sdk/coders/\005$\020;xr\000*N\202\000\t%(.Structured\005/8s\277\022\016\325\3246\021\002\000\000xr\000 j9\000\005/\034C\335\325\211\256\274~\370\001/\020psr\000,j1\000(Serializabl\t\277\034\010\364 \216\305ynl\005\327\\\004typet\000\021Ljava/lang/Class\001\300\000&jV\000\024Custom\005\215Pj\260\010\235\013;\035\013\002\000\000xq\000~\000\003vr\000;N;\000Pio.BoundedReadFromUnb\t\021`Source$Shardd\236\240U\205\000j\363\002\000\000xp"
      >
    >
  >
  coders: <
    key: "BjtNfsllWkValueWithRecordIdCoder"
    value: <
      spec: <
        urn: "beam:coders:javasdk:0.1"
        payload: "\202SNAPPY\000\000\000\000\001\000\000\000\001\000\000\001\213\311\005\320\254\355\000\005sr\000Corg.apache.beam.sdk.values.ValueWithRecordId$B\022\000LCoder{\343\376bQ\014\204>\002\000\002L\000\007i\t\025\034t\000+Lorg/\t\\\000/\001\\\024/sdk/c\0012(s/ByteArray\005B\014;L\000\n\005u\005\016\010t\000\"n;\000\005$\020;xr\000*N\274\000\t`(.Structured\005/8s\277\022\016\325\3246\021\002\000\000xr\000 j9\000\005/\034C\335\325\211\256\274~\370\001/\020psr\000)j1\0006\312\000\034\351\277\005|\263\3746\333\001:\010r\000&j8\000\024Atomic\005o\034\307\354\265\314\205tPF\0015 q\000~\000\003sr\000-N;\000$io.kafka.K\001\006\000R%\227\005B<I\320\251Y\032\341{#\002\000\001L\000\007kv\005\025\010t\000$nH\001\000K\t&\000;\025s\000\"Ns\000-P\r- j\000\275\271\035\243\3126\002!\353\010\010ke)\277\001\264\000\0022\303\001\005\022\025Y\000(jY\000\030Nullabl)\372\034E\333\0336>\220\247\007\005\307]\022.O\000\001\014,\006sq\000~\000\016q\000~\000\020"
      >
    >
  >
  coders: <
    key: "BjtNfsllWkVarIntCoder"
    value: <
      spec: <
        urn: "beam:coders:javasdk:0.1"
        payload: "\202SNAPPY\000\000\000\000\001\000\000\000\001\000\000\000\210\330\001\350\254\355\000\005sr\000&org.apache.beam.sdk.coders.VarIntCoder\300K2\332\251KVh\002\000\000xrr5\000\024Atomic\0055 \307\354\265\314\205tPF\002\0055\000*jj\000$Structured\0059\034s\277\022\016\325\3246\021\t9\000 j9\000\005/0C\335\325\211\256\274~\370\002\000\000xp"
      >
    >
  >
  coders: <
    key: "BjtNfsllWkVoidCoder"
    value: <
      spec: <
        urn: "beam:coders:javasdk:0.1"
        payload: "\202SNAPPY\000\000\000\000\001\000\000\000\001\000\000\000\210\326\001\350\254\355\000\005sr\000$org.apache.beam.sdk.coders.VoidCoder\271\277U\233\350\r\257U\002\000\000xr\000&j3\000\024Atomic\0055 \307\354\265\314\205tPF\002\0055\000*j5\000$Structured\0059\034s\277\022\016\325\3246\021\t9\000 j9\000\005/0C\335\325\211\256\274~\370\002\000\000xp"
      >
    >
  >
  coders: <
    key: "c0"
    value: <
      spec: <
        urn: "beam:coder:bytes:v1"
      >
    >
  >
  coders: <
    key: "c1"
    value: <
      spec: <
        urn: "beam:coder:global_window:v1"
      >
    >
  >
  coders: <
    key: "c2"
    value: <
      spec: <
        urn: "beam:go:coder:custom:v1"
        payload: "Cgd2YXJpbnR6EgIIAhpdCklnaXRodWIuY29tL2FwYWNoZS9iZWFtL3Nka3MvdjIvZ28vcGtnL2JlYW0vY29yZS9ydW50aW1lL2NvZGVyeC5lbmNWYXJJbnRaEhAIFiIECBlADyoGCBQSAggIImkKSWdpdGh1Yi5jb20vYXBhY2hlL2JlYW0vc2Rrcy92Mi9nby9wa2cvYmVhbS9jb3JlL3J1bnRpbWUvY29kZXJ4LmRlY1ZhckludFoSHAgWIgQIGUADIgYIFBICCAgqBAgZQA8qBAgZQAE="
      >
    >
  >
  coders: <
    key: "c3"
    value: <
      spec: <
        urn: "beam:coder:length_prefix:v1"
      >
      component_coder_ids: "c2"
    >
  >
  coders: <
    key: "c4"
    value: <
      spec: <
        urn: "beam:coder:kv:v1"
      >
      component_coder_ids: "c0"
      component_coder_ids: "c0"
    >
  >
  environments: <
    key: "BjtNfsllWkbeam:env:docker:v1"
    value: <
      urn: "beam:env:docker:v1"
      payload: "\n apache/beam_java8_sdk:2.43.0.dev"
      capabilities: "beam:coder:bytes:v1"
      capabilities: "beam:coder:bool:v1"
      capabilities: "beam:coder:varint:v1"
      capabilities: "beam:coder:string_utf8:v1"
      capabilities: "beam:coder:iterable:v1"
      capabilities: "beam:coder:timer:v1"
      capabilities: "beam:coder:kv:v1"
      capabilities: "beam:coder:length_prefix:v1"
      capabilities: "beam:coder:global_window:v1"
      capabilities: "beam:coder:interval_window:v1"
      capabilities: "beam:coder:custom_window:v1"
      capabilities: "beam:coder:windowed_value:v1"
      capabilities: "beam:coder:double:v1"
      capabilities: "beam:coder:row:v1"
      capabilities: "beam:coder:param_windowed_value:v1"
      capabilities: "beam:coder:state_backed_iterable:v1"
      capabilities: "beam:coder:sharded_key:v1"
      capabilities: "beam:coder:nullable:v1"
      capabilities: "beam:protocol:multi_core_bundle_processing:v1"
      capabilities: "beam:protocol:progress_reporting:v1"
      capabilities: "beam:protocol:harness_monitoring_infos:v1"
      capabilities: "beam:protocol:control_request_elements_embedding:v1"
      capabilities: "beam:protocol:state_caching:v1"
      capabilities: "beam:version:sdk_base:apache/beam_java8_sdk:2.43.0.dev"
      capabilities: "beam:transform:sdf_truncate_sized_restrictions:v1"
      capabilities: "beam:transform:to_string:v1"
      dependencies: <
        type_urn: "beam:artifact:type:file:v1"
        type_payload: "\nL/tmp/artifacts/icedtea-sound-CGRxIE9edPHnbxQhM-L5mp8h21H-ySB79uQtSquPV_Q.jar\022@086471204f5e74f1e76f142133e2f99a9f21db51fec9207bf6e42d4aab8f57f4"
        role_urn: "beam:artifact:role:staging_to:v1"
        role_payload: "\n=icedtea-sound-CGRxIE9edPHnbxQhM-L5mp8h21H-ySB79uQtSquPV_Q.jar"
      >
      dependencies: <
        type_urn: "beam:artifact:type:file:v1"
        type_payload: "\nF/tmp/artifacts/jaccess-FBI0Bb27lF3oEBieWAi7SP8X1zBR8k4BJQOVpsoK9a0.jar\022@14123405bdbb945de810189e5808bb48ff17d73051f24e01250395a6ca0af5ad"
        role_urn: "beam:artifact:role:staging_to:v1"
        role_payload: "\n7jaccess-FBI0Bb27lF3oEBieWAi7SP8X1zBR8k4BJQOVpsoK9a0.jar"
      >
      dependencies: <
        type_urn: "beam:artifact:type:file:v1"
        type_payload: "\nI/tmp/artifacts/localedata-kJ2mc8rBH5-IklhfR1XzNotlIQ_mnVMA-pgaXv2r8Ag.jar\022@909da673cac11f9f8892585f4755f3368b65210fe69d5300fa981a5efdabf008"
        role_urn: "beam:artifact:role:staging_to:v1"
        role_payload: "\n:localedata-kJ2mc8rBH5-IklhfR1XzNotlIQ_mnVMA-pgaXv2r8Ag.jar"
      >
      dependencies: <
        type_urn: "beam:artifact:type:file:v1"
        type_payload: "\nF/tmp/artifacts/nashorn-B0CAb3QpJET_6VsT3hcC_89VtvhV616H8N2bHAIaqWo.jar\022@0740806f74292444ffe95b13de1702ffcf55b6f855eb5e87f0dd9b1c021aa96a"
        role_urn: "beam:artifact:role:staging_to:v1"
        role_payload: "\n7nashorn-B0CAb3QpJET_6VsT3hcC_89VtvhV616H8N2bHAIaqWo.jar"
      >
      dependencies: <
        type_urn: "beam:artifact:type:file:v1"
        type_payload: "\nG/tmp/artifacts/cldrdata-gclqV9lOGqQOKesG-a6TAUTGEYlyIDqpyd4M_k7gtWo.jar\022@81c96a57d94e1aa40e29eb06f9ae930144c6118972203aa9c9de0cfe4ee0b56a"
        role_urn: "beam:artifact:role:staging_to:v1"
        role_payload: "\n8cldrdata-gclqV9lOGqQOKesG-a6TAUTGEYlyIDqpyd4M_k7gtWo.jar"
      >
      dependencies: <
        type_urn: "beam:artifact:type:file:v1"
        type_payload: "\nD/tmp/artifacts/dnsns-byzoQxdXengTvA5IlbH9gSIzfhNQElRYltuMJN0vjcc.jar\022@6f2ce84317577a7813bc0e4895b1fd8122337e135012545896db8c24dd2f8dc7"
        role_urn: "beam:artifact:role:staging_to:v1"
        role_payload: "\n5dnsns-byzoQxdXengTvA5IlbH9gSIzfhNQElRYltuMJN0vjcc.jar"
      >
      dependencies: <
        type_urn: "beam:artifact:type:file:v1"
        type_payload: "\nr/tmp/artifacts/beam-sdks-java-io-expansion-service-2.43.0-SNAPSHOT-tHeIUHwmCvFF1o46J-Bf8s1YRi70qM-8GKd9uwGn1iQ.jar\022@b47788507c260af145d68e3a27e05ff2cd58462ef4a8cfbc18a77dbb01a7d624"
        role_urn: "beam:artifact:role:staging_to:v1"
        role_payload: "\ncbeam-sdks-java-io-expansion-service-2.43.0-SNAPSHOT-tHeIUHwmCvFF1o46J-Bf8s1YRi70qM-8GKd9uwGn1iQ.jar"
      >
    >
  >
  environments: <
    key: "go"
    value: <
      urn: "beam:env:docker:v1"
      payload: "\n\026apache/beam_go_sdk:dev"
      capabilities: "beam:protocol:progress_reporting:v1"
      capabilities: "beam:protocol:multi_core_bundle_processing:v1"
      capabilities: "beam:transform:sdf_truncate_sized_restrictions:v1"
      capabilities: "beam:protocol:worker_status:v1"
      capabilities: "beam:protocol:monitoring_info_short_ids:v1"
      capabilities: "beam:version:sdk_base:go"
      capabilities: "beam:coder:bytes:v1"
      capabilities: "beam:coder:bool:v1"
      capabilities: "beam:coder:varint:v1"
      capabilities: "beam:coder:double:v1"
      capabilities: "beam:coder:string_utf8:v1"
      capabilities: "beam:coder:length_prefix:v1"
      capabilities: "beam:coder:kv:v1"
      capabilities: "beam:coder:iterable:v1"
      capabilities: "beam:coder:state_backed_iterable:v1"
      capabilities: "beam:coder:windowed_value:v1"
      capabilities: "beam:coder:global_window:v1"
      capabilities: "beam:coder:interval_window:v1"
      capabilities: "beam:coder:row:v1"
      capabilities: "beam:coder:nullable:v1"
      dependencies: <
        type_urn: "beam:artifact:type:file:v1"
        role_urn: "beam:artifact:role:go_worker_binary:v1"
      >
    >
  >
>
root_transform_ids: "s1"
root_transform_ids: "e4"
root_transform_ids: "e5"
root_transform_ids: "s3"
requirements: "beam:requirement:pardo:splittable_dofn:v1"
2022/09/22 05:57:23 Cross-compiling <https://ci-beam.apache.org/job/beam_PostCommit_XVR_Samza/ws/src/sdks/go/test/integration/io/xlang/kafka/kafka_test.go> as /tmp/worker-2-1663826243756196442
2022/09/22 05:57:25 Prepared job with id: go-testkafkaio_basicreadwrite-16_ed25effb-dae1-4479-ba3d-8418abe55553 and staging token: go-testkafkaio_basicreadwrite-16_ed25effb-dae1-4479-ba3d-8418abe55553
2022/09/22 05:57:25 Staged binary artifact with token: 
2022/09/22 05:57:25 Submitted job: go0testkafkaio0basicreadwrite016-jenkins-0922055725-e6a8c307_b1a47d8b-a74e-402e-aafa-185bde8d7c04
2022/09/22 05:57:25 Job state: STOPPED
2022/09/22 05:57:25 Job state: STARTING
2022/09/22 05:57:25 Job state: RUNNING
2022/09/22 05:57:35 Job state: DONE
--- PASS: TestKafkaIO_BasicReadWrite (27.74s)
PASS
ok  	github.com/apache/beam/sdks/v2/go/test/integration/io/xlang/kafka	33.775s
FAIL

> Task :runners:samza:job-server:validatesCrossLanguageRunnerGoUsingJava FAILED
> Task :runners:samza:job-server:validatesCrossLanguageRunnerJavaUsingPython
> Task :runners:samza:job-server:validatesCrossLanguageRunnerPythonUsingJava
> Task :runners:samza:job-server:validatesCrossLanguageRunnerPythonUsingSql
> Task :runners:samza:job-server:samzaJobServerCleanup
> Task :runners:samza:job-server:validatesCrossLanguageRunnerCleanup

FAILURE: Build failed with an exception.

* Where:
Build file '<https://ci-beam.apache.org/job/beam_PostCommit_XVR_Samza/ws/src/sdks/go/test/build.gradle'> line: 195

* What went wrong:
Execution failed for task ':runners:samza:job-server:validatesCrossLanguageRunnerGoUsingJava'.
> Process 'command 'sh'' finished with non-zero exit value 1

* Try:
> Run with --stacktrace option to get the stack trace.
> Run with --info or --debug option to get more log output.

* Get more help at https://help.gradle.org

Deprecated Gradle features were used in this build, making it incompatible with Gradle 8.0.

You can use '--warning-mode all' to show the individual deprecation warnings and determine if they come from your own scripts or plugins.

See https://docs.gradle.org/7.5.1/userguide/command_line_interface.html#sec:command_line_warnings

Execution optimizations have been disabled for 1 invalid unit(s) of work during this build to ensure correctness.
Please consult deprecation warnings for more details.

BUILD FAILED in 29m 36s
260 actionable tasks: 171 executed, 77 from cache, 12 up-to-date

Publishing build scan...
https://gradle.com/s/jpfyos45a7pfc

Build step 'Invoke Gradle script' changed build result to FAILURE
Build step 'Invoke Gradle script' marked build as failure

---------------------------------------------------------------------
To unsubscribe, e-mail: builds-unsubscribe@beam.apache.org
For additional commands, e-mail: builds-help@beam.apache.org


Build failed in Jenkins: beam_PostCommit_XVR_Samza #1697

Posted by Apache Jenkins Server <je...@builds.apache.org>.
See <https://ci-beam.apache.org/job/beam_PostCommit_XVR_Samza/1697/display/redirect?page=changes>

Changes:

[noreply] Extend protocol in windmill.proto used by google-cloud-dataflow-java

[noreply] Allow longer Class-Path entries (#23269)


------------------------------------------
[...truncated 1.50 MB...]
INFO     apache_beam.utils.subprocess_server:subprocess_server.py:126 Sep 22, 2022 12:10:08 AM org.apache.beam.sdk.expansion.service.ExpansionService$ExternalTransformRegistrarLoader payloadToConfig
INFO     apache_beam.utils.subprocess_server:subprocess_server.py:126 WARNING: Configuration class 'org.apache.beam.sdk.extensions.sql.expansion.ExternalSqlTransformRegistrar$Configuration' has no schema registered. Attempting to construct with setter approach.
INFO     apache_beam.utils.subprocess_server:subprocess_server.py:126 Sep 22, 2022 12:10:08 AM org.apache.beam.sdk.expansion.service.ExpansionService$ExternalTransformRegistrarLoader payloadToConfig
INFO     apache_beam.utils.subprocess_server:subprocess_server.py:126 WARNING: Configuration class 'org.apache.beam.sdk.extensions.sql.expansion.ExternalSqlTransformRegistrar$Configuration' has no schema registered. Attempting to construct with setter approach.
INFO     apache_beam.utils.subprocess_server:subprocess_server.py:126 Sep 22, 2022 12:10:10 AM org.apache.beam.sdk.extensions.sql.impl.CalciteQueryPlanner convertToBeamRel
INFO     apache_beam.utils.subprocess_server:subprocess_server.py:126 INFO: SQL:
INFO     apache_beam.utils.subprocess_server:subprocess_server.py:126 SELECT `PCOLLECTION`.`a` * `PCOLLECTION`.`a` AS `s`, `LENGTH`(`PCOLLECTION`.`b`) AS `c`
INFO     apache_beam.utils.subprocess_server:subprocess_server.py:126 FROM `beam`.`PCOLLECTION` AS `PCOLLECTION`
INFO     apache_beam.utils.subprocess_server:subprocess_server.py:126 Sep 22, 2022 12:10:10 AM org.apache.beam.sdk.extensions.sql.impl.CalciteQueryPlanner convertToBeamRel
INFO     apache_beam.utils.subprocess_server:subprocess_server.py:126 INFO: SQLPlan>
INFO     apache_beam.utils.subprocess_server:subprocess_server.py:126 LogicalProject(s=[*($0, $0)], c=[LENGTH($1)])
INFO     apache_beam.utils.subprocess_server:subprocess_server.py:126   BeamIOSourceRel(table=[[beam, PCOLLECTION]])
INFO     apache_beam.utils.subprocess_server:subprocess_server.py:126 
INFO     apache_beam.utils.subprocess_server:subprocess_server.py:126 Sep 22, 2022 12:10:10 AM org.apache.beam.sdk.extensions.sql.impl.CalciteQueryPlanner convertToBeamRel
INFO     apache_beam.utils.subprocess_server:subprocess_server.py:126 INFO: BEAMPlan>
INFO     apache_beam.utils.subprocess_server:subprocess_server.py:126 BeamCalcRel(expr#0..1=[{inputs}], expr#2=[*($t0, $t0)], expr#3=[LENGTH($t1)], s=[$t2], c=[$t3])
INFO     apache_beam.utils.subprocess_server:subprocess_server.py:126   BeamIOSourceRel(table=[[beam, PCOLLECTION]])
INFO     apache_beam.utils.subprocess_server:subprocess_server.py:126 
INFO     root:environments.py:376 Default Python SDK image for environment is apache/beam_python3.7_sdk:2.43.0.dev
INFO     root:environments.py:299 No image given, using default Python SDK image
INFO     root:environments.py:376 Default Python SDK image for environment is apache/beam_python3.7_sdk:2.43.0.dev
INFO     root:environments.py:304 Python SDK container image set to "apache/beam_python3.7_sdk:2.43.0.dev" for Docker environment
INFO     apache_beam.runners.portability.fn_api_runner.translations:translations.py:714 ==================== <function pack_combiners at 0x7f5ce21c8680> ====================
INFO     apache_beam.runners.portability.fn_api_runner.translations:translations.py:714 ==================== <function lift_combiners at 0x7f5ce21c8710> ====================
INFO     apache_beam.runners.portability.fn_api_runner.translations:translations.py:714 ==================== <function sort_stages at 0x7f5ce21c8e60> ====================
INFO     apache_beam.runners.portability.portable_runner:portable_runner.py:583 Job state changed to STOPPED
INFO     apache_beam.runners.portability.portable_runner:portable_runner.py:583 Job state changed to STARTING
INFO     apache_beam.runners.portability.portable_runner:portable_runner.py:583 Job state changed to RUNNING
INFO     apache_beam.runners.portability.portable_runner:portable_runner.py:583 Job state changed to DONE
PASSED                                                                   [ 66%]
apache_beam/transforms/sql_test.py::SqlTransformTest::test_tagged_join 
-------------------------------- live log call ---------------------------------
INFO     apache_beam.utils.subprocess_server:subprocess_server.py:239 Using pre-built snapshot at <https://ci-beam.apache.org/job/beam_PostCommit_XVR_Samza/ws/src/sdks/java/extensions/sql/expansion-service/build/libs/beam-sdks-java-extensions-sql-expansion-service-2.43.0-SNAPSHOT.jar>
INFO     root:external.py:773 Starting a JAR-based expansion service from JAR <https://ci-beam.apache.org/job/beam_PostCommit_XVR_Samza/ws/src/sdks/java/extensions/sql/expansion-service/build/libs/beam-sdks-java-extensions-sql-expansion-service-2.43.0-SNAPSHOT.jar> 
INFO     apache_beam.utils.subprocess_server:subprocess_server.py:116 Starting service with ['java' '-jar' '<https://ci-beam.apache.org/job/beam_PostCommit_XVR_Samza/ws/src/sdks/java/extensions/sql/expansion-service/build/libs/beam-sdks-java-extensions-sql-expansion-service-2.43.0-SNAPSHOT.jar'> '48323' '--filesToStage=<https://ci-beam.apache.org/job/beam_PostCommit_XVR_Samza/ws/src/sdks/java/extensions/sql/expansion-service/build/libs/beam-sdks-java-extensions-sql-expansion-service-2.43.0-SNAPSHOT.jar']>
INFO     apache_beam.utils.subprocess_server:subprocess_server.py:126 Starting expansion service at localhost:48323
INFO     apache_beam.utils.subprocess_server:subprocess_server.py:126 Sep 22, 2022 12:10:31 AM org.apache.beam.sdk.expansion.service.ExpansionService loadRegisteredTransforms
INFO     apache_beam.utils.subprocess_server:subprocess_server.py:126 INFO: Registering external transforms: [beam:external:java:sql:v1, beam:transform:org.apache.beam:pubsub_read:v1, beam:transform:org.apache.beam:pubsub_write:v1, beam:transform:org.apache.beam:pubsublite_write:v1, beam:transform:org.apache.beam:pubsublite_read:v1, beam:transform:org.apache.beam:spanner_insert:v1, beam:transform:org.apache.beam:spanner_update:v1, beam:transform:org.apache.beam:spanner_replace:v1, beam:transform:org.apache.beam:spanner_insert_or_update:v1, beam:transform:org.apache.beam:spanner_delete:v1, beam:transform:org.apache.beam:spanner_read:v1, beam:transform:org.apache.beam:kafka_read_with_metadata:v1, beam:transform:org.apache.beam:kafka_read_without_metadata:v1, beam:transform:org.apache.beam:kafka_write:v1, beam:external:java:generate_sequence:v1]
INFO     apache_beam.utils.subprocess_server:subprocess_server.py:126 	beam:external:java:sql:v1: org.apache.beam.sdk.expansion.service.ExpansionService$ExternalTransformRegistrarLoader$1@47eaca72
INFO     apache_beam.utils.subprocess_server:subprocess_server.py:126 	beam:transform:org.apache.beam:pubsub_read:v1: org.apache.beam.sdk.expansion.service.ExpansionService$ExternalTransformRegistrarLoader$1@55141def
INFO     apache_beam.utils.subprocess_server:subprocess_server.py:126 	beam:transform:org.apache.beam:pubsub_write:v1: org.apache.beam.sdk.expansion.service.ExpansionService$ExternalTransformRegistrarLoader$1@55182842
INFO     apache_beam.utils.subprocess_server:subprocess_server.py:126 	beam:transform:org.apache.beam:pubsublite_write:v1: org.apache.beam.sdk.expansion.service.ExpansionService$ExternalTransformRegistrarLoader$1@3270d194
INFO     apache_beam.utils.subprocess_server:subprocess_server.py:126 	beam:transform:org.apache.beam:pubsublite_read:v1: org.apache.beam.sdk.expansion.service.ExpansionService$ExternalTransformRegistrarLoader$1@235834f2
INFO     apache_beam.utils.subprocess_server:subprocess_server.py:126 	beam:transform:org.apache.beam:spanner_insert:v1: org.apache.beam.sdk.expansion.service.ExpansionService$ExternalTransformRegistrarLoader$1@5656be13
INFO     apache_beam.utils.subprocess_server:subprocess_server.py:126 	beam:transform:org.apache.beam:spanner_update:v1: org.apache.beam.sdk.expansion.service.ExpansionService$ExternalTransformRegistrarLoader$1@4218d6a3
INFO     apache_beam.utils.subprocess_server:subprocess_server.py:126 	beam:transform:org.apache.beam:spanner_replace:v1: org.apache.beam.sdk.expansion.service.ExpansionService$ExternalTransformRegistrarLoader$1@76505305
INFO     apache_beam.utils.subprocess_server:subprocess_server.py:126 	beam:transform:org.apache.beam:spanner_insert_or_update:v1: org.apache.beam.sdk.expansion.service.ExpansionService$ExternalTransformRegistrarLoader$1@14cd1699
INFO     apache_beam.utils.subprocess_server:subprocess_server.py:126 	beam:transform:org.apache.beam:spanner_delete:v1: org.apache.beam.sdk.expansion.service.ExpansionService$ExternalTransformRegistrarLoader$1@77888435
INFO     apache_beam.utils.subprocess_server:subprocess_server.py:126 	beam:transform:org.apache.beam:spanner_read:v1: org.apache.beam.sdk.expansion.service.ExpansionService$ExternalTransformRegistrarLoader$1@73a1e9a9
INFO     apache_beam.utils.subprocess_server:subprocess_server.py:126 	beam:transform:org.apache.beam:kafka_read_with_metadata:v1: org.apache.beam.sdk.expansion.service.ExpansionService$ExternalTransformRegistrarLoader$1@71d44a3
INFO     apache_beam.utils.subprocess_server:subprocess_server.py:126 	beam:transform:org.apache.beam:kafka_read_without_metadata:v1: org.apache.beam.sdk.expansion.service.ExpansionService$ExternalTransformRegistrarLoader$1@7b98f307
INFO     apache_beam.utils.subprocess_server:subprocess_server.py:126 	beam:transform:org.apache.beam:kafka_write:v1: org.apache.beam.sdk.expansion.service.ExpansionService$ExternalTransformRegistrarLoader$1@4802796d
INFO     apache_beam.utils.subprocess_server:subprocess_server.py:126 	beam:external:java:generate_sequence:v1: org.apache.beam.sdk.expansion.service.ExpansionService$ExternalTransformRegistrarLoader$1@34123d65
INFO     apache_beam.utils.subprocess_server:subprocess_server.py:126 Sep 22, 2022 12:10:32 AM org.apache.beam.sdk.expansion.service.ExpansionService expand
INFO     apache_beam.utils.subprocess_server:subprocess_server.py:126 INFO: Expanding 'SqlTransform(beam:external:java:sql:v1)' with URN 'beam:external:java:sql:v1'
INFO     apache_beam.utils.subprocess_server:subprocess_server.py:126 Sep 22, 2022 12:10:32 AM org.apache.beam.sdk.expansion.service.ExpansionService$ExternalTransformRegistrarLoader payloadToConfig
INFO     apache_beam.utils.subprocess_server:subprocess_server.py:126 WARNING: Configuration class 'org.apache.beam.sdk.extensions.sql.expansion.ExternalSqlTransformRegistrar$Configuration' has no schema registered. Attempting to construct with setter approach.
INFO     apache_beam.utils.subprocess_server:subprocess_server.py:126 Sep 22, 2022 12:10:33 AM org.apache.beam.sdk.expansion.service.ExpansionService$ExternalTransformRegistrarLoader payloadToConfig
INFO     apache_beam.utils.subprocess_server:subprocess_server.py:126 WARNING: Configuration class 'org.apache.beam.sdk.extensions.sql.expansion.ExternalSqlTransformRegistrar$Configuration' has no schema registered. Attempting to construct with setter approach.
INFO     apache_beam.utils.subprocess_server:subprocess_server.py:126 Sep 22, 2022 12:10:34 AM org.apache.beam.sdk.extensions.sql.impl.CalciteQueryPlanner convertToBeamRel
INFO     apache_beam.utils.subprocess_server:subprocess_server.py:126 INFO: SQL:
INFO     apache_beam.utils.subprocess_server:subprocess_server.py:126 SELECT `simple`.`id` AS `id`, `enrich`.`metadata` AS `metadata`
INFO     apache_beam.utils.subprocess_server:subprocess_server.py:126 FROM `beam`.`simple` AS `simple`
INFO     apache_beam.utils.subprocess_server:subprocess_server.py:126 INNER JOIN `beam`.`enrich` AS `enrich` ON `simple`.`id` = `enrich`.`id`
INFO     apache_beam.utils.subprocess_server:subprocess_server.py:126 Sep 22, 2022 12:10:35 AM org.apache.beam.sdk.extensions.sql.impl.CalciteQueryPlanner convertToBeamRel
INFO     apache_beam.utils.subprocess_server:subprocess_server.py:126 INFO: SQLPlan>
INFO     apache_beam.utils.subprocess_server:subprocess_server.py:126 LogicalProject(id=[$0], metadata=[$4])
INFO     apache_beam.utils.subprocess_server:subprocess_server.py:126   LogicalJoin(condition=[=($0, $3)], joinType=[inner])
INFO     apache_beam.utils.subprocess_server:subprocess_server.py:126     BeamIOSourceRel(table=[[beam, simple]])
INFO     apache_beam.utils.subprocess_server:subprocess_server.py:126     BeamIOSourceRel(table=[[beam, enrich]])
INFO     apache_beam.utils.subprocess_server:subprocess_server.py:126 
INFO     apache_beam.utils.subprocess_server:subprocess_server.py:126 Sep 22, 2022 12:10:35 AM org.apache.beam.sdk.extensions.sql.impl.CalciteQueryPlanner convertToBeamRel
INFO     apache_beam.utils.subprocess_server:subprocess_server.py:126 INFO: BEAMPlan>
INFO     apache_beam.utils.subprocess_server:subprocess_server.py:126 BeamCalcRel(expr#0..4=[{inputs}], id=[$t0], metadata=[$t4])
INFO     apache_beam.utils.subprocess_server:subprocess_server.py:126   BeamCoGBKJoinRel(condition=[=($0, $3)], joinType=[inner])
INFO     apache_beam.utils.subprocess_server:subprocess_server.py:126     BeamIOSourceRel(table=[[beam, simple]])
INFO     apache_beam.utils.subprocess_server:subprocess_server.py:126     BeamIOSourceRel(table=[[beam, enrich]])
INFO     apache_beam.utils.subprocess_server:subprocess_server.py:126 
INFO     root:environments.py:376 Default Python SDK image for environment is apache/beam_python3.7_sdk:2.43.0.dev
INFO     root:environments.py:299 No image given, using default Python SDK image
INFO     root:environments.py:376 Default Python SDK image for environment is apache/beam_python3.7_sdk:2.43.0.dev
INFO     root:environments.py:304 Python SDK container image set to "apache/beam_python3.7_sdk:2.43.0.dev" for Docker environment
INFO     apache_beam.runners.portability.fn_api_runner.translations:translations.py:714 ==================== <function pack_combiners at 0x7f5ce21c8680> ====================
INFO     apache_beam.runners.portability.fn_api_runner.translations:translations.py:714 ==================== <function lift_combiners at 0x7f5ce21c8710> ====================
INFO     apache_beam.runners.portability.fn_api_runner.translations:translations.py:714 ==================== <function sort_stages at 0x7f5ce21c8e60> ====================
INFO     apache_beam.runners.portability.portable_runner:portable_runner.py:583 Job state changed to STOPPED
INFO     apache_beam.runners.portability.portable_runner:portable_runner.py:583 Job state changed to STARTING
INFO     apache_beam.runners.portability.portable_runner:portable_runner.py:583 Job state changed to RUNNING
INFO     apache_beam.runners.portability.portable_runner:portable_runner.py:583 Job state changed to DONE
PASSED                                                                   [ 77%]
apache_beam/transforms/sql_test.py::SqlTransformTest::test_windowing_before_sql 
-------------------------------- live log call ---------------------------------
INFO     apache_beam.utils.subprocess_server:subprocess_server.py:239 Using pre-built snapshot at <https://ci-beam.apache.org/job/beam_PostCommit_XVR_Samza/ws/src/sdks/java/extensions/sql/expansion-service/build/libs/beam-sdks-java-extensions-sql-expansion-service-2.43.0-SNAPSHOT.jar>
INFO     root:external.py:773 Starting a JAR-based expansion service from JAR <https://ci-beam.apache.org/job/beam_PostCommit_XVR_Samza/ws/src/sdks/java/extensions/sql/expansion-service/build/libs/beam-sdks-java-extensions-sql-expansion-service-2.43.0-SNAPSHOT.jar> 
INFO     apache_beam.utils.subprocess_server:subprocess_server.py:116 Starting service with ['java' '-jar' '<https://ci-beam.apache.org/job/beam_PostCommit_XVR_Samza/ws/src/sdks/java/extensions/sql/expansion-service/build/libs/beam-sdks-java-extensions-sql-expansion-service-2.43.0-SNAPSHOT.jar'> '46907' '--filesToStage=<https://ci-beam.apache.org/job/beam_PostCommit_XVR_Samza/ws/src/sdks/java/extensions/sql/expansion-service/build/libs/beam-sdks-java-extensions-sql-expansion-service-2.43.0-SNAPSHOT.jar']>
INFO     apache_beam.utils.subprocess_server:subprocess_server.py:126 Starting expansion service at localhost:46907
INFO     apache_beam.utils.subprocess_server:subprocess_server.py:126 Sep 22, 2022 12:10:57 AM org.apache.beam.sdk.expansion.service.ExpansionService loadRegisteredTransforms
INFO     apache_beam.utils.subprocess_server:subprocess_server.py:126 INFO: Registering external transforms: [beam:external:java:sql:v1, beam:transform:org.apache.beam:pubsub_read:v1, beam:transform:org.apache.beam:pubsub_write:v1, beam:transform:org.apache.beam:pubsublite_write:v1, beam:transform:org.apache.beam:pubsublite_read:v1, beam:transform:org.apache.beam:spanner_insert:v1, beam:transform:org.apache.beam:spanner_update:v1, beam:transform:org.apache.beam:spanner_replace:v1, beam:transform:org.apache.beam:spanner_insert_or_update:v1, beam:transform:org.apache.beam:spanner_delete:v1, beam:transform:org.apache.beam:spanner_read:v1, beam:transform:org.apache.beam:kafka_read_with_metadata:v1, beam:transform:org.apache.beam:kafka_read_without_metadata:v1, beam:transform:org.apache.beam:kafka_write:v1, beam:external:java:generate_sequence:v1]
INFO     apache_beam.utils.subprocess_server:subprocess_server.py:126 	beam:external:java:sql:v1: org.apache.beam.sdk.expansion.service.ExpansionService$ExternalTransformRegistrarLoader$1@47eaca72
INFO     apache_beam.utils.subprocess_server:subprocess_server.py:126 	beam:transform:org.apache.beam:pubsub_read:v1: org.apache.beam.sdk.expansion.service.ExpansionService$ExternalTransformRegistrarLoader$1@55141def
INFO     apache_beam.utils.subprocess_server:subprocess_server.py:126 	beam:transform:org.apache.beam:pubsub_write:v1: org.apache.beam.sdk.expansion.service.ExpansionService$ExternalTransformRegistrarLoader$1@55182842
INFO     apache_beam.utils.subprocess_server:subprocess_server.py:126 	beam:transform:org.apache.beam:pubsublite_write:v1: org.apache.beam.sdk.expansion.service.ExpansionService$ExternalTransformRegistrarLoader$1@3270d194
INFO     apache_beam.utils.subprocess_server:subprocess_server.py:126 	beam:transform:org.apache.beam:pubsublite_read:v1: org.apache.beam.sdk.expansion.service.ExpansionService$ExternalTransformRegistrarLoader$1@235834f2
INFO     apache_beam.utils.subprocess_server:subprocess_server.py:126 	beam:transform:org.apache.beam:spanner_insert:v1: org.apache.beam.sdk.expansion.service.ExpansionService$ExternalTransformRegistrarLoader$1@5656be13
INFO     apache_beam.utils.subprocess_server:subprocess_server.py:126 	beam:transform:org.apache.beam:spanner_update:v1: org.apache.beam.sdk.expansion.service.ExpansionService$ExternalTransformRegistrarLoader$1@4218d6a3
INFO     apache_beam.utils.subprocess_server:subprocess_server.py:126 	beam:transform:org.apache.beam:spanner_replace:v1: org.apache.beam.sdk.expansion.service.ExpansionService$ExternalTransformRegistrarLoader$1@76505305
INFO     apache_beam.utils.subprocess_server:subprocess_server.py:126 	beam:transform:org.apache.beam:spanner_insert_or_update:v1: org.apache.beam.sdk.expansion.service.ExpansionService$ExternalTransformRegistrarLoader$1@14cd1699
INFO     apache_beam.utils.subprocess_server:subprocess_server.py:126 	beam:transform:org.apache.beam:spanner_delete:v1: org.apache.beam.sdk.expansion.service.ExpansionService$ExternalTransformRegistrarLoader$1@77888435
INFO     apache_beam.utils.subprocess_server:subprocess_server.py:126 	beam:transform:org.apache.beam:spanner_read:v1: org.apache.beam.sdk.expansion.service.ExpansionService$ExternalTransformRegistrarLoader$1@73a1e9a9
INFO     apache_beam.utils.subprocess_server:subprocess_server.py:126 	beam:transform:org.apache.beam:kafka_read_with_metadata:v1: org.apache.beam.sdk.expansion.service.ExpansionService$ExternalTransformRegistrarLoader$1@71d44a3
INFO     apache_beam.utils.subprocess_server:subprocess_server.py:126 	beam:transform:org.apache.beam:kafka_read_without_metadata:v1: org.apache.beam.sdk.expansion.service.ExpansionService$ExternalTransformRegistrarLoader$1@7b98f307
INFO     apache_beam.utils.subprocess_server:subprocess_server.py:126 	beam:transform:org.apache.beam:kafka_write:v1: org.apache.beam.sdk.expansion.service.ExpansionService$ExternalTransformRegistrarLoader$1@4802796d
INFO     apache_beam.utils.subprocess_server:subprocess_server.py:126 	beam:external:java:generate_sequence:v1: org.apache.beam.sdk.expansion.service.ExpansionService$ExternalTransformRegistrarLoader$1@34123d65
INFO     apache_beam.utils.subprocess_server:subprocess_server.py:126 Sep 22, 2022 12:10:58 AM org.apache.beam.sdk.expansion.service.ExpansionService expand
INFO     apache_beam.utils.subprocess_server:subprocess_server.py:126 INFO: Expanding 'SqlTransform(beam:external:java:sql:v1)' with URN 'beam:external:java:sql:v1'
INFO     apache_beam.utils.subprocess_server:subprocess_server.py:126 Sep 22, 2022 12:10:58 AM org.apache.beam.sdk.expansion.service.ExpansionService$ExternalTransformRegistrarLoader payloadToConfig
INFO     apache_beam.utils.subprocess_server:subprocess_server.py:126 WARNING: Configuration class 'org.apache.beam.sdk.extensions.sql.expansion.ExternalSqlTransformRegistrar$Configuration' has no schema registered. Attempting to construct with setter approach.
INFO     apache_beam.utils.subprocess_server:subprocess_server.py:126 Sep 22, 2022 12:10:58 AM org.apache.beam.sdk.expansion.service.ExpansionService$ExternalTransformRegistrarLoader payloadToConfig
INFO     apache_beam.utils.subprocess_server:subprocess_server.py:126 WARNING: Configuration class 'org.apache.beam.sdk.extensions.sql.expansion.ExternalSqlTransformRegistrar$Configuration' has no schema registered. Attempting to construct with setter approach.
INFO     apache_beam.utils.subprocess_server:subprocess_server.py:126 Sep 22, 2022 12:11:00 AM org.apache.beam.sdk.extensions.sql.impl.CalciteQueryPlanner convertToBeamRel
INFO     apache_beam.utils.subprocess_server:subprocess_server.py:126 INFO: SQL:
INFO     apache_beam.utils.subprocess_server:subprocess_server.py:126 SELECT COUNT(*) AS `count`
INFO     apache_beam.utils.subprocess_server:subprocess_server.py:126 FROM `beam`.`PCOLLECTION` AS `PCOLLECTION`
INFO     apache_beam.utils.subprocess_server:subprocess_server.py:126 Sep 22, 2022 12:11:00 AM org.apache.beam.sdk.extensions.sql.impl.CalciteQueryPlanner convertToBeamRel
INFO     apache_beam.utils.subprocess_server:subprocess_server.py:126 INFO: SQLPlan>
INFO     apache_beam.utils.subprocess_server:subprocess_server.py:126 LogicalAggregate(group=[{}], count=[COUNT()])
INFO     apache_beam.utils.subprocess_server:subprocess_server.py:126   BeamIOSourceRel(table=[[beam, PCOLLECTION]])
INFO     apache_beam.utils.subprocess_server:subprocess_server.py:126 
INFO     apache_beam.utils.subprocess_server:subprocess_server.py:126 Sep 22, 2022 12:11:00 AM org.apache.beam.sdk.extensions.sql.impl.CalciteQueryPlanner convertToBeamRel
INFO     apache_beam.utils.subprocess_server:subprocess_server.py:126 INFO: BEAMPlan>
INFO     apache_beam.utils.subprocess_server:subprocess_server.py:126 BeamAggregationRel(group=[{}], count=[COUNT()])
INFO     apache_beam.utils.subprocess_server:subprocess_server.py:126   BeamIOSourceRel(table=[[beam, PCOLLECTION]])
INFO     apache_beam.utils.subprocess_server:subprocess_server.py:126 
INFO     root:environments.py:376 Default Python SDK image for environment is apache/beam_python3.7_sdk:2.43.0.dev
INFO     root:environments.py:299 No image given, using default Python SDK image
INFO     root:environments.py:376 Default Python SDK image for environment is apache/beam_python3.7_sdk:2.43.0.dev
INFO     root:environments.py:304 Python SDK container image set to "apache/beam_python3.7_sdk:2.43.0.dev" for Docker environment
INFO     apache_beam.runners.portability.fn_api_runner.translations:translations.py:714 ==================== <function pack_combiners at 0x7f5ce21c8680> ====================
INFO     apache_beam.runners.portability.fn_api_runner.translations:translations.py:714 ==================== <function lift_combiners at 0x7f5ce21c8710> ====================
INFO     apache_beam.runners.portability.fn_api_runner.translations:translations.py:714 ==================== <function sort_stages at 0x7f5ce21c8e60> ====================
INFO     apache_beam.runners.portability.portable_runner:portable_runner.py:583 Job state changed to STOPPED
INFO     apache_beam.runners.portability.portable_runner:portable_runner.py:583 Job state changed to STARTING
INFO     apache_beam.runners.portability.portable_runner:portable_runner.py:583 Job state changed to RUNNING
INFO     apache_beam.runners.portability.portable_runner:portable_runner.py:583 Job state changed to DONE
PASSED                                                                   [ 88%]
apache_beam/transforms/sql_test.py::SqlTransformTest::test_zetasql_generate_data 
-------------------------------- live log call ---------------------------------
INFO     apache_beam.utils.subprocess_server:subprocess_server.py:239 Using pre-built snapshot at <https://ci-beam.apache.org/job/beam_PostCommit_XVR_Samza/ws/src/sdks/java/extensions/sql/expansion-service/build/libs/beam-sdks-java-extensions-sql-expansion-service-2.43.0-SNAPSHOT.jar>
INFO     root:external.py:773 Starting a JAR-based expansion service from JAR <https://ci-beam.apache.org/job/beam_PostCommit_XVR_Samza/ws/src/sdks/java/extensions/sql/expansion-service/build/libs/beam-sdks-java-extensions-sql-expansion-service-2.43.0-SNAPSHOT.jar> 
INFO     apache_beam.utils.subprocess_server:subprocess_server.py:116 Starting service with ['java' '-jar' '<https://ci-beam.apache.org/job/beam_PostCommit_XVR_Samza/ws/src/sdks/java/extensions/sql/expansion-service/build/libs/beam-sdks-java-extensions-sql-expansion-service-2.43.0-SNAPSHOT.jar'> '38779' '--filesToStage=<https://ci-beam.apache.org/job/beam_PostCommit_XVR_Samza/ws/src/sdks/java/extensions/sql/expansion-service/build/libs/beam-sdks-java-extensions-sql-expansion-service-2.43.0-SNAPSHOT.jar']>
INFO     apache_beam.utils.subprocess_server:subprocess_server.py:126 Starting expansion service at localhost:38779
INFO     apache_beam.utils.subprocess_server:subprocess_server.py:126 Sep 22, 2022 12:11:23 AM org.apache.beam.sdk.expansion.service.ExpansionService loadRegisteredTransforms
INFO     apache_beam.utils.subprocess_server:subprocess_server.py:126 INFO: Registering external transforms: [beam:external:java:sql:v1, beam:transform:org.apache.beam:pubsub_read:v1, beam:transform:org.apache.beam:pubsub_write:v1, beam:transform:org.apache.beam:pubsublite_write:v1, beam:transform:org.apache.beam:pubsublite_read:v1, beam:transform:org.apache.beam:spanner_insert:v1, beam:transform:org.apache.beam:spanner_update:v1, beam:transform:org.apache.beam:spanner_replace:v1, beam:transform:org.apache.beam:spanner_insert_or_update:v1, beam:transform:org.apache.beam:spanner_delete:v1, beam:transform:org.apache.beam:spanner_read:v1, beam:transform:org.apache.beam:kafka_read_with_metadata:v1, beam:transform:org.apache.beam:kafka_read_without_metadata:v1, beam:transform:org.apache.beam:kafka_write:v1, beam:external:java:generate_sequence:v1]
INFO     apache_beam.utils.subprocess_server:subprocess_server.py:126 	beam:external:java:sql:v1: org.apache.beam.sdk.expansion.service.ExpansionService$ExternalTransformRegistrarLoader$1@47eaca72
INFO     apache_beam.utils.subprocess_server:subprocess_server.py:126 	beam:transform:org.apache.beam:pubsub_read:v1: org.apache.beam.sdk.expansion.service.ExpansionService$ExternalTransformRegistrarLoader$1@55141def
INFO     apache_beam.utils.subprocess_server:subprocess_server.py:126 	beam:transform:org.apache.beam:pubsub_write:v1: org.apache.beam.sdk.expansion.service.ExpansionService$ExternalTransformRegistrarLoader$1@55182842
INFO     apache_beam.utils.subprocess_server:subprocess_server.py:126 	beam:transform:org.apache.beam:pubsublite_write:v1: org.apache.beam.sdk.expansion.service.ExpansionService$ExternalTransformRegistrarLoader$1@3270d194
INFO     apache_beam.utils.subprocess_server:subprocess_server.py:126 	beam:transform:org.apache.beam:pubsublite_read:v1: org.apache.beam.sdk.expansion.service.ExpansionService$ExternalTransformRegistrarLoader$1@235834f2
INFO     apache_beam.utils.subprocess_server:subprocess_server.py:126 	beam:transform:org.apache.beam:spanner_insert:v1: org.apache.beam.sdk.expansion.service.ExpansionService$ExternalTransformRegistrarLoader$1@5656be13
INFO     apache_beam.utils.subprocess_server:subprocess_server.py:126 	beam:transform:org.apache.beam:spanner_update:v1: org.apache.beam.sdk.expansion.service.ExpansionService$ExternalTransformRegistrarLoader$1@4218d6a3
INFO     apache_beam.utils.subprocess_server:subprocess_server.py:126 	beam:transform:org.apache.beam:spanner_replace:v1: org.apache.beam.sdk.expansion.service.ExpansionService$ExternalTransformRegistrarLoader$1@76505305
INFO     apache_beam.utils.subprocess_server:subprocess_server.py:126 	beam:transform:org.apache.beam:spanner_insert_or_update:v1: org.apache.beam.sdk.expansion.service.ExpansionService$ExternalTransformRegistrarLoader$1@14cd1699
INFO     apache_beam.utils.subprocess_server:subprocess_server.py:126 	beam:transform:org.apache.beam:spanner_delete:v1: org.apache.beam.sdk.expansion.service.ExpansionService$ExternalTransformRegistrarLoader$1@77888435
INFO     apache_beam.utils.subprocess_server:subprocess_server.py:126 	beam:transform:org.apache.beam:spanner_read:v1: org.apache.beam.sdk.expansion.service.ExpansionService$ExternalTransformRegistrarLoader$1@73a1e9a9
INFO     apache_beam.utils.subprocess_server:subprocess_server.py:126 	beam:transform:org.apache.beam:kafka_read_with_metadata:v1: org.apache.beam.sdk.expansion.service.ExpansionService$ExternalTransformRegistrarLoader$1@71d44a3
INFO     apache_beam.utils.subprocess_server:subprocess_server.py:126 	beam:transform:org.apache.beam:kafka_read_without_metadata:v1: org.apache.beam.sdk.expansion.service.ExpansionService$ExternalTransformRegistrarLoader$1@7b98f307
INFO     apache_beam.utils.subprocess_server:subprocess_server.py:126 	beam:transform:org.apache.beam:kafka_write:v1: org.apache.beam.sdk.expansion.service.ExpansionService$ExternalTransformRegistrarLoader$1@4802796d
INFO     apache_beam.utils.subprocess_server:subprocess_server.py:126 	beam:external:java:generate_sequence:v1: org.apache.beam.sdk.expansion.service.ExpansionService$ExternalTransformRegistrarLoader$1@34123d65
INFO     apache_beam.utils.subprocess_server:subprocess_server.py:126 Sep 22, 2022 12:11:24 AM org.apache.beam.sdk.expansion.service.ExpansionService expand
INFO     apache_beam.utils.subprocess_server:subprocess_server.py:126 INFO: Expanding 'SqlTransform(beam:external:java:sql:v1)' with URN 'beam:external:java:sql:v1'
INFO     apache_beam.utils.subprocess_server:subprocess_server.py:126 Sep 22, 2022 12:11:24 AM org.apache.beam.sdk.expansion.service.ExpansionService$ExternalTransformRegistrarLoader payloadToConfig
INFO     apache_beam.utils.subprocess_server:subprocess_server.py:126 WARNING: Configuration class 'org.apache.beam.sdk.extensions.sql.expansion.ExternalSqlTransformRegistrar$Configuration' has no schema registered. Attempting to construct with setter approach.
INFO     apache_beam.utils.subprocess_server:subprocess_server.py:126 Sep 22, 2022 12:11:24 AM org.apache.beam.sdk.expansion.service.ExpansionService$ExternalTransformRegistrarLoader payloadToConfig
INFO     apache_beam.utils.subprocess_server:subprocess_server.py:126 WARNING: Configuration class 'org.apache.beam.sdk.extensions.sql.expansion.ExternalSqlTransformRegistrar$Configuration' has no schema registered. Attempting to construct with setter approach.
INFO     apache_beam.utils.subprocess_server:subprocess_server.py:126 Sep 22, 2022 12:11:26 AM com.google.zetasql.io.grpc.NameResolverRegistry getDefaultRegistry
INFO     apache_beam.utils.subprocess_server:subprocess_server.py:126 WARNING: No NameResolverProviders found via ServiceLoader, including for DNS. This is probably due to a broken build. If using ProGuard, check your configuration
INFO     apache_beam.utils.subprocess_server:subprocess_server.py:126 Sep 22, 2022 12:11:28 AM org.apache.beam.sdk.extensions.sql.zetasql.ZetaSQLQueryPlanner convertToBeamRelInternal
INFO     apache_beam.utils.subprocess_server:subprocess_server.py:126 INFO: BEAMPlan>
INFO     apache_beam.utils.subprocess_server:subprocess_server.py:126 BeamZetaSqlCalcRel(expr#0=[{inputs}], expr#1=[1:BIGINT], expr#2=['foo':VARCHAR], expr#3=[3.1400000000000001243E0:DOUBLE], int=[$t1], str=[$t2], flt=[$t3])
INFO     apache_beam.utils.subprocess_server:subprocess_server.py:126   BeamValuesRel(tuples=[[{ 0 }]])
INFO     apache_beam.utils.subprocess_server:subprocess_server.py:126 
INFO     root:environments.py:376 Default Python SDK image for environment is apache/beam_python3.7_sdk:2.43.0.dev
INFO     root:environments.py:299 No image given, using default Python SDK image
INFO     root:environments.py:376 Default Python SDK image for environment is apache/beam_python3.7_sdk:2.43.0.dev
INFO     root:environments.py:304 Python SDK container image set to "apache/beam_python3.7_sdk:2.43.0.dev" for Docker environment
INFO     apache_beam.runners.portability.fn_api_runner.translations:translations.py:714 ==================== <function pack_combiners at 0x7f5ce21c8680> ====================
INFO     apache_beam.runners.portability.fn_api_runner.translations:translations.py:714 ==================== <function lift_combiners at 0x7f5ce21c8710> ====================
INFO     apache_beam.runners.portability.fn_api_runner.translations:translations.py:714 ==================== <function sort_stages at 0x7f5ce21c8e60> ====================
INFO     apache_beam.runners.portability.portable_runner:portable_runner.py:583 Job state changed to STOPPED
INFO     apache_beam.runners.portability.portable_runner:portable_runner.py:583 Job state changed to STARTING
INFO     apache_beam.runners.portability.portable_runner:portable_runner.py:583 Job state changed to RUNNING
INFO     apache_beam.runners.portability.portable_runner:portable_runner.py:583 Job state changed to DONE
PASSED                                                                   [100%]

=============================== warnings summary ===============================
../../build/gradleenv/1922375555/lib/python3.7/site-packages/hdfs/config.py:15
  <https://ci-beam.apache.org/job/beam_PostCommit_XVR_Samza/ws/src/build/gradleenv/1922375555/lib/python3.7/site-packages/hdfs/config.py>:15: DeprecationWarning: the imp module is deprecated in favour of importlib; see the module's documentation for alternative uses
    from imp import load_source

../../build/gradleenv/1922375555/lib/python3.7/site-packages/google/api_core/grpc_helpers.py:42
  <https://ci-beam.apache.org/job/beam_PostCommit_XVR_Samza/ws/src/build/gradleenv/1922375555/lib/python3.7/site-packages/google/api_core/grpc_helpers.py>:42: DeprecationWarning: Support for grpcio-gcp is deprecated. This feature will be
              removed from `google-api-core` after January 1, 2024. If you need to
              continue to use this feature, please pin to a specific version of
              `google-api-core`.
    DeprecationWarning,

-- Docs: https://docs.pytest.org/en/stable/how-to/capture-warnings.html
- generated xml file: <https://ci-beam.apache.org/job/beam_PostCommit_XVR_Samza/ws/src/sdks/python/pytest_xlangSqlValidateRunner.xml> -
==== 9 passed, 3 skipped, 6657 deselected, 2 warnings in 228.06s (0:03:48) =====

> Task :runners:samza:job-server:samzaJobServerCleanup
Stopping job server pid: 1161023.

> Task :runners:samza:job-server:validatesCrossLanguageRunnerCleanup
Stopping expansion service pid: 1171247.
Stopping expansion service pid: 1171248.

FAILURE: Build failed with an exception.

* Where:
Build file '<https://ci-beam.apache.org/job/beam_PostCommit_XVR_Samza/ws/src/sdks/go/test/build.gradle'> line: 195

* What went wrong:
Execution failed for task ':runners:samza:job-server:validatesCrossLanguageRunnerGoUsingJava'.
> Process 'command 'sh'' finished with non-zero exit value 1

* Try:
> Run with --stacktrace option to get the stack trace.
> Run with --info or --debug option to get more log output.

* Get more help at https://help.gradle.org

Deprecated Gradle features were used in this build, making it incompatible with Gradle 8.0.

You can use '--warning-mode all' to show the individual deprecation warnings and determine if they come from your own scripts or plugins.

See https://docs.gradle.org/7.5.1/userguide/command_line_interface.html#sec:command_line_warnings

Execution optimizations have been disabled for 1 invalid unit(s) of work during this build to ensure correctness.
Please consult deprecation warnings for more details.

BUILD FAILED in 29m 26s
260 actionable tasks: 171 executed, 77 from cache, 12 up-to-date

Publishing build scan...
https://gradle.com/s/7aaftvxwixrum

Build step 'Invoke Gradle script' changed build result to FAILURE
Build step 'Invoke Gradle script' marked build as failure

---------------------------------------------------------------------
To unsubscribe, e-mail: builds-unsubscribe@beam.apache.org
For additional commands, e-mail: builds-help@beam.apache.org


Build failed in Jenkins: beam_PostCommit_XVR_Samza #1696

Posted by Apache Jenkins Server <je...@builds.apache.org>.
See <https://ci-beam.apache.org/job/beam_PostCommit_XVR_Samza/1696/display/redirect?page=changes>

Changes:

[noreply] [Java SDK core] emit watermark from PeriodicSequence (#23301) (#23302)


------------------------------------------
[...truncated 1.37 MB...]
        urn: "beam:coders:javasdk:0.1"
        payload: "\202SNAPPY\000\000\000\000\001\000\000\000\001\000\000\001.\307\003\360@\254\355\000\005sr\000&org.apache.beam.sdk.coders.SnappyCoder1\033\243\356\177\362\366,\002\000\001L\000\ninner\005\030 t\000\"Lorg/a\005B\000/\001B\020/sdk/\tB\000/\005$\020;xr\000*ng\000 tructured\005/8s\277\022\016\325\3246\021\002\000\000xr\000 j9\000\005/\034C\335\325\211\256\274~\370\001/\020psr\000,j1\000,Serializable\005= \010\364 \216\305ynl\002\001\327\\\004typet\000\021Ljava/lang/Class\001\300n'\001\024Custom\005PPj\260\010\235\013;\035\013\002\000\000xq\000~\000\003vr\000$N\221\000\\io.BoundedSource!`v\023\177\370QA\0019\010r\000\035Z3\000\t,0\020\213\372\020Y\214\347\323\002\000\000xp"
      >
    >
  >
  coders: <
    key: "DthICmFCjaTimestampedValueCoder"
    value: <
      spec: <
        urn: "beam:coders:javasdk:0.1"
        payload: "\202SNAPPY\000\000\000\000\001\000\000\000\001\000\000\001?\315\003\270\254\355\000\005sr\000Aorg.apache.beam.sdk.values.TimestampedV\001\022\000$>\021\000LCoder\364\376\202p\274iX-\002\000\001L\000\nv\001)\005\030\034t\000\"Lorg/\t]\000/\001],/sdk/coders/\005$\020;xr\000*N\202\000\t%(.Structured\005/8s\277\022\016\325\3246\021\002\000\000xr\000 j9\000\005/\034C\335\325\211\256\274~\370\001/\020psr\000,j1\000(Serializabl\t\277\034\010\364 \216\305ynl\005\327\\\004typet\000\021Ljava/lang/Class\001\300\000&jV\000\024Custom\005\215Pj\260\010\235\013;\035\013\002\000\000xq\000~\000\003vr\000;N;\000Pio.BoundedReadFromUnb\t\021`Source$Shardd\236\240U\205\000j\363\002\000\000xp"
      >
    >
  >
  coders: <
    key: "DthICmFCjaValueWithRecordIdCoder"
    value: <
      spec: <
        urn: "beam:coders:javasdk:0.1"
        payload: "\202SNAPPY\000\000\000\000\001\000\000\000\001\000\000\001\213\311\005\320\254\355\000\005sr\000Corg.apache.beam.sdk.values.ValueWithRecordId$B\022\000LCoder{\343\376bQ\014\204>\002\000\002L\000\007i\t\025\034t\000+Lorg/\t\\\000/\001\\\024/sdk/c\0012(s/ByteArray\005B\014;L\000\n\005u\005\016\010t\000\"n;\000\005$\020;xr\000*N\274\000\t`(.Structured\005/8s\277\022\016\325\3246\021\002\000\000xr\000 j9\000\005/\034C\335\325\211\256\274~\370\001/\020psr\000)j1\0006\312\000\034\351\277\005|\263\3746\333\001:\010r\000&j8\000\024Atomic\005o\034\307\354\265\314\205tPF\0015 q\000~\000\003sr\000-N;\000$io.kafka.K\001\006\000R%\227\005B<I\320\251Y\032\341{#\002\000\001L\000\007kv\005\025\010t\000$nH\001\000K\t&\000;\025s\000\"Ns\000-P\r- j\000\275\271\035\243\3126\002!\353\010\010ke)\277\001\264\000\0022\303\001\005\022\025Y\000(jY\000\030Nullabl)\372\034E\333\0336>\220\247\007\005\307]\022.O\000\001\014,\006sq\000~\000\016q\000~\000\020"
      >
    >
  >
  coders: <
    key: "DthICmFCjaVarIntCoder"
    value: <
      spec: <
        urn: "beam:coders:javasdk:0.1"
        payload: "\202SNAPPY\000\000\000\000\001\000\000\000\001\000\000\000\210\330\001\350\254\355\000\005sr\000&org.apache.beam.sdk.coders.VarIntCoder\300K2\332\251KVh\002\000\000xrr5\000\024Atomic\0055 \307\354\265\314\205tPF\002\0055\000*jj\000$Structured\0059\034s\277\022\016\325\3246\021\t9\000 j9\000\005/0C\335\325\211\256\274~\370\002\000\000xp"
      >
    >
  >
  coders: <
    key: "DthICmFCjaVoidCoder"
    value: <
      spec: <
        urn: "beam:coders:javasdk:0.1"
        payload: "\202SNAPPY\000\000\000\000\001\000\000\000\001\000\000\000\210\326\001\350\254\355\000\005sr\000$org.apache.beam.sdk.coders.VoidCoder\271\277U\233\350\r\257U\002\000\000xr\000&j3\000\024Atomic\0055 \307\354\265\314\205tPF\002\0055\000*j5\000$Structured\0059\034s\277\022\016\325\3246\021\t9\000 j9\000\005/0C\335\325\211\256\274~\370\002\000\000xp"
      >
    >
  >
  coders: <
    key: "c0"
    value: <
      spec: <
        urn: "beam:coder:bytes:v1"
      >
    >
  >
  coders: <
    key: "c1"
    value: <
      spec: <
        urn: "beam:coder:global_window:v1"
      >
    >
  >
  coders: <
    key: "c2"
    value: <
      spec: <
        urn: "beam:go:coder:custom:v1"
        payload: "Cgd2YXJpbnR6EgIIAhpdCklnaXRodWIuY29tL2FwYWNoZS9iZWFtL3Nka3MvdjIvZ28vcGtnL2JlYW0vY29yZS9ydW50aW1lL2NvZGVyeC5lbmNWYXJJbnRaEhAIFiIECBlADyoGCBQSAggIImkKSWdpdGh1Yi5jb20vYXBhY2hlL2JlYW0vc2Rrcy92Mi9nby9wa2cvYmVhbS9jb3JlL3J1bnRpbWUvY29kZXJ4LmRlY1ZhckludFoSHAgWIgQIGUADIgYIFBICCAgqBAgZQA8qBAgZQAE="
      >
    >
  >
  coders: <
    key: "c3"
    value: <
      spec: <
        urn: "beam:coder:length_prefix:v1"
      >
      component_coder_ids: "c2"
    >
  >
  coders: <
    key: "c4"
    value: <
      spec: <
        urn: "beam:coder:kv:v1"
      >
      component_coder_ids: "c0"
      component_coder_ids: "c0"
    >
  >
  environments: <
    key: "DthICmFCjabeam:env:docker:v1"
    value: <
      urn: "beam:env:docker:v1"
      payload: "\n apache/beam_java8_sdk:2.43.0.dev"
      capabilities: "beam:coder:bytes:v1"
      capabilities: "beam:coder:bool:v1"
      capabilities: "beam:coder:varint:v1"
      capabilities: "beam:coder:string_utf8:v1"
      capabilities: "beam:coder:iterable:v1"
      capabilities: "beam:coder:timer:v1"
      capabilities: "beam:coder:kv:v1"
      capabilities: "beam:coder:length_prefix:v1"
      capabilities: "beam:coder:global_window:v1"
      capabilities: "beam:coder:interval_window:v1"
      capabilities: "beam:coder:custom_window:v1"
      capabilities: "beam:coder:windowed_value:v1"
      capabilities: "beam:coder:double:v1"
      capabilities: "beam:coder:row:v1"
      capabilities: "beam:coder:param_windowed_value:v1"
      capabilities: "beam:coder:state_backed_iterable:v1"
      capabilities: "beam:coder:sharded_key:v1"
      capabilities: "beam:coder:nullable:v1"
      capabilities: "beam:protocol:multi_core_bundle_processing:v1"
      capabilities: "beam:protocol:progress_reporting:v1"
      capabilities: "beam:protocol:harness_monitoring_infos:v1"
      capabilities: "beam:protocol:control_request_elements_embedding:v1"
      capabilities: "beam:protocol:state_caching:v1"
      capabilities: "beam:version:sdk_base:apache/beam_java8_sdk:2.43.0.dev"
      capabilities: "beam:transform:sdf_truncate_sized_restrictions:v1"
      capabilities: "beam:transform:to_string:v1"
      dependencies: <
        type_urn: "beam:artifact:type:file:v1"
        type_payload: "\nL/tmp/artifacts/icedtea-sound-CGRxIE9edPHnbxQhM-L5mp8h21H-ySB79uQtSquPV_Q.jar\022@086471204f5e74f1e76f142133e2f99a9f21db51fec9207bf6e42d4aab8f57f4"
        role_urn: "beam:artifact:role:staging_to:v1"
        role_payload: "\n=icedtea-sound-CGRxIE9edPHnbxQhM-L5mp8h21H-ySB79uQtSquPV_Q.jar"
      >
      dependencies: <
        type_urn: "beam:artifact:type:file:v1"
        type_payload: "\nF/tmp/artifacts/jaccess-FBI0Bb27lF3oEBieWAi7SP8X1zBR8k4BJQOVpsoK9a0.jar\022@14123405bdbb945de810189e5808bb48ff17d73051f24e01250395a6ca0af5ad"
        role_urn: "beam:artifact:role:staging_to:v1"
        role_payload: "\n7jaccess-FBI0Bb27lF3oEBieWAi7SP8X1zBR8k4BJQOVpsoK9a0.jar"
      >
      dependencies: <
        type_urn: "beam:artifact:type:file:v1"
        type_payload: "\nI/tmp/artifacts/localedata-kJ2mc8rBH5-IklhfR1XzNotlIQ_mnVMA-pgaXv2r8Ag.jar\022@909da673cac11f9f8892585f4755f3368b65210fe69d5300fa981a5efdabf008"
        role_urn: "beam:artifact:role:staging_to:v1"
        role_payload: "\n:localedata-kJ2mc8rBH5-IklhfR1XzNotlIQ_mnVMA-pgaXv2r8Ag.jar"
      >
      dependencies: <
        type_urn: "beam:artifact:type:file:v1"
        type_payload: "\nF/tmp/artifacts/nashorn-B0CAb3QpJET_6VsT3hcC_89VtvhV616H8N2bHAIaqWo.jar\022@0740806f74292444ffe95b13de1702ffcf55b6f855eb5e87f0dd9b1c021aa96a"
        role_urn: "beam:artifact:role:staging_to:v1"
        role_payload: "\n7nashorn-B0CAb3QpJET_6VsT3hcC_89VtvhV616H8N2bHAIaqWo.jar"
      >
      dependencies: <
        type_urn: "beam:artifact:type:file:v1"
        type_payload: "\nG/tmp/artifacts/cldrdata-gclqV9lOGqQOKesG-a6TAUTGEYlyIDqpyd4M_k7gtWo.jar\022@81c96a57d94e1aa40e29eb06f9ae930144c6118972203aa9c9de0cfe4ee0b56a"
        role_urn: "beam:artifact:role:staging_to:v1"
        role_payload: "\n8cldrdata-gclqV9lOGqQOKesG-a6TAUTGEYlyIDqpyd4M_k7gtWo.jar"
      >
      dependencies: <
        type_urn: "beam:artifact:type:file:v1"
        type_payload: "\nD/tmp/artifacts/dnsns-byzoQxdXengTvA5IlbH9gSIzfhNQElRYltuMJN0vjcc.jar\022@6f2ce84317577a7813bc0e4895b1fd8122337e135012545896db8c24dd2f8dc7"
        role_urn: "beam:artifact:role:staging_to:v1"
        role_payload: "\n5dnsns-byzoQxdXengTvA5IlbH9gSIzfhNQElRYltuMJN0vjcc.jar"
      >
      dependencies: <
        type_urn: "beam:artifact:type:file:v1"
        type_payload: "\nr/tmp/artifacts/beam-sdks-java-io-expansion-service-2.43.0-SNAPSHOT-tHeIUHwmCvFF1o46J-Bf8s1YRi70qM-8GKd9uwGn1iQ.jar\022@b47788507c260af145d68e3a27e05ff2cd58462ef4a8cfbc18a77dbb01a7d624"
        role_urn: "beam:artifact:role:staging_to:v1"
        role_payload: "\ncbeam-sdks-java-io-expansion-service-2.43.0-SNAPSHOT-tHeIUHwmCvFF1o46J-Bf8s1YRi70qM-8GKd9uwGn1iQ.jar"
      >
    >
  >
  environments: <
    key: "go"
    value: <
      urn: "beam:env:docker:v1"
      payload: "\n\026apache/beam_go_sdk:dev"
      capabilities: "beam:protocol:progress_reporting:v1"
      capabilities: "beam:protocol:multi_core_bundle_processing:v1"
      capabilities: "beam:transform:sdf_truncate_sized_restrictions:v1"
      capabilities: "beam:protocol:worker_status:v1"
      capabilities: "beam:protocol:monitoring_info_short_ids:v1"
      capabilities: "beam:version:sdk_base:go"
      capabilities: "beam:coder:bytes:v1"
      capabilities: "beam:coder:bool:v1"
      capabilities: "beam:coder:varint:v1"
      capabilities: "beam:coder:double:v1"
      capabilities: "beam:coder:string_utf8:v1"
      capabilities: "beam:coder:length_prefix:v1"
      capabilities: "beam:coder:kv:v1"
      capabilities: "beam:coder:iterable:v1"
      capabilities: "beam:coder:state_backed_iterable:v1"
      capabilities: "beam:coder:windowed_value:v1"
      capabilities: "beam:coder:global_window:v1"
      capabilities: "beam:coder:interval_window:v1"
      capabilities: "beam:coder:row:v1"
      capabilities: "beam:coder:nullable:v1"
      dependencies: <
        type_urn: "beam:artifact:type:file:v1"
        role_urn: "beam:artifact:role:go_worker_binary:v1"
      >
    >
  >
>
root_transform_ids: "s1"
root_transform_ids: "e4"
root_transform_ids: "e5"
root_transform_ids: "s3"
requirements: "beam:requirement:pardo:splittable_dofn:v1"
2022/09/21 17:58:01 Cross-compiling <https://ci-beam.apache.org/job/beam_PostCommit_XVR_Samza/ws/src/sdks/go/test/integration/io/xlang/kafka/kafka_test.go> as /tmp/worker-2-1663783081755470323
2022/09/21 17:58:03 Prepared job with id: go-testkafkaio_basicreadwrite-5_22bc2468-852d-4e4a-a4a6-204078f56f2b and staging token: go-testkafkaio_basicreadwrite-5_22bc2468-852d-4e4a-a4a6-204078f56f2b
2022/09/21 17:58:03 Staged binary artifact with token: 
2022/09/21 17:58:03 Submitted job: go0testkafkaio0basicreadwrite05-jenkins-0921175803-ec7958a6_1ec4f1a1-a3b6-484d-a3c7-930faabaf987
2022/09/21 17:58:03 Job state: STOPPED
2022/09/21 17:58:03 Job state: STARTING
2022/09/21 17:58:03 Job state: RUNNING
2022/09/21 17:58:14 Job state: DONE
--- PASS: TestKafkaIO_BasicReadWrite (30.00s)
PASS
ok  	github.com/apache/beam/sdks/v2/go/test/integration/io/xlang/kafka	36.040s
FAIL

> Task :runners:samza:job-server:validatesCrossLanguageRunnerGoUsingJava FAILED
> Task :runners:samza:job-server:validatesCrossLanguageRunnerJavaUsingPython
> Task :runners:samza:job-server:validatesCrossLanguageRunnerPythonUsingJava
> Task :runners:samza:job-server:validatesCrossLanguageRunnerPythonUsingSql
> Task :runners:samza:job-server:samzaJobServerCleanup
> Task :runners:samza:job-server:validatesCrossLanguageRunnerCleanup

FAILURE: Build failed with an exception.

* Where:
Build file '<https://ci-beam.apache.org/job/beam_PostCommit_XVR_Samza/ws/src/sdks/go/test/build.gradle'> line: 195

* What went wrong:
Execution failed for task ':runners:samza:job-server:validatesCrossLanguageRunnerGoUsingJava'.
> Process 'command 'sh'' finished with non-zero exit value 1

* Try:
> Run with --stacktrace option to get the stack trace.
> Run with --info or --debug option to get more log output.

* Get more help at https://help.gradle.org

Deprecated Gradle features were used in this build, making it incompatible with Gradle 8.0.

You can use '--warning-mode all' to show the individual deprecation warnings and determine if they come from your own scripts or plugins.

See https://docs.gradle.org/7.5.1/userguide/command_line_interface.html#sec:command_line_warnings

Execution optimizations have been disabled for 1 invalid unit(s) of work during this build to ensure correctness.
Please consult deprecation warnings for more details.

BUILD FAILED in 30m 26s
260 actionable tasks: 188 executed, 60 from cache, 12 up-to-date

Publishing build scan...
https://gradle.com/s/okgfgsa6fs4ms

Build step 'Invoke Gradle script' changed build result to FAILURE
Build step 'Invoke Gradle script' marked build as failure

---------------------------------------------------------------------
To unsubscribe, e-mail: builds-unsubscribe@beam.apache.org
For additional commands, e-mail: builds-help@beam.apache.org


Build failed in Jenkins: beam_PostCommit_XVR_Samza #1695

Posted by Apache Jenkins Server <je...@builds.apache.org>.
See <https://ci-beam.apache.org/job/beam_PostCommit_XVR_Samza/1695/display/redirect>

Changes:


------------------------------------------
[...truncated 1.39 MB...]
        urn: "beam:coder:kv:v1"
      >
      component_coder_ids: "c0"
      component_coder_ids: "c0"
    >
  >
  environments: <
    key: "aJALelSFCLbeam:env:docker:v1"
    value: <
      urn: "beam:env:docker:v1"
      payload: "\n apache/beam_java8_sdk:2.43.0.dev"
      capabilities: "beam:coder:bytes:v1"
      capabilities: "beam:coder:bool:v1"
      capabilities: "beam:coder:varint:v1"
      capabilities: "beam:coder:string_utf8:v1"
      capabilities: "beam:coder:iterable:v1"
      capabilities: "beam:coder:timer:v1"
      capabilities: "beam:coder:kv:v1"
      capabilities: "beam:coder:length_prefix:v1"
      capabilities: "beam:coder:global_window:v1"
      capabilities: "beam:coder:interval_window:v1"
      capabilities: "beam:coder:custom_window:v1"
      capabilities: "beam:coder:windowed_value:v1"
      capabilities: "beam:coder:double:v1"
      capabilities: "beam:coder:row:v1"
      capabilities: "beam:coder:param_windowed_value:v1"
      capabilities: "beam:coder:state_backed_iterable:v1"
      capabilities: "beam:coder:sharded_key:v1"
      capabilities: "beam:coder:nullable:v1"
      capabilities: "beam:protocol:multi_core_bundle_processing:v1"
      capabilities: "beam:protocol:progress_reporting:v1"
      capabilities: "beam:protocol:harness_monitoring_infos:v1"
      capabilities: "beam:protocol:control_request_elements_embedding:v1"
      capabilities: "beam:protocol:state_caching:v1"
      capabilities: "beam:version:sdk_base:apache/beam_java8_sdk:2.43.0.dev"
      capabilities: "beam:transform:sdf_truncate_sized_restrictions:v1"
      capabilities: "beam:transform:to_string:v1"
      dependencies: <
        type_urn: "beam:artifact:type:file:v1"
        type_payload: "\nL/tmp/artifacts/icedtea-sound-CGRxIE9edPHnbxQhM-L5mp8h21H-ySB79uQtSquPV_Q.jar\022@086471204f5e74f1e76f142133e2f99a9f21db51fec9207bf6e42d4aab8f57f4"
        role_urn: "beam:artifact:role:staging_to:v1"
        role_payload: "\n=icedtea-sound-CGRxIE9edPHnbxQhM-L5mp8h21H-ySB79uQtSquPV_Q.jar"
      >
      dependencies: <
        type_urn: "beam:artifact:type:file:v1"
        type_payload: "\nF/tmp/artifacts/jaccess-FBI0Bb27lF3oEBieWAi7SP8X1zBR8k4BJQOVpsoK9a0.jar\022@14123405bdbb945de810189e5808bb48ff17d73051f24e01250395a6ca0af5ad"
        role_urn: "beam:artifact:role:staging_to:v1"
        role_payload: "\n7jaccess-FBI0Bb27lF3oEBieWAi7SP8X1zBR8k4BJQOVpsoK9a0.jar"
      >
      dependencies: <
        type_urn: "beam:artifact:type:file:v1"
        type_payload: "\nI/tmp/artifacts/localedata-kJ2mc8rBH5-IklhfR1XzNotlIQ_mnVMA-pgaXv2r8Ag.jar\022@909da673cac11f9f8892585f4755f3368b65210fe69d5300fa981a5efdabf008"
        role_urn: "beam:artifact:role:staging_to:v1"
        role_payload: "\n:localedata-kJ2mc8rBH5-IklhfR1XzNotlIQ_mnVMA-pgaXv2r8Ag.jar"
      >
      dependencies: <
        type_urn: "beam:artifact:type:file:v1"
        type_payload: "\nF/tmp/artifacts/nashorn-B0CAb3QpJET_6VsT3hcC_89VtvhV616H8N2bHAIaqWo.jar\022@0740806f74292444ffe95b13de1702ffcf55b6f855eb5e87f0dd9b1c021aa96a"
        role_urn: "beam:artifact:role:staging_to:v1"
        role_payload: "\n7nashorn-B0CAb3QpJET_6VsT3hcC_89VtvhV616H8N2bHAIaqWo.jar"
      >
      dependencies: <
        type_urn: "beam:artifact:type:file:v1"
        type_payload: "\nG/tmp/artifacts/cldrdata-gclqV9lOGqQOKesG-a6TAUTGEYlyIDqpyd4M_k7gtWo.jar\022@81c96a57d94e1aa40e29eb06f9ae930144c6118972203aa9c9de0cfe4ee0b56a"
        role_urn: "beam:artifact:role:staging_to:v1"
        role_payload: "\n8cldrdata-gclqV9lOGqQOKesG-a6TAUTGEYlyIDqpyd4M_k7gtWo.jar"
      >
      dependencies: <
        type_urn: "beam:artifact:type:file:v1"
        type_payload: "\nD/tmp/artifacts/dnsns-byzoQxdXengTvA5IlbH9gSIzfhNQElRYltuMJN0vjcc.jar\022@6f2ce84317577a7813bc0e4895b1fd8122337e135012545896db8c24dd2f8dc7"
        role_urn: "beam:artifact:role:staging_to:v1"
        role_payload: "\n5dnsns-byzoQxdXengTvA5IlbH9gSIzfhNQElRYltuMJN0vjcc.jar"
      >
      dependencies: <
        type_urn: "beam:artifact:type:file:v1"
        type_payload: "\nr/tmp/artifacts/beam-sdks-java-io-expansion-service-2.43.0-SNAPSHOT-wafbc-s8NjC9GYh1S6flL_8n1jlalnrUP6fvu6JgEuM.jar\022@c1a7db73eb3c3630bd1988754ba7e52fff27d6395a967ad43fa7efbba26012e3"
        role_urn: "beam:artifact:role:staging_to:v1"
        role_payload: "\ncbeam-sdks-java-io-expansion-service-2.43.0-SNAPSHOT-wafbc-s8NjC9GYh1S6flL_8n1jlalnrUP6fvu6JgEuM.jar"
      >
    >
  >
  environments: <
    key: "go"
    value: <
      urn: "beam:env:docker:v1"
      payload: "\n\026apache/beam_go_sdk:dev"
      capabilities: "beam:protocol:progress_reporting:v1"
      capabilities: "beam:protocol:multi_core_bundle_processing:v1"
      capabilities: "beam:transform:sdf_truncate_sized_restrictions:v1"
      capabilities: "beam:protocol:worker_status:v1"
      capabilities: "beam:protocol:monitoring_info_short_ids:v1"
      capabilities: "beam:version:sdk_base:go"
      capabilities: "beam:coder:bytes:v1"
      capabilities: "beam:coder:bool:v1"
      capabilities: "beam:coder:varint:v1"
      capabilities: "beam:coder:double:v1"
      capabilities: "beam:coder:string_utf8:v1"
      capabilities: "beam:coder:length_prefix:v1"
      capabilities: "beam:coder:kv:v1"
      capabilities: "beam:coder:iterable:v1"
      capabilities: "beam:coder:state_backed_iterable:v1"
      capabilities: "beam:coder:windowed_value:v1"
      capabilities: "beam:coder:global_window:v1"
      capabilities: "beam:coder:interval_window:v1"
      capabilities: "beam:coder:row:v1"
      capabilities: "beam:coder:nullable:v1"
      dependencies: <
        type_urn: "beam:artifact:type:file:v1"
        role_urn: "beam:artifact:role:go_worker_binary:v1"
      >
    >
  >
>
root_transform_ids: "e4"
root_transform_ids: "s1"
root_transform_ids: "e5"
root_transform_ids: "s3"
requirements: "beam:requirement:pardo:splittable_dofn:v1"
2022/09/21 11:59:45 Cross-compiling <https://ci-beam.apache.org/job/beam_PostCommit_XVR_Samza/ws/src/sdks/go/test/integration/io/xlang/kafka/kafka_test.go> as /tmp/worker-2-1663761585359827113
2022/09/21 11:59:47 Prepared job with id: go-testkafkaio_basicreadwrite-783_9254ffe7-bb2e-46ba-9eac-2220c6385ce3 and staging token: go-testkafkaio_basicreadwrite-783_9254ffe7-bb2e-46ba-9eac-2220c6385ce3
2022/09/21 11:59:47 Staged binary artifact with token: 
2022/09/21 11:59:47 Submitted job: go0testkafkaio0basicreadwrite0783-jenkins-0921115947-a0194ee4_2a518778-7b9c-4ae5-b3d4-2d9f66eb156b
2022/09/21 11:59:47 Job state: STOPPED
2022/09/21 11:59:47 Job state: STARTING
2022/09/21 11:59:47 Job state: RUNNING
2022/09/21 12:00:31 Job state: DONE
--- PASS: TestKafkaIO_BasicReadWrite (124.49s)
PASS
ok  	github.com/apache/beam/sdks/v2/go/test/integration/io/xlang/kafka	130.553s
FAIL

> Task :runners:samza:job-server:validatesCrossLanguageRunnerGoUsingJava FAILED
> Task :runners:samza:job-server:validatesCrossLanguageRunnerJavaUsingPython

org.apache.beam.runners.core.construction.ValidateRunnerXlangTest$CoGroupByKeyTest > test FAILED
    org.apache.beam.vendor.grpc.v1p48p1.io.grpc.StatusRuntimeException at ValidateRunnerXlangTest.java:307
    java.lang.NullPointerException at Preconditions.java:980

org.apache.beam.runners.core.construction.ValidateRunnerXlangTest$CombineGloballyTest > test FAILED
    org.apache.beam.vendor.grpc.v1p48p1.io.grpc.StatusRuntimeException at ValidateRunnerXlangTest.java:328
    java.lang.NullPointerException at Preconditions.java:980

org.apache.beam.runners.core.construction.ValidateRunnerXlangTest$CombinePerKeyTest > test FAILED
    org.apache.beam.vendor.grpc.v1p48p1.io.grpc.StatusRuntimeException at ValidateRunnerXlangTest.java:349
    java.lang.NullPointerException at Preconditions.java:980

org.apache.beam.runners.core.construction.ValidateRunnerXlangTest$FlattenTest > test FAILED
    org.apache.beam.vendor.grpc.v1p48p1.io.grpc.StatusRuntimeException at ValidateRunnerXlangTest.java:370
    java.lang.NullPointerException at Preconditions.java:980

org.apache.beam.runners.core.construction.ValidateRunnerXlangTest$GroupByKeyTest > test FAILED
    org.apache.beam.vendor.grpc.v1p48p1.io.grpc.StatusRuntimeException at ValidateRunnerXlangTest.java:285
    java.lang.NullPointerException at Preconditions.java:980

org.apache.beam.runners.core.construction.ValidateRunnerXlangTest$MultiInputOutputWithSideInputTest > test FAILED
    org.apache.beam.vendor.grpc.v1p48p1.io.grpc.StatusRuntimeException at ValidateRunnerXlangTest.java:263
    java.lang.NullPointerException at Preconditions.java:980

org.apache.beam.runners.core.construction.ValidateRunnerXlangTest$PartitionTest > test FAILED
    org.apache.beam.vendor.grpc.v1p48p1.io.grpc.StatusRuntimeException at ValidateRunnerXlangTest.java:392
    java.lang.NullPointerException at Preconditions.java:980

org.apache.beam.runners.core.construction.ValidateRunnerXlangTest$PythonDependenciesTest > test FAILED
    org.apache.beam.vendor.grpc.v1p48p1.io.grpc.StatusRuntimeException at ValidateRunnerXlangTest.java:401
    java.lang.NullPointerException at Preconditions.java:980

org.apache.beam.runners.core.construction.ValidateRunnerXlangTest$SingleInputOutputTest > test FAILED
    org.apache.beam.vendor.grpc.v1p48p1.io.grpc.StatusRuntimeException at ValidateRunnerXlangTest.java:242
    java.lang.NullPointerException at Preconditions.java:980

org.apache.beam.sdk.extensions.python.transforms.DataframeTransformTest > testDataframeSum FAILED
    java.lang.RuntimeException at DataframeTransformTest.java:50
        Caused by: org.apache.beam.vendor.grpc.v1p48p1.io.grpc.StatusRuntimeException at DataframeTransformTest.java:50
    java.lang.NullPointerException at Preconditions.java:980

org.apache.beam.sdk.extensions.python.transforms.PythonMapTest > testPythonMap FAILED
    java.lang.RuntimeException at PythonMapTest.java:41
        Caused by: org.apache.beam.vendor.grpc.v1p48p1.io.grpc.StatusRuntimeException at PythonMapTest.java:41
    java.lang.NullPointerException at Preconditions.java:980

org.apache.beam.sdk.extensions.python.transforms.PythonMapTest > testPythonFlatMap FAILED
    java.lang.RuntimeException at PythonMapTest.java:54
        Caused by: org.apache.beam.vendor.grpc.v1p48p1.io.grpc.StatusRuntimeException at PythonMapTest.java:54
    java.lang.NullPointerException at Preconditions.java:980

org.apache.beam.sdk.extensions.python.transforms.RunInferenceTransformTest > testRunInferenceWithKVs FAILED
    java.lang.RuntimeException at RunInferenceTransformTest.java:108
        Caused by: org.apache.beam.vendor.grpc.v1p48p1.io.grpc.StatusRuntimeException at RunInferenceTransformTest.java:108
    java.lang.NullPointerException at Preconditions.java:980

org.apache.beam.sdk.extensions.python.transforms.RunInferenceTransformTest > testRunInference FAILED
    java.lang.RuntimeException at RunInferenceTransformTest.java:60
        Caused by: org.apache.beam.vendor.grpc.v1p48p1.io.grpc.StatusRuntimeException at RunInferenceTransformTest.java:60
    java.lang.NullPointerException at Preconditions.java:980

16 tests completed, 14 failed, 2 skipped

> Task :runners:samza:job-server:validatesCrossLanguageRunnerJavaUsingPython FAILED
> Task :runners:samza:job-server:validatesCrossLanguageRunnerPythonUsingJava
> Task :runners:samza:job-server:validatesCrossLanguageRunnerPythonUsingSql
> Task :runners:samza:job-server:samzaJobServerCleanup
> Task :runners:samza:job-server:validatesCrossLanguageRunnerCleanup

FAILURE: Build completed with 2 failures.

1: Task failed with an exception.
-----------
* Where:
Build file '<https://ci-beam.apache.org/job/beam_PostCommit_XVR_Samza/ws/src/sdks/go/test/build.gradle'> line: 195

* What went wrong:
Execution failed for task ':runners:samza:job-server:validatesCrossLanguageRunnerGoUsingJava'.
> Process 'command 'sh'' finished with non-zero exit value 1

* Try:
> Run with --stacktrace option to get the stack trace.
> Run with --info or --debug option to get more log output.
==============================================================================

2: Task failed with an exception.
-----------
* What went wrong:
Execution failed for task ':runners:samza:job-server:validatesCrossLanguageRunnerJavaUsingPython'.
> There were failing tests. See the report at: file://<https://ci-beam.apache.org/job/beam_PostCommit_XVR_Samza/ws/src/runners/samza/job-server/build/reports/tests/validatesCrossLanguageRunnerJavaUsingPython/index.html>

* Try:
> Run with --stacktrace option to get the stack trace.
> Run with --info or --debug option to get more log output.
==============================================================================

* Get more help at https://help.gradle.org

Deprecated Gradle features were used in this build, making it incompatible with Gradle 8.0.

You can use '--warning-mode all' to show the individual deprecation warnings and determine if they come from your own scripts or plugins.

See https://docs.gradle.org/7.5.1/userguide/command_line_interface.html#sec:command_line_warnings

Execution optimizations have been disabled for 1 invalid unit(s) of work during this build to ensure correctness.
Please consult deprecation warnings for more details.

BUILD FAILED in 28m 1s
260 actionable tasks: 171 executed, 77 from cache, 12 up-to-date

Publishing build scan...
https://gradle.com/s/l4lg2c6fnudkq

Build step 'Invoke Gradle script' changed build result to FAILURE
Build step 'Invoke Gradle script' marked build as failure

---------------------------------------------------------------------
To unsubscribe, e-mail: builds-unsubscribe@beam.apache.org
For additional commands, e-mail: builds-help@beam.apache.org


Build failed in Jenkins: beam_PostCommit_XVR_Samza #1694

Posted by Apache Jenkins Server <je...@builds.apache.org>.
See <https://ci-beam.apache.org/job/beam_PostCommit_XVR_Samza/1694/display/redirect>

Changes:


------------------------------------------
[...truncated 1.38 MB...]
        urn: "beam:coders:javasdk:0.1"
        payload: "\202SNAPPY\000\000\000\000\001\000\000\000\001\000\000\001.\307\003\360@\254\355\000\005sr\000&org.apache.beam.sdk.coders.SnappyCoder1\033\243\356\177\362\366,\002\000\001L\000\ninner\005\030 t\000\"Lorg/a\005B\000/\001B\020/sdk/\tB\000/\005$\020;xr\000*ng\000 tructured\005/8s\277\022\016\325\3246\021\002\000\000xr\000 j9\000\005/\034C\335\325\211\256\274~\370\001/\020psr\000,j1\000,Serializable\005= \010\364 \216\305ynl\002\001\327\\\004typet\000\021Ljava/lang/Class\001\300n'\001\024Custom\005PPj\260\010\235\013;\035\013\002\000\000xq\000~\000\003vr\000$N\221\000\\io.BoundedSource!`v\023\177\370QA\0019\010r\000\035Z3\000\t,0\020\213\372\020Y\214\347\323\002\000\000xp"
      >
    >
  >
  coders: <
    key: "UpFwFRPwBiTimestampedValueCoder"
    value: <
      spec: <
        urn: "beam:coders:javasdk:0.1"
        payload: "\202SNAPPY\000\000\000\000\001\000\000\000\001\000\000\001?\315\003\270\254\355\000\005sr\000Aorg.apache.beam.sdk.values.TimestampedV\001\022\000$>\021\000LCoder\364\376\202p\274iX-\002\000\001L\000\nv\001)\005\030\034t\000\"Lorg/\t]\000/\001],/sdk/coders/\005$\020;xr\000*N\202\000\t%(.Structured\005/8s\277\022\016\325\3246\021\002\000\000xr\000 j9\000\005/\034C\335\325\211\256\274~\370\001/\020psr\000,j1\000(Serializabl\t\277\034\010\364 \216\305ynl\005\327\\\004typet\000\021Ljava/lang/Class\001\300\000&jV\000\024Custom\005\215Pj\260\010\235\013;\035\013\002\000\000xq\000~\000\003vr\000;N;\000Pio.BoundedReadFromUnb\t\021`Source$Shardd\236\240U\205\000j\363\002\000\000xp"
      >
    >
  >
  coders: <
    key: "UpFwFRPwBiValueWithRecordIdCoder"
    value: <
      spec: <
        urn: "beam:coders:javasdk:0.1"
        payload: "\202SNAPPY\000\000\000\000\001\000\000\000\001\000\000\001\213\311\005\320\254\355\000\005sr\000Corg.apache.beam.sdk.values.ValueWithRecordId$B\022\000LCoder{\343\376bQ\014\204>\002\000\002L\000\007i\t\025\034t\000+Lorg/\t\\\000/\001\\\024/sdk/c\0012(s/ByteArray\005B\014;L\000\n\005u\005\016\010t\000\"n;\000\005$\020;xr\000*N\274\000\t`(.Structured\005/8s\277\022\016\325\3246\021\002\000\000xr\000 j9\000\005/\034C\335\325\211\256\274~\370\001/\020psr\000)j1\0006\312\000\034\351\277\005|\263\3746\333\001:\010r\000&j8\000\024Atomic\005o\034\307\354\265\314\205tPF\0015 q\000~\000\003sr\000-N;\000$io.kafka.K\001\006\000R%\227\005B<I\320\251Y\032\341{#\002\000\001L\000\007kv\005\025\010t\000$nH\001\000K\t&\000;\025s\000\"Ns\000-P\r- j\000\275\271\035\243\3126\002!\353\010\010ke)\277\001\264\000\0022\303\001\005\022\025Y\000(jY\000\030Nullabl)\372\034E\333\0336>\220\247\007\005\307]\022.O\000\001\014,\006sq\000~\000\016q\000~\000\020"
      >
    >
  >
  coders: <
    key: "UpFwFRPwBiVarIntCoder"
    value: <
      spec: <
        urn: "beam:coders:javasdk:0.1"
        payload: "\202SNAPPY\000\000\000\000\001\000\000\000\001\000\000\000\210\330\001\350\254\355\000\005sr\000&org.apache.beam.sdk.coders.VarIntCoder\300K2\332\251KVh\002\000\000xrr5\000\024Atomic\0055 \307\354\265\314\205tPF\002\0055\000*jj\000$Structured\0059\034s\277\022\016\325\3246\021\t9\000 j9\000\005/0C\335\325\211\256\274~\370\002\000\000xp"
      >
    >
  >
  coders: <
    key: "UpFwFRPwBiVoidCoder"
    value: <
      spec: <
        urn: "beam:coders:javasdk:0.1"
        payload: "\202SNAPPY\000\000\000\000\001\000\000\000\001\000\000\000\210\326\001\350\254\355\000\005sr\000$org.apache.beam.sdk.coders.VoidCoder\271\277U\233\350\r\257U\002\000\000xr\000&j3\000\024Atomic\0055 \307\354\265\314\205tPF\002\0055\000*j5\000$Structured\0059\034s\277\022\016\325\3246\021\t9\000 j9\000\005/0C\335\325\211\256\274~\370\002\000\000xp"
      >
    >
  >
  coders: <
    key: "c0"
    value: <
      spec: <
        urn: "beam:coder:bytes:v1"
      >
    >
  >
  coders: <
    key: "c1"
    value: <
      spec: <
        urn: "beam:coder:global_window:v1"
      >
    >
  >
  coders: <
    key: "c2"
    value: <
      spec: <
        urn: "beam:go:coder:custom:v1"
        payload: "Cgd2YXJpbnR6EgIIAhpdCklnaXRodWIuY29tL2FwYWNoZS9iZWFtL3Nka3MvdjIvZ28vcGtnL2JlYW0vY29yZS9ydW50aW1lL2NvZGVyeC5lbmNWYXJJbnRaEhAIFiIECBlADyoGCBQSAggIImkKSWdpdGh1Yi5jb20vYXBhY2hlL2JlYW0vc2Rrcy92Mi9nby9wa2cvYmVhbS9jb3JlL3J1bnRpbWUvY29kZXJ4LmRlY1ZhckludFoSHAgWIgQIGUADIgYIFBICCAgqBAgZQA8qBAgZQAE="
      >
    >
  >
  coders: <
    key: "c3"
    value: <
      spec: <
        urn: "beam:coder:length_prefix:v1"
      >
      component_coder_ids: "c2"
    >
  >
  coders: <
    key: "c4"
    value: <
      spec: <
        urn: "beam:coder:kv:v1"
      >
      component_coder_ids: "c0"
      component_coder_ids: "c0"
    >
  >
  environments: <
    key: "UpFwFRPwBibeam:env:docker:v1"
    value: <
      urn: "beam:env:docker:v1"
      payload: "\n apache/beam_java8_sdk:2.43.0.dev"
      capabilities: "beam:coder:bytes:v1"
      capabilities: "beam:coder:bool:v1"
      capabilities: "beam:coder:varint:v1"
      capabilities: "beam:coder:string_utf8:v1"
      capabilities: "beam:coder:iterable:v1"
      capabilities: "beam:coder:timer:v1"
      capabilities: "beam:coder:kv:v1"
      capabilities: "beam:coder:length_prefix:v1"
      capabilities: "beam:coder:global_window:v1"
      capabilities: "beam:coder:interval_window:v1"
      capabilities: "beam:coder:custom_window:v1"
      capabilities: "beam:coder:windowed_value:v1"
      capabilities: "beam:coder:double:v1"
      capabilities: "beam:coder:row:v1"
      capabilities: "beam:coder:param_windowed_value:v1"
      capabilities: "beam:coder:state_backed_iterable:v1"
      capabilities: "beam:coder:sharded_key:v1"
      capabilities: "beam:coder:nullable:v1"
      capabilities: "beam:protocol:multi_core_bundle_processing:v1"
      capabilities: "beam:protocol:progress_reporting:v1"
      capabilities: "beam:protocol:harness_monitoring_infos:v1"
      capabilities: "beam:protocol:control_request_elements_embedding:v1"
      capabilities: "beam:protocol:state_caching:v1"
      capabilities: "beam:version:sdk_base:apache/beam_java8_sdk:2.43.0.dev"
      capabilities: "beam:transform:sdf_truncate_sized_restrictions:v1"
      capabilities: "beam:transform:to_string:v1"
      dependencies: <
        type_urn: "beam:artifact:type:file:v1"
        type_payload: "\nL/tmp/artifacts/icedtea-sound-CGRxIE9edPHnbxQhM-L5mp8h21H-ySB79uQtSquPV_Q.jar\022@086471204f5e74f1e76f142133e2f99a9f21db51fec9207bf6e42d4aab8f57f4"
        role_urn: "beam:artifact:role:staging_to:v1"
        role_payload: "\n=icedtea-sound-CGRxIE9edPHnbxQhM-L5mp8h21H-ySB79uQtSquPV_Q.jar"
      >
      dependencies: <
        type_urn: "beam:artifact:type:file:v1"
        type_payload: "\nF/tmp/artifacts/jaccess-FBI0Bb27lF3oEBieWAi7SP8X1zBR8k4BJQOVpsoK9a0.jar\022@14123405bdbb945de810189e5808bb48ff17d73051f24e01250395a6ca0af5ad"
        role_urn: "beam:artifact:role:staging_to:v1"
        role_payload: "\n7jaccess-FBI0Bb27lF3oEBieWAi7SP8X1zBR8k4BJQOVpsoK9a0.jar"
      >
      dependencies: <
        type_urn: "beam:artifact:type:file:v1"
        type_payload: "\nI/tmp/artifacts/localedata-kJ2mc8rBH5-IklhfR1XzNotlIQ_mnVMA-pgaXv2r8Ag.jar\022@909da673cac11f9f8892585f4755f3368b65210fe69d5300fa981a5efdabf008"
        role_urn: "beam:artifact:role:staging_to:v1"
        role_payload: "\n:localedata-kJ2mc8rBH5-IklhfR1XzNotlIQ_mnVMA-pgaXv2r8Ag.jar"
      >
      dependencies: <
        type_urn: "beam:artifact:type:file:v1"
        type_payload: "\nF/tmp/artifacts/nashorn-B0CAb3QpJET_6VsT3hcC_89VtvhV616H8N2bHAIaqWo.jar\022@0740806f74292444ffe95b13de1702ffcf55b6f855eb5e87f0dd9b1c021aa96a"
        role_urn: "beam:artifact:role:staging_to:v1"
        role_payload: "\n7nashorn-B0CAb3QpJET_6VsT3hcC_89VtvhV616H8N2bHAIaqWo.jar"
      >
      dependencies: <
        type_urn: "beam:artifact:type:file:v1"
        type_payload: "\nG/tmp/artifacts/cldrdata-gclqV9lOGqQOKesG-a6TAUTGEYlyIDqpyd4M_k7gtWo.jar\022@81c96a57d94e1aa40e29eb06f9ae930144c6118972203aa9c9de0cfe4ee0b56a"
        role_urn: "beam:artifact:role:staging_to:v1"
        role_payload: "\n8cldrdata-gclqV9lOGqQOKesG-a6TAUTGEYlyIDqpyd4M_k7gtWo.jar"
      >
      dependencies: <
        type_urn: "beam:artifact:type:file:v1"
        type_payload: "\nD/tmp/artifacts/dnsns-byzoQxdXengTvA5IlbH9gSIzfhNQElRYltuMJN0vjcc.jar\022@6f2ce84317577a7813bc0e4895b1fd8122337e135012545896db8c24dd2f8dc7"
        role_urn: "beam:artifact:role:staging_to:v1"
        role_payload: "\n5dnsns-byzoQxdXengTvA5IlbH9gSIzfhNQElRYltuMJN0vjcc.jar"
      >
      dependencies: <
        type_urn: "beam:artifact:type:file:v1"
        type_payload: "\nr/tmp/artifacts/beam-sdks-java-io-expansion-service-2.43.0-SNAPSHOT-wafbc-s8NjC9GYh1S6flL_8n1jlalnrUP6fvu6JgEuM.jar\022@c1a7db73eb3c3630bd1988754ba7e52fff27d6395a967ad43fa7efbba26012e3"
        role_urn: "beam:artifact:role:staging_to:v1"
        role_payload: "\ncbeam-sdks-java-io-expansion-service-2.43.0-SNAPSHOT-wafbc-s8NjC9GYh1S6flL_8n1jlalnrUP6fvu6JgEuM.jar"
      >
    >
  >
  environments: <
    key: "go"
    value: <
      urn: "beam:env:docker:v1"
      payload: "\n\026apache/beam_go_sdk:dev"
      capabilities: "beam:protocol:progress_reporting:v1"
      capabilities: "beam:protocol:multi_core_bundle_processing:v1"
      capabilities: "beam:transform:sdf_truncate_sized_restrictions:v1"
      capabilities: "beam:protocol:worker_status:v1"
      capabilities: "beam:protocol:monitoring_info_short_ids:v1"
      capabilities: "beam:version:sdk_base:go"
      capabilities: "beam:coder:bytes:v1"
      capabilities: "beam:coder:bool:v1"
      capabilities: "beam:coder:varint:v1"
      capabilities: "beam:coder:double:v1"
      capabilities: "beam:coder:string_utf8:v1"
      capabilities: "beam:coder:length_prefix:v1"
      capabilities: "beam:coder:kv:v1"
      capabilities: "beam:coder:iterable:v1"
      capabilities: "beam:coder:state_backed_iterable:v1"
      capabilities: "beam:coder:windowed_value:v1"
      capabilities: "beam:coder:global_window:v1"
      capabilities: "beam:coder:interval_window:v1"
      capabilities: "beam:coder:row:v1"
      capabilities: "beam:coder:nullable:v1"
      dependencies: <
        type_urn: "beam:artifact:type:file:v1"
        role_urn: "beam:artifact:role:go_worker_binary:v1"
      >
    >
  >
>
root_transform_ids: "s1"
root_transform_ids: "e4"
root_transform_ids: "e5"
root_transform_ids: "s3"
requirements: "beam:requirement:pardo:splittable_dofn:v1"
2022/09/21 05:56:31 Cross-compiling <https://ci-beam.apache.org/job/beam_PostCommit_XVR_Samza/ws/src/sdks/go/test/integration/io/xlang/kafka/kafka_test.go> as /tmp/worker-2-1663739791408901792
2022/09/21 05:56:33 Prepared job with id: go-testkafkaio_basicreadwrite-294_a4ad6ae0-4c8d-43f5-a907-75e24ede6382 and staging token: go-testkafkaio_basicreadwrite-294_a4ad6ae0-4c8d-43f5-a907-75e24ede6382
2022/09/21 05:56:33 Staged binary artifact with token: 
2022/09/21 05:56:33 Submitted job: go0testkafkaio0basicreadwrite0294-jenkins-0921055633-777bb0ca_a15b4aa1-96da-4a5a-b083-800b983179bd
2022/09/21 05:56:33 Job state: STOPPED
2022/09/21 05:56:33 Job state: STARTING
2022/09/21 05:56:33 Job state: RUNNING
2022/09/21 05:56:44 Job state: DONE
--- PASS: TestKafkaIO_BasicReadWrite (31.46s)
PASS
ok  	github.com/apache/beam/sdks/v2/go/test/integration/io/xlang/kafka	37.511s
FAIL

> Task :runners:samza:job-server:validatesCrossLanguageRunnerGoUsingJava FAILED
> Task :runners:samza:job-server:validatesCrossLanguageRunnerJavaUsingPython
> Task :runners:samza:job-server:validatesCrossLanguageRunnerPythonUsingJava
> Task :runners:samza:job-server:validatesCrossLanguageRunnerPythonUsingSql
> Task :runners:samza:job-server:samzaJobServerCleanup
> Task :runners:samza:job-server:validatesCrossLanguageRunnerCleanup

FAILURE: Build failed with an exception.

* Where:
Build file '<https://ci-beam.apache.org/job/beam_PostCommit_XVR_Samza/ws/src/sdks/go/test/build.gradle'> line: 195

* What went wrong:
Execution failed for task ':runners:samza:job-server:validatesCrossLanguageRunnerGoUsingJava'.
> Process 'command 'sh'' finished with non-zero exit value 1

* Try:
> Run with --stacktrace option to get the stack trace.
> Run with --info or --debug option to get more log output.

* Get more help at https://help.gradle.org

Deprecated Gradle features were used in this build, making it incompatible with Gradle 8.0.

You can use '--warning-mode all' to show the individual deprecation warnings and determine if they come from your own scripts or plugins.

See https://docs.gradle.org/7.5.1/userguide/command_line_interface.html#sec:command_line_warnings

Execution optimizations have been disabled for 1 invalid unit(s) of work during this build to ensure correctness.
Please consult deprecation warnings for more details.

BUILD FAILED in 30m 11s
260 actionable tasks: 179 executed, 69 from cache, 12 up-to-date

Publishing build scan...
https://gradle.com/s/c7uyxrduwicow

Build step 'Invoke Gradle script' changed build result to FAILURE
Build step 'Invoke Gradle script' marked build as failure

---------------------------------------------------------------------
To unsubscribe, e-mail: builds-unsubscribe@beam.apache.org
For additional commands, e-mail: builds-help@beam.apache.org


Build failed in Jenkins: beam_PostCommit_XVR_Samza #1693

Posted by Apache Jenkins Server <je...@builds.apache.org>.
See <https://ci-beam.apache.org/job/beam_PostCommit_XVR_Samza/1693/display/redirect>

Changes:


------------------------------------------
[...truncated 1.37 MB...]
    >
  >
  coders: <
    key: "qOMFfsnpaFKvCoder3"
    value: <
      spec: <
        urn: "beam:coder:kv:v1"
      >
      component_coder_ids: "qOMFfsnpaFVarIntCoder"
      component_coder_ids: "qOMFfsnpaFTimestampedValueCoder"
    >
  >
  coders: <
    key: "qOMFfsnpaFKvCoder4"
    value: <
      spec: <
        urn: "beam:coder:kv:v1"
      >
      component_coder_ids: "qOMFfsnpaFVarIntCoder"
      component_coder_ids: "qOMFfsnpaFIterableCoder"
    >
  >
  coders: <
    key: "qOMFfsnpaFNullableCoder"
    value: <
      spec: <
        urn: "beam:coder:nullable:v1"
      >
      component_coder_ids: "qOMFfsnpaFByteArrayCoder"
    >
  >
  coders: <
    key: "qOMFfsnpaFSerializableCoder"
    value: <
      spec: <
        urn: "beam:coders:javasdk:0.1"
        payload: "\202SNAPPY\000\000\000\000\001\000\000\000\001\000\000\000\312\214\002\360^\254\355\000\005sr\000,org.apache.beam.sdk.coders.SerializableCoder\010\364 \216\305ynl\002\000\001L\000\004typet\000\021Ljava/lang/Class;xr\000&ofV\000\024Custom\005P8j\260\010\235\013;\035\013\002\000\000xr\000 j\213\000\005/\034C\335\325\211\256\274~\370\001/\020pvr\000;N1\000Pio.BoundedReadFromUnb\t\021`Source$Shardd\236\240U\205\000j\363\002\000\000xp"
      >
    >
  >
  coders: <
    key: "qOMFfsnpaFSnappyCoder"
    value: <
      spec: <
        urn: "beam:coders:javasdk:0.1"
        payload: "\202SNAPPY\000\000\000\000\001\000\000\000\001\000\000\001.\307\003\360@\254\355\000\005sr\000&org.apache.beam.sdk.coders.SnappyCoder1\033\243\356\177\362\366,\002\000\001L\000\ninner\005\030 t\000\"Lorg/a\005B\000/\001B\020/sdk/\tB\000/\005$\020;xr\000*ng\000 tructured\005/8s\277\022\016\325\3246\021\002\000\000xr\000 j9\000\005/\034C\335\325\211\256\274~\370\001/\020psr\000,j1\000,Serializable\005= \010\364 \216\305ynl\002\001\327\\\004typet\000\021Ljava/lang/Class\001\300n'\001\024Custom\005PPj\260\010\235\013;\035\013\002\000\000xq\000~\000\003vr\000$N\221\000\\io.BoundedSource!`v\023\177\370QA\0019\010r\000\035Z3\000\t,0\020\213\372\020Y\214\347\323\002\000\000xp"
      >
    >
  >
  coders: <
    key: "qOMFfsnpaFTimestampedValueCoder"
    value: <
      spec: <
        urn: "beam:coders:javasdk:0.1"
        payload: "\202SNAPPY\000\000\000\000\001\000\000\000\001\000\000\001?\315\003\270\254\355\000\005sr\000Aorg.apache.beam.sdk.values.TimestampedV\001\022\000$>\021\000LCoder\364\376\202p\274iX-\002\000\001L\000\nv\001)\005\030\034t\000\"Lorg/\t]\000/\001],/sdk/coders/\005$\020;xr\000*N\202\000\t%(.Structured\005/8s\277\022\016\325\3246\021\002\000\000xr\000 j9\000\005/\034C\335\325\211\256\274~\370\001/\020psr\000,j1\000(Serializabl\t\277\034\010\364 \216\305ynl\005\327\\\004typet\000\021Ljava/lang/Class\001\300\000&jV\000\024Custom\005\215Pj\260\010\235\013;\035\013\002\000\000xq\000~\000\003vr\000;N;\000Pio.BoundedReadFromUnb\t\021`Source$Shardd\236\240U\205\000j\363\002\000\000xp"
      >
    >
  >
  coders: <
    key: "qOMFfsnpaFValueWithRecordIdCoder"
    value: <
      spec: <
        urn: "beam:coders:javasdk:0.1"
        payload: "\202SNAPPY\000\000\000\000\001\000\000\000\001\000\000\001\213\311\005\320\254\355\000\005sr\000Corg.apache.beam.sdk.values.ValueWithRecordId$B\022\000LCoder{\343\376bQ\014\204>\002\000\002L\000\007i\t\025\034t\000+Lorg/\t\\\000/\001\\\024/sdk/c\0012(s/ByteArray\005B\014;L\000\n\005u\005\016\010t\000\"n;\000\005$\020;xr\000*N\274\000\t`(.Structured\005/8s\277\022\016\325\3246\021\002\000\000xr\000 j9\000\005/\034C\335\325\211\256\274~\370\001/\020psr\000)j1\0006\312\000\034\351\277\005|\263\3746\333\001:\010r\000&j8\000\024Atomic\005o\034\307\354\265\314\205tPF\0015 q\000~\000\003sr\000-N;\000$io.kafka.K\001\006\000R%\227\005B<I\320\251Y\032\341{#\002\000\001L\000\007kv\005\025\010t\000$nH\001\000K\t&\000;\025s\000\"Ns\000-P\r- j\000\275\271\035\243\3126\002!\353\010\010ke)\277\001\264\000\0022\303\001\005\022\025Y\000(jY\000\030Nullabl)\372\034E\333\0336>\220\247\007\005\307]\022.O\000\001\014,\006sq\000~\000\016q\000~\000\020"
      >
    >
  >
  coders: <
    key: "qOMFfsnpaFVarIntCoder"
    value: <
      spec: <
        urn: "beam:coders:javasdk:0.1"
        payload: "\202SNAPPY\000\000\000\000\001\000\000\000\001\000\000\000\210\330\001\350\254\355\000\005sr\000&org.apache.beam.sdk.coders.VarIntCoder\300K2\332\251KVh\002\000\000xrr5\000\024Atomic\0055 \307\354\265\314\205tPF\002\0055\000*jj\000$Structured\0059\034s\277\022\016\325\3246\021\t9\000 j9\000\005/0C\335\325\211\256\274~\370\002\000\000xp"
      >
    >
  >
  coders: <
    key: "qOMFfsnpaFVoidCoder"
    value: <
      spec: <
        urn: "beam:coders:javasdk:0.1"
        payload: "\202SNAPPY\000\000\000\000\001\000\000\000\001\000\000\000\210\326\001\350\254\355\000\005sr\000$org.apache.beam.sdk.coders.VoidCoder\271\277U\233\350\r\257U\002\000\000xr\000&j3\000\024Atomic\0055 \307\354\265\314\205tPF\002\0055\000*j5\000$Structured\0059\034s\277\022\016\325\3246\021\t9\000 j9\000\005/0C\335\325\211\256\274~\370\002\000\000xp"
      >
    >
  >
  environments: <
    key: "go"
    value: <
      urn: "beam:env:docker:v1"
      payload: "\n\026apache/beam_go_sdk:dev"
      capabilities: "beam:protocol:progress_reporting:v1"
      capabilities: "beam:protocol:multi_core_bundle_processing:v1"
      capabilities: "beam:transform:sdf_truncate_sized_restrictions:v1"
      capabilities: "beam:protocol:worker_status:v1"
      capabilities: "beam:protocol:monitoring_info_short_ids:v1"
      capabilities: "beam:version:sdk_base:go"
      capabilities: "beam:coder:bytes:v1"
      capabilities: "beam:coder:bool:v1"
      capabilities: "beam:coder:varint:v1"
      capabilities: "beam:coder:double:v1"
      capabilities: "beam:coder:string_utf8:v1"
      capabilities: "beam:coder:length_prefix:v1"
      capabilities: "beam:coder:kv:v1"
      capabilities: "beam:coder:iterable:v1"
      capabilities: "beam:coder:state_backed_iterable:v1"
      capabilities: "beam:coder:windowed_value:v1"
      capabilities: "beam:coder:global_window:v1"
      capabilities: "beam:coder:interval_window:v1"
      capabilities: "beam:coder:row:v1"
      capabilities: "beam:coder:nullable:v1"
      dependencies: <
        type_urn: "beam:artifact:type:file:v1"
        role_urn: "beam:artifact:role:go_worker_binary:v1"
      >
    >
  >
  environments: <
    key: "qOMFfsnpaFbeam:env:docker:v1"
    value: <
      urn: "beam:env:docker:v1"
      payload: "\n apache/beam_java8_sdk:2.43.0.dev"
      capabilities: "beam:coder:bytes:v1"
      capabilities: "beam:coder:bool:v1"
      capabilities: "beam:coder:varint:v1"
      capabilities: "beam:coder:string_utf8:v1"
      capabilities: "beam:coder:iterable:v1"
      capabilities: "beam:coder:timer:v1"
      capabilities: "beam:coder:kv:v1"
      capabilities: "beam:coder:length_prefix:v1"
      capabilities: "beam:coder:global_window:v1"
      capabilities: "beam:coder:interval_window:v1"
      capabilities: "beam:coder:custom_window:v1"
      capabilities: "beam:coder:windowed_value:v1"
      capabilities: "beam:coder:double:v1"
      capabilities: "beam:coder:row:v1"
      capabilities: "beam:coder:param_windowed_value:v1"
      capabilities: "beam:coder:state_backed_iterable:v1"
      capabilities: "beam:coder:sharded_key:v1"
      capabilities: "beam:coder:nullable:v1"
      capabilities: "beam:protocol:multi_core_bundle_processing:v1"
      capabilities: "beam:protocol:progress_reporting:v1"
      capabilities: "beam:protocol:harness_monitoring_infos:v1"
      capabilities: "beam:protocol:control_request_elements_embedding:v1"
      capabilities: "beam:protocol:state_caching:v1"
      capabilities: "beam:version:sdk_base:apache/beam_java8_sdk:2.43.0.dev"
      capabilities: "beam:transform:sdf_truncate_sized_restrictions:v1"
      capabilities: "beam:transform:to_string:v1"
      dependencies: <
        type_urn: "beam:artifact:type:file:v1"
        type_payload: "\nL/tmp/artifacts/icedtea-sound-CGRxIE9edPHnbxQhM-L5mp8h21H-ySB79uQtSquPV_Q.jar\022@086471204f5e74f1e76f142133e2f99a9f21db51fec9207bf6e42d4aab8f57f4"
        role_urn: "beam:artifact:role:staging_to:v1"
        role_payload: "\n=icedtea-sound-CGRxIE9edPHnbxQhM-L5mp8h21H-ySB79uQtSquPV_Q.jar"
      >
      dependencies: <
        type_urn: "beam:artifact:type:file:v1"
        type_payload: "\nF/tmp/artifacts/jaccess-FBI0Bb27lF3oEBieWAi7SP8X1zBR8k4BJQOVpsoK9a0.jar\022@14123405bdbb945de810189e5808bb48ff17d73051f24e01250395a6ca0af5ad"
        role_urn: "beam:artifact:role:staging_to:v1"
        role_payload: "\n7jaccess-FBI0Bb27lF3oEBieWAi7SP8X1zBR8k4BJQOVpsoK9a0.jar"
      >
      dependencies: <
        type_urn: "beam:artifact:type:file:v1"
        type_payload: "\nI/tmp/artifacts/localedata-kJ2mc8rBH5-IklhfR1XzNotlIQ_mnVMA-pgaXv2r8Ag.jar\022@909da673cac11f9f8892585f4755f3368b65210fe69d5300fa981a5efdabf008"
        role_urn: "beam:artifact:role:staging_to:v1"
        role_payload: "\n:localedata-kJ2mc8rBH5-IklhfR1XzNotlIQ_mnVMA-pgaXv2r8Ag.jar"
      >
      dependencies: <
        type_urn: "beam:artifact:type:file:v1"
        type_payload: "\nF/tmp/artifacts/nashorn-B0CAb3QpJET_6VsT3hcC_89VtvhV616H8N2bHAIaqWo.jar\022@0740806f74292444ffe95b13de1702ffcf55b6f855eb5e87f0dd9b1c021aa96a"
        role_urn: "beam:artifact:role:staging_to:v1"
        role_payload: "\n7nashorn-B0CAb3QpJET_6VsT3hcC_89VtvhV616H8N2bHAIaqWo.jar"
      >
      dependencies: <
        type_urn: "beam:artifact:type:file:v1"
        type_payload: "\nG/tmp/artifacts/cldrdata-gclqV9lOGqQOKesG-a6TAUTGEYlyIDqpyd4M_k7gtWo.jar\022@81c96a57d94e1aa40e29eb06f9ae930144c6118972203aa9c9de0cfe4ee0b56a"
        role_urn: "beam:artifact:role:staging_to:v1"
        role_payload: "\n8cldrdata-gclqV9lOGqQOKesG-a6TAUTGEYlyIDqpyd4M_k7gtWo.jar"
      >
      dependencies: <
        type_urn: "beam:artifact:type:file:v1"
        type_payload: "\nD/tmp/artifacts/dnsns-byzoQxdXengTvA5IlbH9gSIzfhNQElRYltuMJN0vjcc.jar\022@6f2ce84317577a7813bc0e4895b1fd8122337e135012545896db8c24dd2f8dc7"
        role_urn: "beam:artifact:role:staging_to:v1"
        role_payload: "\n5dnsns-byzoQxdXengTvA5IlbH9gSIzfhNQElRYltuMJN0vjcc.jar"
      >
      dependencies: <
        type_urn: "beam:artifact:type:file:v1"
        type_payload: "\nr/tmp/artifacts/beam-sdks-java-io-expansion-service-2.43.0-SNAPSHOT-wafbc-s8NjC9GYh1S6flL_8n1jlalnrUP6fvu6JgEuM.jar\022@c1a7db73eb3c3630bd1988754ba7e52fff27d6395a967ad43fa7efbba26012e3"
        role_urn: "beam:artifact:role:staging_to:v1"
        role_payload: "\ncbeam-sdks-java-io-expansion-service-2.43.0-SNAPSHOT-wafbc-s8NjC9GYh1S6flL_8n1jlalnrUP6fvu6JgEuM.jar"
      >
    >
  >
>
root_transform_ids: "s1"
root_transform_ids: "e4"
root_transform_ids: "e5"
root_transform_ids: "s3"
requirements: "beam:requirement:pardo:splittable_dofn:v1"
2022/09/20 23:57:25 Cross-compiling <https://ci-beam.apache.org/job/beam_PostCommit_XVR_Samza/ws/src/sdks/go/test/integration/io/xlang/kafka/kafka_test.go> as /tmp/worker-2-1663718245228935963
2022/09/20 23:57:27 Prepared job with id: go-testkafkaio_basicreadwrite-106_2a8eef57-3fc1-416c-9436-3f0abf840022 and staging token: go-testkafkaio_basicreadwrite-106_2a8eef57-3fc1-416c-9436-3f0abf840022
2022/09/20 23:57:27 Staged binary artifact with token: 
2022/09/20 23:57:27 Submitted job: go0testkafkaio0basicreadwrite0106-jenkins-0920235727-ae91dd2e_3e4ea526-1d4c-4f77-a761-c4ffb88f32d8
2022/09/20 23:57:27 Job state: STOPPED
2022/09/20 23:57:27 Job state: STARTING
2022/09/20 23:57:27 Job state: RUNNING
2022/09/20 23:57:38 Job state: DONE
--- PASS: TestKafkaIO_BasicReadWrite (32.32s)
PASS
ok  	github.com/apache/beam/sdks/v2/go/test/integration/io/xlang/kafka	38.352s
FAIL

> Task :runners:samza:job-server:validatesCrossLanguageRunnerGoUsingJava FAILED
> Task :runners:samza:job-server:validatesCrossLanguageRunnerJavaUsingPython
> Task :runners:samza:job-server:validatesCrossLanguageRunnerPythonUsingJava
> Task :runners:samza:job-server:validatesCrossLanguageRunnerPythonUsingSql
> Task :runners:samza:job-server:samzaJobServerCleanup
> Task :runners:samza:job-server:validatesCrossLanguageRunnerCleanup

FAILURE: Build failed with an exception.

* Where:
Build file '<https://ci-beam.apache.org/job/beam_PostCommit_XVR_Samza/ws/src/sdks/go/test/build.gradle'> line: 195

* What went wrong:
Execution failed for task ':runners:samza:job-server:validatesCrossLanguageRunnerGoUsingJava'.
> Process 'command 'sh'' finished with non-zero exit value 1

* Try:
> Run with --stacktrace option to get the stack trace.
> Run with --info or --debug option to get more log output.

* Get more help at https://help.gradle.org

Deprecated Gradle features were used in this build, making it incompatible with Gradle 8.0.

You can use '--warning-mode all' to show the individual deprecation warnings and determine if they come from your own scripts or plugins.

See https://docs.gradle.org/7.5.1/userguide/command_line_interface.html#sec:command_line_warnings

Execution optimizations have been disabled for 1 invalid unit(s) of work during this build to ensure correctness.
Please consult deprecation warnings for more details.

BUILD FAILED in 30m 16s
260 actionable tasks: 171 executed, 77 from cache, 12 up-to-date

Publishing build scan...
https://gradle.com/s/wi72m5jplnrfk

Build step 'Invoke Gradle script' changed build result to FAILURE
Build step 'Invoke Gradle script' marked build as failure

---------------------------------------------------------------------
To unsubscribe, e-mail: builds-unsubscribe@beam.apache.org
For additional commands, e-mail: builds-help@beam.apache.org