You are viewing a plain text version of this content. The canonical link for it is here.
Posted to oak-dev@jackrabbit.apache.org by Apache Jenkins Server <je...@builds.apache.org> on 2019/09/18 19:10:57 UTC

BUILD FAILURE: Jackrabbit Oak - Build # 2389 - Still Failing

The Apache Jenkins build system has built Jackrabbit Oak (build #2389)

Status: Still Failing

Check console output at https://builds.apache.org/job/Jackrabbit%20Oak/2389/ to view the results.

Changes:
[mreutegg] OAK-8629: Node bundling exposes hidden property

More tests

 

Test results:
All tests passed

BUILD FAILURE: Jackrabbit Oak - Build # 2403 - Still Failing

Posted by Apache Jenkins Server <je...@builds.apache.org>.
The Apache Jenkins build system has built Jackrabbit Oak (build #2403)

Status: Still Failing

Check console output at https://builds.apache.org/job/Jackrabbit%20Oak/2403/ to view the results.

Changes:
[reschke] updated candidate release notes

 

Test results:
2 tests failed.
FAILED:  org.apache.jackrabbit.oak.run.DataStoreCommandTest.testConsistencyFakeDS[0: (org.apache.jackrabbit.oak.run.DataStoreCommandTest$StoreFixture$MongoStoreFixture@7ef4aceb : org.apache.jackrabbit.oak.run.DataStoreCommandTest$DataStoreFixture$FileDataStoreFixture@31b650e9)]

Error Message:
got: <false>, expected: is <true>

Stack Trace:
org.junit.AssumptionViolatedException: got: <false>, expected: is <true>
	at org.junit.Assume.assumeThat(Assume.java:95)
	at org.junit.Assume.assumeTrue(Assume.java:41)
	at org.apache.jackrabbit.oak.run.DataStoreCommandTest.testConsistencyFakeDS(DataStoreCommandTest.java:395)
	at sun.reflect.NativeMethodAccessorImpl.invoke0(Native Method)
	at sun.reflect.NativeMethodAccessorImpl.invoke(NativeMethodAccessorImpl.java:62)
	at sun.reflect.DelegatingMethodAccessorImpl.invoke(DelegatingMethodAccessorImpl.java:43)
	at java.lang.reflect.Method.invoke(Method.java:498)
	at org.junit.runners.model.FrameworkMethod$1.runReflectiveCall(FrameworkMethod.java:50)
	at org.junit.internal.runners.model.ReflectiveCallable.run(ReflectiveCallable.java:12)
	at org.junit.runners.model.FrameworkMethod.invokeExplosively(FrameworkMethod.java:47)
	at org.junit.internal.runners.statements.InvokeMethod.evaluate(InvokeMethod.java:17)
	at org.junit.internal.runners.statements.RunBefores.evaluate(RunBefores.java:26)
	at org.junit.internal.runners.statements.RunAfters.evaluate(RunAfters.java:27)
	at org.junit.rules.ExternalResource$1.evaluate(ExternalResource.java:48)
	at org.junit.rules.RunRules.evaluate(RunRules.java:20)
	at org.junit.runners.ParentRunner.runLeaf(ParentRunner.java:325)
	at org.junit.runners.BlockJUnit4ClassRunner.runChild(BlockJUnit4ClassRunner.java:78)
	at org.junit.runners.BlockJUnit4ClassRunner.runChild(BlockJUnit4ClassRunner.java:57)
	at org.junit.runners.ParentRunner$3.run(ParentRunner.java:290)
	at org.junit.runners.ParentRunner$1.schedule(ParentRunner.java:71)
	at org.junit.runners.ParentRunner.runChildren(ParentRunner.java:288)
	at org.junit.runners.ParentRunner.access$000(ParentRunner.java:58)
	at org.junit.runners.ParentRunner$2.evaluate(ParentRunner.java:268)
	at org.junit.runners.ParentRunner.run(ParentRunner.java:363)
	at org.junit.runners.Suite.runChild(Suite.java:128)
	at org.junit.runners.Suite.runChild(Suite.java:27)
	at org.junit.runners.ParentRunner$3.run(ParentRunner.java:290)
	at org.junit.runners.ParentRunner$1.schedule(ParentRunner.java:71)
	at org.junit.runners.ParentRunner.runChildren(ParentRunner.java:288)
	at org.junit.runners.ParentRunner.access$000(ParentRunner.java:58)
	at org.junit.runners.ParentRunner$2.evaluate(ParentRunner.java:268)
	at org.junit.runners.ParentRunner.run(ParentRunner.java:363)
	at org.apache.maven.surefire.junit4.JUnit4Provider.execute(JUnit4Provider.java:365)
	at org.apache.maven.surefire.junit4.JUnit4Provider.executeWithRerun(JUnit4Provider.java:273)
	at org.apache.maven.surefire.junit4.JUnit4Provider.executeTestSet(JUnit4Provider.java:238)
	at org.apache.maven.surefire.junit4.JUnit4Provider.invoke(JUnit4Provider.java:159)
	at org.apache.maven.surefire.booter.ForkedBooter.invokeProviderInSameClassLoader(ForkedBooter.java:384)
	at org.apache.maven.surefire.booter.ForkedBooter.runSuitesInProcess(ForkedBooter.java:345)
	at org.apache.maven.surefire.booter.ForkedBooter.execute(ForkedBooter.java:126)
	at org.apache.maven.surefire.booter.ForkedBooter.main(ForkedBooter.java:418)


FAILED:  org.apache.jackrabbit.oak.run.DataStoreCommandTest.testConsistencyFakeDS[0: (org.apache.jackrabbit.oak.run.DataStoreCommandTest$StoreFixture$MongoStoreFixture@7ef4aceb : org.apache.jackrabbit.oak.run.DataStoreCommandTest$DataStoreFixture$FileDataStoreFixture@31b650e9)]

Error Message:
Update of root document to _lastRev r16d6484a01c-0-1 failed. Detected concurrent update

Stack Trace:
org.apache.jackrabbit.oak.plugins.document.DocumentStoreException: Update of root document to _lastRev r16d6484a01c-0-1 failed. Detected concurrent update
	at org.apache.jackrabbit.oak.plugins.document.UnsavedModifications.persist(UnsavedModifications.java:215)
	at org.apache.jackrabbit.oak.plugins.document.DocumentNodeStore.backgroundWrite(DocumentNodeStore.java:2465)
	at org.apache.jackrabbit.oak.plugins.document.DocumentNodeStore.internalRunBackgroundUpdateOperations(DocumentNodeStore.java:2104)
	at org.apache.jackrabbit.oak.plugins.document.DocumentNodeStore.dispose(DocumentNodeStore.java:797)
	at org.apache.jackrabbit.oak.run.DataStoreCommandTest$StoreFixture$MongoStoreFixture.after(DataStoreCommandTest.java:686)
	at org.apache.jackrabbit.oak.run.DataStoreCommandTest.tearDown(DataStoreCommandTest.java:229)
	at sun.reflect.NativeMethodAccessorImpl.invoke0(Native Method)
	at sun.reflect.NativeMethodAccessorImpl.invoke(NativeMethodAccessorImpl.java:62)
	at sun.reflect.DelegatingMethodAccessorImpl.invoke(DelegatingMethodAccessorImpl.java:43)
	at java.lang.reflect.Method.invoke(Method.java:498)
	at org.junit.runners.model.FrameworkMethod$1.runReflectiveCall(FrameworkMethod.java:50)
	at org.junit.internal.runners.model.ReflectiveCallable.run(ReflectiveCallable.java:12)
	at org.junit.runners.model.FrameworkMethod.invokeExplosively(FrameworkMethod.java:47)
	at org.junit.internal.runners.statements.RunAfters.evaluate(RunAfters.java:33)
	at org.junit.rules.ExternalResource$1.evaluate(ExternalResource.java:48)
	at org.junit.rules.RunRules.evaluate(RunRules.java:20)
	at org.junit.runners.ParentRunner.runLeaf(ParentRunner.java:325)
	at org.junit.runners.BlockJUnit4ClassRunner.runChild(BlockJUnit4ClassRunner.java:78)
	at org.junit.runners.BlockJUnit4ClassRunner.runChild(BlockJUnit4ClassRunner.java:57)
	at org.junit.runners.ParentRunner$3.run(ParentRunner.java:290)
	at org.junit.runners.ParentRunner$1.schedule(ParentRunner.java:71)
	at org.junit.runners.ParentRunner.runChildren(ParentRunner.java:288)
	at org.junit.runners.ParentRunner.access$000(ParentRunner.java:58)
	at org.junit.runners.ParentRunner$2.evaluate(ParentRunner.java:268)
	at org.junit.runners.ParentRunner.run(ParentRunner.java:363)
	at org.junit.runners.Suite.runChild(Suite.java:128)
	at org.junit.runners.Suite.runChild(Suite.java:27)
	at org.junit.runners.ParentRunner$3.run(ParentRunner.java:290)
	at org.junit.runners.ParentRunner$1.schedule(ParentRunner.java:71)
	at org.junit.runners.ParentRunner.runChildren(ParentRunner.java:288)
	at org.junit.runners.ParentRunner.access$000(ParentRunner.java:58)
	at org.junit.runners.ParentRunner$2.evaluate(ParentRunner.java:268)
	at org.junit.runners.ParentRunner.run(ParentRunner.java:363)
	at org.apache.maven.surefire.junit4.JUnit4Provider.execute(JUnit4Provider.java:365)
	at org.apache.maven.surefire.junit4.JUnit4Provider.executeWithRerun(JUnit4Provider.java:273)
	at org.apache.maven.surefire.junit4.JUnit4Provider.executeTestSet(JUnit4Provider.java:238)
	at org.apache.maven.surefire.junit4.JUnit4Provider.invoke(JUnit4Provider.java:159)
	at org.apache.maven.surefire.booter.ForkedBooter.invokeProviderInSameClassLoader(ForkedBooter.java:384)
	at org.apache.maven.surefire.booter.ForkedBooter.runSuitesInProcess(ForkedBooter.java:345)
	at org.apache.maven.surefire.booter.ForkedBooter.execute(ForkedBooter.java:126)
	at org.apache.maven.surefire.booter.ForkedBooter.main(ForkedBooter.java:418)

BUILD FAILURE: Jackrabbit Oak - Build # 2402 - Still Failing

Posted by Apache Jenkins Server <je...@builds.apache.org>.
The Apache Jenkins build system has built Jackrabbit Oak (build #2402)

Status: Still Failing

Check console output at https://builds.apache.org/job/Jackrabbit%20Oak/2402/ to view the results.

Changes:
[reschke] OAK-8637 - added convergence test for LMSEstimator - added rat exclusion for TSV test file

[reschke] cancel release attempt fro 1.18.0

[tomekr] OAK-8640: Allow to only copy last journal entry in the SegmentStoreMigrator

 

Test results:
2 tests failed.
FAILED:  org.apache.jackrabbit.oak.run.DataStoreCommandTest.testConsistencyFakeDS[0: (org.apache.jackrabbit.oak.run.DataStoreCommandTest$StoreFixture$MongoStoreFixture@683fe7b5 : org.apache.jackrabbit.oak.run.DataStoreCommandTest$DataStoreFixture$FileDataStoreFixture@5b5b8730)]

Error Message:
got: <false>, expected: is <true>

Stack Trace:
org.junit.AssumptionViolatedException: got: <false>, expected: is <true>
	at org.junit.Assume.assumeThat(Assume.java:95)
	at org.junit.Assume.assumeTrue(Assume.java:41)
	at org.apache.jackrabbit.oak.run.DataStoreCommandTest.testConsistencyFakeDS(DataStoreCommandTest.java:395)
	at sun.reflect.NativeMethodAccessorImpl.invoke0(Native Method)
	at sun.reflect.NativeMethodAccessorImpl.invoke(NativeMethodAccessorImpl.java:62)
	at sun.reflect.DelegatingMethodAccessorImpl.invoke(DelegatingMethodAccessorImpl.java:43)
	at java.lang.reflect.Method.invoke(Method.java:498)
	at org.junit.runners.model.FrameworkMethod$1.runReflectiveCall(FrameworkMethod.java:50)
	at org.junit.internal.runners.model.ReflectiveCallable.run(ReflectiveCallable.java:12)
	at org.junit.runners.model.FrameworkMethod.invokeExplosively(FrameworkMethod.java:47)
	at org.junit.internal.runners.statements.InvokeMethod.evaluate(InvokeMethod.java:17)
	at org.junit.internal.runners.statements.RunBefores.evaluate(RunBefores.java:26)
	at org.junit.internal.runners.statements.RunAfters.evaluate(RunAfters.java:27)
	at org.junit.rules.ExternalResource$1.evaluate(ExternalResource.java:48)
	at org.junit.rules.RunRules.evaluate(RunRules.java:20)
	at org.junit.runners.ParentRunner.runLeaf(ParentRunner.java:325)
	at org.junit.runners.BlockJUnit4ClassRunner.runChild(BlockJUnit4ClassRunner.java:78)
	at org.junit.runners.BlockJUnit4ClassRunner.runChild(BlockJUnit4ClassRunner.java:57)
	at org.junit.runners.ParentRunner$3.run(ParentRunner.java:290)
	at org.junit.runners.ParentRunner$1.schedule(ParentRunner.java:71)
	at org.junit.runners.ParentRunner.runChildren(ParentRunner.java:288)
	at org.junit.runners.ParentRunner.access$000(ParentRunner.java:58)
	at org.junit.runners.ParentRunner$2.evaluate(ParentRunner.java:268)
	at org.junit.runners.ParentRunner.run(ParentRunner.java:363)
	at org.junit.runners.Suite.runChild(Suite.java:128)
	at org.junit.runners.Suite.runChild(Suite.java:27)
	at org.junit.runners.ParentRunner$3.run(ParentRunner.java:290)
	at org.junit.runners.ParentRunner$1.schedule(ParentRunner.java:71)
	at org.junit.runners.ParentRunner.runChildren(ParentRunner.java:288)
	at org.junit.runners.ParentRunner.access$000(ParentRunner.java:58)
	at org.junit.runners.ParentRunner$2.evaluate(ParentRunner.java:268)
	at org.junit.runners.ParentRunner.run(ParentRunner.java:363)
	at org.apache.maven.surefire.junit4.JUnit4Provider.execute(JUnit4Provider.java:365)
	at org.apache.maven.surefire.junit4.JUnit4Provider.executeWithRerun(JUnit4Provider.java:273)
	at org.apache.maven.surefire.junit4.JUnit4Provider.executeTestSet(JUnit4Provider.java:238)
	at org.apache.maven.surefire.junit4.JUnit4Provider.invoke(JUnit4Provider.java:159)
	at org.apache.maven.surefire.booter.ForkedBooter.invokeProviderInSameClassLoader(ForkedBooter.java:384)
	at org.apache.maven.surefire.booter.ForkedBooter.runSuitesInProcess(ForkedBooter.java:345)
	at org.apache.maven.surefire.booter.ForkedBooter.execute(ForkedBooter.java:126)
	at org.apache.maven.surefire.booter.ForkedBooter.main(ForkedBooter.java:418)


FAILED:  org.apache.jackrabbit.oak.run.DataStoreCommandTest.testConsistencyFakeDS[0: (org.apache.jackrabbit.oak.run.DataStoreCommandTest$StoreFixture$MongoStoreFixture@683fe7b5 : org.apache.jackrabbit.oak.run.DataStoreCommandTest$DataStoreFixture$FileDataStoreFixture@5b5b8730)]

Error Message:
Update of root document to _lastRev r16d6428234f-0-1 failed. Detected concurrent update

Stack Trace:
org.apache.jackrabbit.oak.plugins.document.DocumentStoreException: Update of root document to _lastRev r16d6428234f-0-1 failed. Detected concurrent update
	at org.apache.jackrabbit.oak.plugins.document.UnsavedModifications.persist(UnsavedModifications.java:215)
	at org.apache.jackrabbit.oak.plugins.document.DocumentNodeStore.backgroundWrite(DocumentNodeStore.java:2465)
	at org.apache.jackrabbit.oak.plugins.document.DocumentNodeStore.internalRunBackgroundUpdateOperations(DocumentNodeStore.java:2104)
	at org.apache.jackrabbit.oak.plugins.document.DocumentNodeStore.dispose(DocumentNodeStore.java:797)
	at org.apache.jackrabbit.oak.run.DataStoreCommandTest$StoreFixture$MongoStoreFixture.after(DataStoreCommandTest.java:686)
	at org.apache.jackrabbit.oak.run.DataStoreCommandTest.tearDown(DataStoreCommandTest.java:229)
	at sun.reflect.NativeMethodAccessorImpl.invoke0(Native Method)
	at sun.reflect.NativeMethodAccessorImpl.invoke(NativeMethodAccessorImpl.java:62)
	at sun.reflect.DelegatingMethodAccessorImpl.invoke(DelegatingMethodAccessorImpl.java:43)
	at java.lang.reflect.Method.invoke(Method.java:498)
	at org.junit.runners.model.FrameworkMethod$1.runReflectiveCall(FrameworkMethod.java:50)
	at org.junit.internal.runners.model.ReflectiveCallable.run(ReflectiveCallable.java:12)
	at org.junit.runners.model.FrameworkMethod.invokeExplosively(FrameworkMethod.java:47)
	at org.junit.internal.runners.statements.RunAfters.evaluate(RunAfters.java:33)
	at org.junit.rules.ExternalResource$1.evaluate(ExternalResource.java:48)
	at org.junit.rules.RunRules.evaluate(RunRules.java:20)
	at org.junit.runners.ParentRunner.runLeaf(ParentRunner.java:325)
	at org.junit.runners.BlockJUnit4ClassRunner.runChild(BlockJUnit4ClassRunner.java:78)
	at org.junit.runners.BlockJUnit4ClassRunner.runChild(BlockJUnit4ClassRunner.java:57)
	at org.junit.runners.ParentRunner$3.run(ParentRunner.java:290)
	at org.junit.runners.ParentRunner$1.schedule(ParentRunner.java:71)
	at org.junit.runners.ParentRunner.runChildren(ParentRunner.java:288)
	at org.junit.runners.ParentRunner.access$000(ParentRunner.java:58)
	at org.junit.runners.ParentRunner$2.evaluate(ParentRunner.java:268)
	at org.junit.runners.ParentRunner.run(ParentRunner.java:363)
	at org.junit.runners.Suite.runChild(Suite.java:128)
	at org.junit.runners.Suite.runChild(Suite.java:27)
	at org.junit.runners.ParentRunner$3.run(ParentRunner.java:290)
	at org.junit.runners.ParentRunner$1.schedule(ParentRunner.java:71)
	at org.junit.runners.ParentRunner.runChildren(ParentRunner.java:288)
	at org.junit.runners.ParentRunner.access$000(ParentRunner.java:58)
	at org.junit.runners.ParentRunner$2.evaluate(ParentRunner.java:268)
	at org.junit.runners.ParentRunner.run(ParentRunner.java:363)
	at org.apache.maven.surefire.junit4.JUnit4Provider.execute(JUnit4Provider.java:365)
	at org.apache.maven.surefire.junit4.JUnit4Provider.executeWithRerun(JUnit4Provider.java:273)
	at org.apache.maven.surefire.junit4.JUnit4Provider.executeTestSet(JUnit4Provider.java:238)
	at org.apache.maven.surefire.junit4.JUnit4Provider.invoke(JUnit4Provider.java:159)
	at org.apache.maven.surefire.booter.ForkedBooter.invokeProviderInSameClassLoader(ForkedBooter.java:384)
	at org.apache.maven.surefire.booter.ForkedBooter.runSuitesInProcess(ForkedBooter.java:345)
	at org.apache.maven.surefire.booter.ForkedBooter.execute(ForkedBooter.java:126)
	at org.apache.maven.surefire.booter.ForkedBooter.main(ForkedBooter.java:418)

BUILD FAILURE: Jackrabbit Oak - Build # 2401 - Still Failing

Posted by Apache Jenkins Server <je...@builds.apache.org>.
The Apache Jenkins build system has built Jackrabbit Oak (build #2401)

Status: Still Failing

Check console output at https://builds.apache.org/job/Jackrabbit%20Oak/2401/ to view the results.

Changes:
[mreutegg] OAK-8627: Avoid late-arriving lastRev update from crashed instance

Apply most recent patch with proposed changes

 

Test results:
All tests passed

BUILD FAILURE: Jackrabbit Oak - Build # 2400 - Still Failing

Posted by Apache Jenkins Server <je...@builds.apache.org>.
The Apache Jenkins build system has built Jackrabbit Oak (build #2400)

Status: Still Failing

Check console output at https://builds.apache.org/job/Jackrabbit%20Oak/2400/ to view the results.

Changes:
[reschke] [maven-release-plugin] prepare for next development iteration

[reschke] [maven-release-plugin] prepare release jackrabbit-oak-1.18.0

 

Test results:
All tests passed

BUILD FAILURE: Jackrabbit Oak - Build # 2399 - Still Failing

Posted by Apache Jenkins Server <je...@builds.apache.org>.
The Apache Jenkins build system has built Jackrabbit Oak (build #2399)

Status: Still Failing

Check console output at https://builds.apache.org/job/Jackrabbit%20Oak/2399/ to view the results.

Changes:
[reschke] 1.18.0 Candidate Release Notes

 

Test results:
All tests passed

BUILD FAILURE: Jackrabbit Oak - Build # 2398 - Still Failing

Posted by Apache Jenkins Server <je...@builds.apache.org>.
The Apache Jenkins build system has built Jackrabbit Oak (build #2398)

Status: Still Failing

Check console output at https://builds.apache.org/job/Jackrabbit%20Oak/2398/ to view the results.

Changes:
[reschke] OAK-8641: log uses of API methods to be removed as part of OAK-7358 (cleanup)

 

Test results:
All tests passed

BUILD FAILURE: Jackrabbit Oak - Build # 2397 - Still Failing

Posted by Apache Jenkins Server <je...@builds.apache.org>.
The Apache Jenkins build system has built Jackrabbit Oak (build #2397)

Status: Still Failing

Check console output at https://builds.apache.org/job/Jackrabbit%20Oak/2397/ to view the results.

Changes:
[reschke] OAK-8641: log uses of API methods to be removed as part of OAK-7358

 

Test results:
All tests passed

BUILD FAILURE: Jackrabbit Oak - Build # 2396 - Still Failing

Posted by Apache Jenkins Server <je...@builds.apache.org>.
The Apache Jenkins build system has built Jackrabbit Oak (build #2396)

Status: Still Failing

Check console output at https://builds.apache.org/job/Jackrabbit%20Oak/2396/ to view the results.

Changes:
[reschke] OAK-8643: PrincipalProvider.getMembershipPrincipals should not delegate to deprecated method

 

Test results:
3 tests failed.
FAILED:  org.apache.jackrabbit.oak.jcr.ConcurrentAddNodesClusterIT.addNodes

Error Message:
Cluster id 1 has a _lastRev r16d5f6b656f-14a-1 (2019-09-23 18:38:56.879) newer than current time 2019-09-23 18:37:42.167. Please check system time on cluster nodes.

Stack Trace:
org.apache.jackrabbit.oak.plugins.document.DocumentStoreException: Cluster id 1 has a _lastRev r16d5f6b656f-14a-1 (2019-09-23 18:38:56.879) newer than current time 2019-09-23 18:37:42.167. Please check system time on cluster nodes.
	at org.apache.jackrabbit.oak.plugins.document.util.Utils.checkRevisionAge(Utils.java:1018)
	at org.apache.jackrabbit.oak.plugins.document.DocumentNodeStore.checkRevisionAge(DocumentNodeStore.java:2683)
	at org.apache.jackrabbit.oak.plugins.document.DocumentNodeStore.<init>(DocumentNodeStore.java:566)
	at org.apache.jackrabbit.oak.plugins.document.DocumentNodeStoreBuilder.build(DocumentNodeStoreBuilder.java:163)
	at org.apache.jackrabbit.oak.plugins.document.DocumentMK$Builder.getNodeStore(DocumentMK.java:478)
	at org.apache.jackrabbit.oak.plugins.document.DocumentMK.<init>(DocumentMK.java:72)
	at org.apache.jackrabbit.oak.plugins.document.DocumentMK$Builder.open(DocumentMK.java:489)
	at org.apache.jackrabbit.oak.jcr.ConcurrentAddNodesClusterIT.addNodes(ConcurrentAddNodesClusterIT.java:216)
	at sun.reflect.NativeMethodAccessorImpl.invoke0(Native Method)
	at sun.reflect.NativeMethodAccessorImpl.invoke(NativeMethodAccessorImpl.java:62)
	at sun.reflect.DelegatingMethodAccessorImpl.invoke(DelegatingMethodAccessorImpl.java:43)
	at java.lang.reflect.Method.invoke(Method.java:498)
	at org.junit.runners.model.FrameworkMethod$1.runReflectiveCall(FrameworkMethod.java:50)
	at org.junit.internal.runners.model.ReflectiveCallable.run(ReflectiveCallable.java:12)
	at org.junit.runners.model.FrameworkMethod.invokeExplosively(FrameworkMethod.java:47)
	at org.junit.internal.runners.statements.InvokeMethod.evaluate(InvokeMethod.java:17)
	at org.junit.internal.runners.statements.RunBefores.evaluate(RunBefores.java:26)
	at org.junit.internal.runners.statements.RunAfters.evaluate(RunAfters.java:27)
	at org.junit.runners.ParentRunner.runLeaf(ParentRunner.java:325)
	at org.junit.runners.BlockJUnit4ClassRunner.runChild(BlockJUnit4ClassRunner.java:78)
	at org.junit.runners.BlockJUnit4ClassRunner.runChild(BlockJUnit4ClassRunner.java:57)
	at org.junit.runners.ParentRunner$3.run(ParentRunner.java:290)
	at org.junit.runners.ParentRunner$1.schedule(ParentRunner.java:71)
	at org.junit.runners.ParentRunner.runChildren(ParentRunner.java:288)
	at org.junit.runners.ParentRunner.access$000(ParentRunner.java:58)
	at org.junit.runners.ParentRunner$2.evaluate(ParentRunner.java:268)
	at org.junit.internal.runners.statements.RunBefores.evaluate(RunBefores.java:26)
	at org.junit.runners.ParentRunner.run(ParentRunner.java:363)
	at org.apache.maven.surefire.junit4.JUnit4Provider.execute(JUnit4Provider.java:365)
	at org.apache.maven.surefire.junit4.JUnit4Provider.executeWithRerun(JUnit4Provider.java:273)
	at org.apache.maven.surefire.junit4.JUnit4Provider.executeTestSet(JUnit4Provider.java:238)
	at org.apache.maven.surefire.junit4.JUnit4Provider.invoke(JUnit4Provider.java:159)
	at org.apache.maven.surefire.booter.ForkedBooter.invokeProviderInSameClassLoader(ForkedBooter.java:384)
	at org.apache.maven.surefire.booter.ForkedBooter.runSuitesInProcess(ForkedBooter.java:345)
	at org.apache.maven.surefire.booter.ForkedBooter.execute(ForkedBooter.java:126)
	at org.apache.maven.surefire.booter.ForkedBooter.main(ForkedBooter.java:418)


FAILED:  org.apache.jackrabbit.oak.jcr.ConcurrentAddNodesClusterIT.rebaseVisibility

Error Message:
Cluster id 1 has a _lastRev r16d5f6b656f-295-1 (2019-09-23 18:38:56.879) newer than current time 2019-09-23 18:37:47.982. Please check system time on cluster nodes.

Stack Trace:
org.apache.jackrabbit.oak.plugins.document.DocumentStoreException: Cluster id 1 has a _lastRev r16d5f6b656f-295-1 (2019-09-23 18:38:56.879) newer than current time 2019-09-23 18:37:47.982. Please check system time on cluster nodes.
	at org.apache.jackrabbit.oak.plugins.document.util.Utils.checkRevisionAge(Utils.java:1018)
	at org.apache.jackrabbit.oak.plugins.document.DocumentNodeStore.checkRevisionAge(DocumentNodeStore.java:2683)
	at org.apache.jackrabbit.oak.plugins.document.DocumentNodeStore.<init>(DocumentNodeStore.java:566)
	at org.apache.jackrabbit.oak.plugins.document.DocumentNodeStoreBuilder.build(DocumentNodeStoreBuilder.java:163)
	at org.apache.jackrabbit.oak.plugins.document.DocumentMK$Builder.getNodeStore(DocumentMK.java:478)
	at org.apache.jackrabbit.oak.plugins.document.DocumentMK.<init>(DocumentMK.java:72)
	at org.apache.jackrabbit.oak.plugins.document.DocumentMK$Builder.open(DocumentMK.java:489)
	at org.apache.jackrabbit.oak.jcr.ConcurrentAddNodesClusterIT.rebaseVisibility(ConcurrentAddNodesClusterIT.java:332)
	at sun.reflect.NativeMethodAccessorImpl.invoke0(Native Method)
	at sun.reflect.NativeMethodAccessorImpl.invoke(NativeMethodAccessorImpl.java:62)
	at sun.reflect.DelegatingMethodAccessorImpl.invoke(DelegatingMethodAccessorImpl.java:43)
	at java.lang.reflect.Method.invoke(Method.java:498)
	at org.junit.runners.model.FrameworkMethod$1.runReflectiveCall(FrameworkMethod.java:50)
	at org.junit.internal.runners.model.ReflectiveCallable.run(ReflectiveCallable.java:12)
	at org.junit.runners.model.FrameworkMethod.invokeExplosively(FrameworkMethod.java:47)
	at org.junit.internal.runners.statements.InvokeMethod.evaluate(InvokeMethod.java:17)
	at org.junit.internal.runners.statements.RunBefores.evaluate(RunBefores.java:26)
	at org.junit.internal.runners.statements.RunAfters.evaluate(RunAfters.java:27)
	at org.junit.runners.ParentRunner.runLeaf(ParentRunner.java:325)
	at org.junit.runners.BlockJUnit4ClassRunner.runChild(BlockJUnit4ClassRunner.java:78)
	at org.junit.runners.BlockJUnit4ClassRunner.runChild(BlockJUnit4ClassRunner.java:57)
	at org.junit.runners.ParentRunner$3.run(ParentRunner.java:290)
	at org.junit.runners.ParentRunner$1.schedule(ParentRunner.java:71)
	at org.junit.runners.ParentRunner.runChildren(ParentRunner.java:288)
	at org.junit.runners.ParentRunner.access$000(ParentRunner.java:58)
	at org.junit.runners.ParentRunner$2.evaluate(ParentRunner.java:268)
	at org.junit.internal.runners.statements.RunBefores.evaluate(RunBefores.java:26)
	at org.junit.runners.ParentRunner.run(ParentRunner.java:363)
	at org.apache.maven.surefire.junit4.JUnit4Provider.execute(JUnit4Provider.java:365)
	at org.apache.maven.surefire.junit4.JUnit4Provider.executeWithRerun(JUnit4Provider.java:273)
	at org.apache.maven.surefire.junit4.JUnit4Provider.executeTestSet(JUnit4Provider.java:238)
	at org.apache.maven.surefire.junit4.JUnit4Provider.invoke(JUnit4Provider.java:159)
	at org.apache.maven.surefire.booter.ForkedBooter.invokeProviderInSameClassLoader(ForkedBooter.java:384)
	at org.apache.maven.surefire.booter.ForkedBooter.runSuitesInProcess(ForkedBooter.java:345)
	at org.apache.maven.surefire.booter.ForkedBooter.execute(ForkedBooter.java:126)
	at org.apache.maven.surefire.booter.ForkedBooter.main(ForkedBooter.java:418)


FAILED:  org.apache.jackrabbit.oak.jcr.ConcurrentAddNodesClusterIT.addNodes2

Error Message:
Cluster id 1 has a _lastRev r16d5f6b656f-3e0-1 (2019-09-23 18:38:56.879) newer than current time 2019-09-23 18:37:55.709. Please check system time on cluster nodes.

Stack Trace:
org.apache.jackrabbit.oak.plugins.document.DocumentStoreException: Cluster id 1 has a _lastRev r16d5f6b656f-3e0-1 (2019-09-23 18:38:56.879) newer than current time 2019-09-23 18:37:55.709. Please check system time on cluster nodes.
	at org.apache.jackrabbit.oak.plugins.document.util.Utils.checkRevisionAge(Utils.java:1018)
	at org.apache.jackrabbit.oak.plugins.document.DocumentNodeStore.checkRevisionAge(DocumentNodeStore.java:2683)
	at org.apache.jackrabbit.oak.plugins.document.DocumentNodeStore.<init>(DocumentNodeStore.java:566)
	at org.apache.jackrabbit.oak.plugins.document.DocumentNodeStoreBuilder.build(DocumentNodeStoreBuilder.java:163)
	at org.apache.jackrabbit.oak.plugins.document.DocumentMK$Builder.getNodeStore(DocumentMK.java:478)
	at org.apache.jackrabbit.oak.plugins.document.DocumentMK.<init>(DocumentMK.java:72)
	at org.apache.jackrabbit.oak.plugins.document.DocumentMK$Builder.open(DocumentMK.java:489)
	at org.apache.jackrabbit.oak.jcr.ConcurrentAddNodesClusterIT.addNodes2(ConcurrentAddNodesClusterIT.java:252)
	at sun.reflect.NativeMethodAccessorImpl.invoke0(Native Method)
	at sun.reflect.NativeMethodAccessorImpl.invoke(NativeMethodAccessorImpl.java:62)
	at sun.reflect.DelegatingMethodAccessorImpl.invoke(DelegatingMethodAccessorImpl.java:43)
	at java.lang.reflect.Method.invoke(Method.java:498)
	at org.junit.runners.model.FrameworkMethod$1.runReflectiveCall(FrameworkMethod.java:50)
	at org.junit.internal.runners.model.ReflectiveCallable.run(ReflectiveCallable.java:12)
	at org.junit.runners.model.FrameworkMethod.invokeExplosively(FrameworkMethod.java:47)
	at org.junit.internal.runners.statements.InvokeMethod.evaluate(InvokeMethod.java:17)
	at org.junit.internal.runners.statements.RunBefores.evaluate(RunBefores.java:26)
	at org.junit.internal.runners.statements.RunAfters.evaluate(RunAfters.java:27)
	at org.junit.runners.ParentRunner.runLeaf(ParentRunner.java:325)
	at org.junit.runners.BlockJUnit4ClassRunner.runChild(BlockJUnit4ClassRunner.java:78)
	at org.junit.runners.BlockJUnit4ClassRunner.runChild(BlockJUnit4ClassRunner.java:57)
	at org.junit.runners.ParentRunner$3.run(ParentRunner.java:290)
	at org.junit.runners.ParentRunner$1.schedule(ParentRunner.java:71)
	at org.junit.runners.ParentRunner.runChildren(ParentRunner.java:288)
	at org.junit.runners.ParentRunner.access$000(ParentRunner.java:58)
	at org.junit.runners.ParentRunner$2.evaluate(ParentRunner.java:268)
	at org.junit.internal.runners.statements.RunBefores.evaluate(RunBefores.java:26)
	at org.junit.runners.ParentRunner.run(ParentRunner.java:363)
	at org.apache.maven.surefire.junit4.JUnit4Provider.execute(JUnit4Provider.java:365)
	at org.apache.maven.surefire.junit4.JUnit4Provider.executeWithRerun(JUnit4Provider.java:273)
	at org.apache.maven.surefire.junit4.JUnit4Provider.executeTestSet(JUnit4Provider.java:238)
	at org.apache.maven.surefire.junit4.JUnit4Provider.invoke(JUnit4Provider.java:159)
	at org.apache.maven.surefire.booter.ForkedBooter.invokeProviderInSameClassLoader(ForkedBooter.java:384)
	at org.apache.maven.surefire.booter.ForkedBooter.runSuitesInProcess(ForkedBooter.java:345)
	at org.apache.maven.surefire.booter.ForkedBooter.execute(ForkedBooter.java:126)
	at org.apache.maven.surefire.booter.ForkedBooter.main(ForkedBooter.java:418)

BUILD FAILURE: Jackrabbit Oak - Build # 2395 - Still Failing

Posted by Apache Jenkins Server <je...@builds.apache.org>.
The Apache Jenkins build system has built Jackrabbit Oak (build #2395)

Status: Still Failing

Check console output at https://builds.apache.org/job/Jackrabbit%20Oak/2395/ to view the results.

Changes:
[mreutegg] OAK-8629: Node bundling exposes hidden properties

Apply patch with fix and enable tests

 

Test results:
All tests passed

BUILD FAILURE: Jackrabbit Oak - Build # 2394 - Still Failing

Posted by Apache Jenkins Server <je...@builds.apache.org>.
The Apache Jenkins build system has built Jackrabbit Oak (build #2394)

Status: Still Failing

Check console output at https://builds.apache.org/job/Jackrabbit%20Oak/2394/ to view the results.

Changes:
[tomekr] OAK-8640: Allow to only copy last journal entry in the SegmentStoreMigrator

 

Test results:
All tests passed

BUILD FAILURE: Jackrabbit Oak - Build # 2393 - Still Failing

Posted by Apache Jenkins Server <je...@builds.apache.org>.
The Apache Jenkins build system has built Jackrabbit Oak (build #2393)

Status: Still Failing

Check console output at https://builds.apache.org/job/Jackrabbit%20Oak/2393/ to view the results.

Changes:
[catholicon] OAK-8603: Composite Node Store + Counter Index: allow indexing from scratch / reindex

[catholicon] OAK-8603: Composite Node Store + Counter Index: allow indexing from scratch / reindex

Minor refactoring

 

Test results:
All tests passed

BUILD FAILURE: Jackrabbit Oak - Build # 2392 - Still Failing

Posted by Apache Jenkins Server <je...@builds.apache.org>.
The Apache Jenkins build system has built Jackrabbit Oak (build #2392)

Status: Still Failing

Check console output at https://builds.apache.org/job/Jackrabbit%20Oak/2392/ to view the results.

Changes:
[reschke] OAK-8638: Revert java 12 specific javadoc workaround

 

Test results:
All tests passed

BUILD FAILURE: Jackrabbit Oak - Build # 2391 - Still Failing

Posted by Apache Jenkins Server <je...@builds.apache.org>.
The Apache Jenkins build system has built Jackrabbit Oak (build #2391)

Status: Still Failing

Check console output at https://builds.apache.org/job/Jackrabbit%20Oak/2391/ to view the results.

Changes:
[mreutegg] OAK-8627: Avoid late-arriving lastRev update from crashed instance

Ignored test

 

Test results:
All tests passed

BUILD FAILURE: Jackrabbit Oak - Build # 2390 - Still Failing

Posted by Apache Jenkins Server <je...@builds.apache.org>.
The Apache Jenkins build system has built Jackrabbit Oak (build #2390)

Status: Still Failing

Check console output at https://builds.apache.org/job/Jackrabbit%20Oak/2390/ to view the results.

Changes:
[tommaso] OAK-8637 - added convergence test for LMSEstimator

 

Test results:
All tests passed