You are viewing a plain text version of this content. The canonical link for it is here.
Posted to dev@pdfbox.apache.org by Apache Jenkins Server <je...@builds.apache.org> on 2020/11/17 13:04:53 UTC
Build failed in Jenkins: PDFBox » PDFBox-trunk #247
See <https://ci-builds.apache.org/job/PDFBox/job/PDFBox-trunk/247/display/redirect?page=changes>
Changes:
[Maruan Sahyoun] PDFBOX-5017: switch to JUnit5
------------------------------------------
[...truncated 98.00 KB...]
at java.lang.reflect.Method.invoke(Method.java:498)
at hudson.model.Executor$2.call(Executor.java:932)
at hudson.util.InterceptingProxy$1.invoke(InterceptingProxy.java:23)
at com.sun.proxy.$Proxy180.execute(Unknown Source)
at hudson.maven.MavenBuildProxy$Filter$AsyncInvoker.call(MavenBuildProxy.java:294)
at hudson.remoting.UserRequest.perform(UserRequest.java:211)
at hudson.remoting.UserRequest.perform(UserRequest.java:54)
at hudson.remoting.Request$2.run(Request.java:369)
at hudson.remoting.InterceptingExecutorService$1.call(InterceptingExecutorService.java:72)
at org.jenkinsci.remoting.CallableDecorator.call(CallableDecorator.java:18)
at hudson.remoting.CallableDecoratorList$1.call(CallableDecoratorList.java:21)
at jenkins.util.ContextResettingExecutorService$2.call(ContextResettingExecutorService.java:46)
at jenkins.security.ImpersonatingExecutorService$2.call(ImpersonatingExecutorService.java:71)
... 4 more
Suppressed: hudson.remoting.Channel$CallSiteStackTrace: Remote call to channel
at hudson.remoting.Channel.attachCallSiteStackTrace(Channel.java:1788)
at hudson.remoting.UserRequest$ExceptionResponse.retrieve(UserRequest.java:356)
at hudson.remoting.Channel$2.adapt(Channel.java:1033)
at hudson.remoting.Channel$2.adapt(Channel.java:1029)
at hudson.remoting.FutureAdapter.get(FutureAdapter.java:55)
at hudson.maven.AbstractMavenBuilder.waitForAsynchronousExecutions(AbstractMavenBuilder.java:186)
at hudson.maven.Maven3Builder.call(Maven3Builder.java:146)
at hudson.maven.Maven3Builder.call(Maven3Builder.java:70)
at hudson.remoting.UserRequest.perform(UserRequest.java:211)
at hudson.remoting.UserRequest.perform(UserRequest.java:54)
at hudson.remoting.Request$2.run(Request.java:369)
at hudson.remoting.InterceptingExecutorService$1.call(InterceptingExecutorService.java:72)
... 4 more
ERROR: Asynchronous execution failure
java.util.concurrent.ExecutionException: java.io.IOException: Unexpected Fingerprint type. Expected class hudson.model.Fingerprint or subclass but got class hudson.model.Fingerprint$RangeSet
at hudson.remoting.Channel$2.adapt(Channel.java:1035)
at hudson.remoting.Channel$2.adapt(Channel.java:1029)
at hudson.remoting.FutureAdapter.get(FutureAdapter.java:55)
at hudson.maven.AbstractMavenBuilder.waitForAsynchronousExecutions(AbstractMavenBuilder.java:186)
at hudson.maven.Maven3Builder.call(Maven3Builder.java:146)
at hudson.maven.Maven3Builder.call(Maven3Builder.java:70)
at hudson.remoting.UserRequest.perform(UserRequest.java:211)
at hudson.remoting.UserRequest.perform(UserRequest.java:54)
at hudson.remoting.Request$2.run(Request.java:369)
at hudson.remoting.InterceptingExecutorService$1.call(InterceptingExecutorService.java:72)
at java.util.concurrent.FutureTask.run(FutureTask.java:266)
at java.util.concurrent.ThreadPoolExecutor.runWorker(ThreadPoolExecutor.java:1149)
at java.util.concurrent.ThreadPoolExecutor$Worker.run(ThreadPoolExecutor.java:624)
at java.lang.Thread.run(Thread.java:748)
Caused by: java.io.IOException: Unexpected Fingerprint type. Expected class hudson.model.Fingerprint or subclass but got class hudson.model.Fingerprint$RangeSet
at hudson.model.Fingerprint.load(Fingerprint.java:1387)
at hudson.model.Fingerprint.load(Fingerprint.java:1372)
at hudson.model.FingerprintMap.load(FingerprintMap.java:97)
at hudson.model.FingerprintMap.load(FingerprintMap.java:47)
at hudson.util.KeyedDataStorage.get(KeyedDataStorage.java:161)
at hudson.model.FingerprintMap.get(FingerprintMap.java:82)
at hudson.model.FingerprintMap.get(FingerprintMap.java:47)
at hudson.util.KeyedDataStorage.getOrCreate(KeyedDataStorage.java:111)
at hudson.model.FingerprintMap.getOrCreate(FingerprintMap.java:68)
at hudson.maven.reporters.MavenFingerprinter$PostBuildCallable.call(MavenFingerprinter.java:249)
at hudson.maven.reporters.MavenFingerprinter$PostBuildCallable.call(MavenFingerprinter.java:236)
at hudson.maven.MavenBuild$ProxyImpl.execute(MavenBuild.java:454)
at hudson.maven.MavenBuild$ProxyImpl2.execute(MavenBuild.java:586)
at sun.reflect.GeneratedMethodAccessor1162.invoke(Unknown Source)
at sun.reflect.DelegatingMethodAccessorImpl.invoke(DelegatingMethodAccessorImpl.java:43)
at java.lang.reflect.Method.invoke(Method.java:498)
at hudson.model.Executor$2.call(Executor.java:932)
at hudson.util.InterceptingProxy$1.invoke(InterceptingProxy.java:23)
at com.sun.proxy.$Proxy180.execute(Unknown Source)
at hudson.maven.MavenBuildProxy$Filter$AsyncInvoker.call(MavenBuildProxy.java:294)
at hudson.remoting.UserRequest.perform(UserRequest.java:211)
at hudson.remoting.UserRequest.perform(UserRequest.java:54)
at hudson.remoting.Request$2.run(Request.java:369)
at hudson.remoting.InterceptingExecutorService$1.call(InterceptingExecutorService.java:72)
at org.jenkinsci.remoting.CallableDecorator.call(CallableDecorator.java:18)
at hudson.remoting.CallableDecoratorList$1.call(CallableDecoratorList.java:21)
at jenkins.util.ContextResettingExecutorService$2.call(ContextResettingExecutorService.java:46)
at jenkins.security.ImpersonatingExecutorService$2.call(ImpersonatingExecutorService.java:71)
... 4 more
Suppressed: hudson.remoting.Channel$CallSiteStackTrace: Remote call to channel
at hudson.remoting.Channel.attachCallSiteStackTrace(Channel.java:1788)
at hudson.remoting.UserRequest$ExceptionResponse.retrieve(UserRequest.java:356)
at hudson.remoting.Channel$2.adapt(Channel.java:1033)
at hudson.remoting.Channel$2.adapt(Channel.java:1029)
at hudson.remoting.FutureAdapter.get(FutureAdapter.java:55)
at hudson.maven.AbstractMavenBuilder.waitForAsynchronousExecutions(AbstractMavenBuilder.java:186)
at hudson.maven.Maven3Builder.call(Maven3Builder.java:146)
at hudson.maven.Maven3Builder.call(Maven3Builder.java:70)
at hudson.remoting.UserRequest.perform(UserRequest.java:211)
at hudson.remoting.UserRequest.perform(UserRequest.java:54)
at hudson.remoting.Request$2.run(Request.java:369)
at hudson.remoting.InterceptingExecutorService$1.call(InterceptingExecutorService.java:72)
... 4 more
ERROR: Asynchronous execution failure
java.util.concurrent.ExecutionException: java.io.IOException: Unexpected Fingerprint type. Expected class hudson.model.Fingerprint or subclass but got class hudson.model.Fingerprint$RangeSet
at hudson.remoting.Channel$2.adapt(Channel.java:1035)
at hudson.remoting.Channel$2.adapt(Channel.java:1029)
at hudson.remoting.FutureAdapter.get(FutureAdapter.java:55)
at hudson.maven.AbstractMavenBuilder.waitForAsynchronousExecutions(AbstractMavenBuilder.java:186)
at hudson.maven.Maven3Builder.call(Maven3Builder.java:146)
at hudson.maven.Maven3Builder.call(Maven3Builder.java:70)
at hudson.remoting.UserRequest.perform(UserRequest.java:211)
at hudson.remoting.UserRequest.perform(UserRequest.java:54)
at hudson.remoting.Request$2.run(Request.java:369)
at hudson.remoting.InterceptingExecutorService$1.call(InterceptingExecutorService.java:72)
at java.util.concurrent.FutureTask.run(FutureTask.java:266)
at java.util.concurrent.ThreadPoolExecutor.runWorker(ThreadPoolExecutor.java:1149)
at java.util.concurrent.ThreadPoolExecutor$Worker.run(ThreadPoolExecutor.java:624)
at java.lang.Thread.run(Thread.java:748)
Caused by: java.io.IOException: Unexpected Fingerprint type. Expected class hudson.model.Fingerprint or subclass but got class hudson.model.Fingerprint$RangeSet
at hudson.model.Fingerprint.load(Fingerprint.java:1387)
at hudson.model.Fingerprint.load(Fingerprint.java:1372)
at hudson.model.FingerprintMap.load(FingerprintMap.java:97)
at hudson.model.FingerprintMap.load(FingerprintMap.java:47)
at hudson.util.KeyedDataStorage.get(KeyedDataStorage.java:161)
at hudson.model.FingerprintMap.get(FingerprintMap.java:82)
at hudson.model.FingerprintMap.get(FingerprintMap.java:47)
at hudson.util.KeyedDataStorage.getOrCreate(KeyedDataStorage.java:111)
at hudson.model.FingerprintMap.getOrCreate(FingerprintMap.java:68)
at hudson.maven.reporters.MavenFingerprinter$PostBuildCallable.call(MavenFingerprinter.java:249)
at hudson.maven.reporters.MavenFingerprinter$PostBuildCallable.call(MavenFingerprinter.java:236)
at hudson.maven.MavenBuild$ProxyImpl.execute(MavenBuild.java:454)
at hudson.maven.MavenBuild$ProxyImpl2.execute(MavenBuild.java:586)
at sun.reflect.GeneratedMethodAccessor1162.invoke(Unknown Source)
at sun.reflect.DelegatingMethodAccessorImpl.invoke(DelegatingMethodAccessorImpl.java:43)
at java.lang.reflect.Method.invoke(Method.java:498)
at hudson.model.Executor$2.call(Executor.java:932)
at hudson.util.InterceptingProxy$1.invoke(InterceptingProxy.java:23)
at com.sun.proxy.$Proxy180.execute(Unknown Source)
at hudson.maven.MavenBuildProxy$Filter$AsyncInvoker.call(MavenBuildProxy.java:294)
at hudson.remoting.UserRequest.perform(UserRequest.java:211)
at hudson.remoting.UserRequest.perform(UserRequest.java:54)
at hudson.remoting.Request$2.run(Request.java:369)
at hudson.remoting.InterceptingExecutorService$1.call(InterceptingExecutorService.java:72)
at org.jenkinsci.remoting.CallableDecorator.call(CallableDecorator.java:18)
at hudson.remoting.CallableDecoratorList$1.call(CallableDecoratorList.java:21)
at jenkins.util.ContextResettingExecutorService$2.call(ContextResettingExecutorService.java:46)
at jenkins.security.ImpersonatingExecutorService$2.call(ImpersonatingExecutorService.java:71)
... 4 more
Suppressed: hudson.remoting.Channel$CallSiteStackTrace: Remote call to channel
at hudson.remoting.Channel.attachCallSiteStackTrace(Channel.java:1788)
at hudson.remoting.UserRequest$ExceptionResponse.retrieve(UserRequest.java:356)
at hudson.remoting.Channel$2.adapt(Channel.java:1033)
at hudson.remoting.Channel$2.adapt(Channel.java:1029)
at hudson.remoting.FutureAdapter.get(FutureAdapter.java:55)
at hudson.maven.AbstractMavenBuilder.waitForAsynchronousExecutions(AbstractMavenBuilder.java:186)
at hudson.maven.Maven3Builder.call(Maven3Builder.java:146)
at hudson.maven.Maven3Builder.call(Maven3Builder.java:70)
at hudson.remoting.UserRequest.perform(UserRequest.java:211)
at hudson.remoting.UserRequest.perform(UserRequest.java:54)
at hudson.remoting.Request$2.run(Request.java:369)
at hudson.remoting.InterceptingExecutorService$1.call(InterceptingExecutorService.java:72)
... 4 more
ERROR: Asynchronous execution failure
java.util.concurrent.ExecutionException: java.io.IOException: Unexpected Fingerprint type. Expected class hudson.model.Fingerprint or subclass but got class hudson.model.Fingerprint$RangeSet
at hudson.remoting.Channel$2.adapt(Channel.java:1035)
at hudson.remoting.Channel$2.adapt(Channel.java:1029)
at hudson.remoting.FutureAdapter.get(FutureAdapter.java:55)
at hudson.maven.AbstractMavenBuilder.waitForAsynchronousExecutions(AbstractMavenBuilder.java:186)
at hudson.maven.Maven3Builder.call(Maven3Builder.java:146)
at hudson.maven.Maven3Builder.call(Maven3Builder.java:70)
at hudson.remoting.UserRequest.perform(UserRequest.java:211)
at hudson.remoting.UserRequest.perform(UserRequest.java:54)
at hudson.remoting.Request$2.run(Request.java:369)
at hudson.remoting.InterceptingExecutorService$1.call(InterceptingExecutorService.java:72)
at java.util.concurrent.FutureTask.run(FutureTask.java:266)
at java.util.concurrent.ThreadPoolExecutor.runWorker(ThreadPoolExecutor.java:1149)
at java.util.concurrent.ThreadPoolExecutor$Worker.run(ThreadPoolExecutor.java:624)
at java.lang.Thread.run(Thread.java:748)
Caused by: java.io.IOException: Unexpected Fingerprint type. Expected class hudson.model.Fingerprint or subclass but got class hudson.model.Fingerprint$RangeSet
at hudson.model.Fingerprint.load(Fingerprint.java:1387)
at hudson.model.Fingerprint.load(Fingerprint.java:1372)
at hudson.model.FingerprintMap.load(FingerprintMap.java:97)
at hudson.model.FingerprintMap.load(FingerprintMap.java:47)
at hudson.util.KeyedDataStorage.get(KeyedDataStorage.java:161)
at hudson.model.FingerprintMap.get(FingerprintMap.java:82)
at hudson.model.FingerprintMap.get(FingerprintMap.java:47)
at hudson.util.KeyedDataStorage.getOrCreate(KeyedDataStorage.java:111)
at hudson.model.FingerprintMap.getOrCreate(FingerprintMap.java:68)
at hudson.maven.reporters.MavenFingerprinter$PostBuildCallable.call(MavenFingerprinter.java:249)
at hudson.maven.reporters.MavenFingerprinter$PostBuildCallable.call(MavenFingerprinter.java:236)
at hudson.maven.MavenBuild$ProxyImpl.execute(MavenBuild.java:454)
at hudson.maven.MavenBuild$ProxyImpl2.execute(MavenBuild.java:586)
at sun.reflect.GeneratedMethodAccessor1162.invoke(Unknown Source)
at sun.reflect.DelegatingMethodAccessorImpl.invoke(DelegatingMethodAccessorImpl.java:43)
at java.lang.reflect.Method.invoke(Method.java:498)
at hudson.model.Executor$2.call(Executor.java:932)
at hudson.util.InterceptingProxy$1.invoke(InterceptingProxy.java:23)
at com.sun.proxy.$Proxy180.execute(Unknown Source)
at hudson.maven.MavenBuildProxy$Filter$AsyncInvoker.call(MavenBuildProxy.java:294)
at hudson.remoting.UserRequest.perform(UserRequest.java:211)
at hudson.remoting.UserRequest.perform(UserRequest.java:54)
at hudson.remoting.Request$2.run(Request.java:369)
at hudson.remoting.InterceptingExecutorService$1.call(InterceptingExecutorService.java:72)
at org.jenkinsci.remoting.CallableDecorator.call(CallableDecorator.java:18)
at hudson.remoting.CallableDecoratorList$1.call(CallableDecoratorList.java:21)
at jenkins.util.ContextResettingExecutorService$2.call(ContextResettingExecutorService.java:46)
at jenkins.security.ImpersonatingExecutorService$2.call(ImpersonatingExecutorService.java:71)
... 4 more
Suppressed: hudson.remoting.Channel$CallSiteStackTrace: Remote call to channel
at hudson.remoting.Channel.attachCallSiteStackTrace(Channel.java:1788)
at hudson.remoting.UserRequest$ExceptionResponse.retrieve(UserRequest.java:356)
at hudson.remoting.Channel$2.adapt(Channel.java:1033)
at hudson.remoting.Channel$2.adapt(Channel.java:1029)
at hudson.remoting.FutureAdapter.get(FutureAdapter.java:55)
at hudson.maven.AbstractMavenBuilder.waitForAsynchronousExecutions(AbstractMavenBuilder.java:186)
at hudson.maven.Maven3Builder.call(Maven3Builder.java:146)
at hudson.maven.Maven3Builder.call(Maven3Builder.java:70)
at hudson.remoting.UserRequest.perform(UserRequest.java:211)
at hudson.remoting.UserRequest.perform(UserRequest.java:54)
at hudson.remoting.Request$2.run(Request.java:369)
at hudson.remoting.InterceptingExecutorService$1.call(InterceptingExecutorService.java:72)
... 4 more
[ERROR] Failed to execute goal org.sonatype.ossindex.maven:ossindex-maven-plugin:3.1.0:audit (default-cli) on project pdfbox: Detected 1 vulnerable components:
[ERROR] junit:junit:jar:4.13:test; https://ossindex.sonatype.org/component/pkg:maven/junit/junit@4.13?utm_source=ossindex-client&utm_medium=integration&utm_content=1.1.1
[ERROR] * [CVE-2020-15250] In JUnit4 from version 4.7 and before 4.13.1, the test rule TemporaryFolder cont... (5.5); https://ossindex.sonatype.org/vuln/7ea56ad4-8a8b-4e51-8ed9-5aad83d8efb1?component-type=maven&component-name=junit.junit&utm_source=ossindex-client&utm_medium=integration&utm_content=1.1.1
[ERROR] -> [Help 1]
[ERROR]
[ERROR] To see the full stack trace of the errors, re-run Maven with the -e switch.
[ERROR] Re-run Maven using the -X switch to enable full debug logging.
[ERROR]
[ERROR] For more information about the errors and possible solutions, please read the following articles:
[ERROR] [Help 1] http://cwiki.apache.org/confluence/display/MAVEN/MojoFailureException
[ERROR]
[ERROR] After correcting the problems, you can resume the build with the command
[ERROR] mvn <goals> -rf :pdfbox
[JENKINS] Archiving <https://ci-builds.apache.org/job/PDFBox/job/PDFBox-trunk/ws/xmpbox/pom.xml> to org.apache.pdfbox/xmpbox/3.0.0-SNAPSHOT/xmpbox-3.0.0-SNAPSHOT.pom
[JENKINS] Archiving <https://ci-builds.apache.org/job/PDFBox/job/PDFBox-trunk/ws/xmpbox/target/xmpbox-3.0.0-SNAPSHOT.jar> to org.apache.pdfbox/xmpbox/3.0.0-20201117.130022-2269/xmpbox-3.0.0-20201117.130022-2269.jar
[JENKINS] Archiving <https://ci-builds.apache.org/job/PDFBox/job/PDFBox-trunk/ws/tools/pom.xml> to org.apache.pdfbox/pdfbox-tools/3.0.0-SNAPSHOT/pdfbox-tools-3.0.0-SNAPSHOT.pom
[JENKINS] Archiving <https://ci-builds.apache.org/job/PDFBox/job/PDFBox-trunk/ws/debugger/pom.xml> to org.apache.pdfbox/pdfbox-debugger/3.0.0-SNAPSHOT/pdfbox-debugger-3.0.0-SNAPSHOT.pom
[JENKINS] Archiving <https://ci-builds.apache.org/job/PDFBox/job/PDFBox-trunk/ws/preflight-app/pom.xml> to org.apache.pdfbox/preflight-app/3.0.0-SNAPSHOT/preflight-app-3.0.0-SNAPSHOT.pom
[JENKINS] Archiving <https://ci-builds.apache.org/job/PDFBox/job/PDFBox-trunk/ws/app/pom.xml> to org.apache.pdfbox/pdfbox-app/3.0.0-SNAPSHOT/pdfbox-app-3.0.0-SNAPSHOT.pom
[JENKINS] Archiving <https://ci-builds.apache.org/job/PDFBox/job/PDFBox-trunk/ws/examples/pom.xml> to org.apache.pdfbox/pdfbox-examples/3.0.0-SNAPSHOT/pdfbox-examples-3.0.0-SNAPSHOT.pom
[JENKINS] Archiving <https://ci-builds.apache.org/job/PDFBox/job/PDFBox-trunk/ws/preflight/pom.xml> to org.apache.pdfbox/preflight/3.0.0-SNAPSHOT/preflight-3.0.0-SNAPSHOT.pom
[JENKINS] Archiving <https://ci-builds.apache.org/job/PDFBox/job/PDFBox-trunk/ws/pom.xml> to org.apache.pdfbox/pdfbox-reactor/3.0.0-SNAPSHOT/pdfbox-reactor-3.0.0-SNAPSHOT.pom
[JENKINS] Archiving <https://ci-builds.apache.org/job/PDFBox/job/PDFBox-trunk/ws/parent/pom.xml> to org.apache.pdfbox/pdfbox-parent/3.0.0-SNAPSHOT/pdfbox-parent-3.0.0-SNAPSHOT.pom
[JENKINS] Archiving <https://ci-builds.apache.org/job/PDFBox/job/PDFBox-trunk/ws/pdfbox/pom.xml> to org.apache.pdfbox/pdfbox/3.0.0-SNAPSHOT/pdfbox-3.0.0-SNAPSHOT.pom
[JENKINS] Archiving <https://ci-builds.apache.org/job/PDFBox/job/PDFBox-trunk/ws/pdfbox/target/pdfbox-3.0.0-SNAPSHOT.jar> to org.apache.pdfbox/pdfbox/3.0.0-20201117.130406-2236/pdfbox-3.0.0-20201117.130406-2236.jar
[Fast Archiver] Compressed 2.66 MB of artifacts by 34.1% relative to #226
[JENKINS] Archiving <https://ci-builds.apache.org/job/PDFBox/job/PDFBox-trunk/ws/debugger-app/pom.xml> to org.apache.pdfbox/debugger-app/3.0.0-SNAPSHOT/debugger-app-3.0.0-SNAPSHOT.pom
[JENKINS] Archiving <https://ci-builds.apache.org/job/PDFBox/job/PDFBox-trunk/ws/fontbox/pom.xml> to org.apache.pdfbox/fontbox/3.0.0-SNAPSHOT/fontbox-3.0.0-SNAPSHOT.pom
[JENKINS] Archiving <https://ci-builds.apache.org/job/PDFBox/job/PDFBox-trunk/ws/fontbox/target/fontbox-3.0.0-SNAPSHOT.jar> to org.apache.pdfbox/fontbox/3.0.0-20201117.125955-2276/fontbox-3.0.0-20201117.125955-2276.jar
[Fast Archiver] Compressed 1.53 MB of artifacts by 34.7% relative to #246
No mail will be sent out, as 'PDFBox » PDFBox-trunk » Apache PDFBox examples #247' does not have a result yet. Please make sure you set a proper result in case of pipeline/build scripts.
Sending e-mails to: dev@pdfbox.apache.org
No mail will be sent out, as 'PDFBox » PDFBox-trunk » Apache PDFBox Debugger application #247' does not have a result yet. Please make sure you set a proper result in case of pipeline/build scripts.
No mail will be sent out, as 'PDFBox » PDFBox-trunk » Apache PDFBox tools #247' does not have a result yet. Please make sure you set a proper result in case of pipeline/build scripts.
No mail will be sent out, as 'PDFBox » PDFBox-trunk » Apache PDFBox Debugger #247' does not have a result yet. Please make sure you set a proper result in case of pipeline/build scripts.
No mail will be sent out, as 'PDFBox » PDFBox-trunk » Apache Preflight application #247' does not have a result yet. Please make sure you set a proper result in case of pipeline/build scripts.
No mail will be sent out, as 'PDFBox » PDFBox-trunk » Apache PDFBox application #247' does not have a result yet. Please make sure you set a proper result in case of pipeline/build scripts.
No mail will be sent out, as 'PDFBox » PDFBox-trunk » Apache Preflight #247' does not have a result yet. Please make sure you set a proper result in case of pipeline/build scripts.
No mail will be sent out, as 'PDFBox » PDFBox-trunk » Apache PDFBox #247' does not have a result yet. Please make sure you set a proper result in case of pipeline/build scripts.
channel stopped
Archiving artifacts
---------------------------------------------------------------------
To unsubscribe, e-mail: dev-unsubscribe@pdfbox.apache.org
For additional commands, e-mail: dev-help@pdfbox.apache.org
Jenkins build is back to stable : PDFBox » PDFBox-trunk #258
Posted by Apache Jenkins Server <je...@builds.apache.org>.
See <https://ci-builds.apache.org/job/PDFBox/job/PDFBox-trunk/258/display/redirect?page=changes>
---------------------------------------------------------------------
To unsubscribe, e-mail: dev-unsubscribe@pdfbox.apache.org
For additional commands, e-mail: dev-help@pdfbox.apache.org
Jenkins build is still unstable: PDFBox » PDFBox-trunk #257
Posted by Apache Jenkins Server <je...@builds.apache.org>.
See <https://ci-builds.apache.org/job/PDFBox/job/PDFBox-trunk/257/display/redirect?page=changes>
---------------------------------------------------------------------
To unsubscribe, e-mail: dev-unsubscribe@pdfbox.apache.org
For additional commands, e-mail: dev-help@pdfbox.apache.org
Jenkins build is still unstable: PDFBox » PDFBox-trunk #256
Posted by Apache Jenkins Server <je...@builds.apache.org>.
See <https://ci-builds.apache.org/job/PDFBox/job/PDFBox-trunk/256/display/redirect?page=changes>
---------------------------------------------------------------------
To unsubscribe, e-mail: dev-unsubscribe@pdfbox.apache.org
For additional commands, e-mail: dev-help@pdfbox.apache.org
Jenkins build is still unstable: PDFBox » PDFBox-trunk #255
Posted by Apache Jenkins Server <je...@builds.apache.org>.
See <https://ci-builds.apache.org/job/PDFBox/job/PDFBox-trunk/255/display/redirect?page=changes>
---------------------------------------------------------------------
To unsubscribe, e-mail: dev-unsubscribe@pdfbox.apache.org
For additional commands, e-mail: dev-help@pdfbox.apache.org
Jenkins build is still unstable: PDFBox » PDFBox-trunk #254
Posted by Apache Jenkins Server <je...@builds.apache.org>.
See <https://ci-builds.apache.org/job/PDFBox/job/PDFBox-trunk/254/display/redirect?page=changes>
---------------------------------------------------------------------
To unsubscribe, e-mail: dev-unsubscribe@pdfbox.apache.org
For additional commands, e-mail: dev-help@pdfbox.apache.org
Jenkins build is still unstable: PDFBox » PDFBox-trunk #253
Posted by Apache Jenkins Server <je...@builds.apache.org>.
See <https://ci-builds.apache.org/job/PDFBox/job/PDFBox-trunk/253/display/redirect?page=changes>
---------------------------------------------------------------------
To unsubscribe, e-mail: dev-unsubscribe@pdfbox.apache.org
For additional commands, e-mail: dev-help@pdfbox.apache.org
Jenkins build is still unstable: PDFBox » PDFBox-trunk #252
Posted by Apache Jenkins Server <je...@builds.apache.org>.
See <https://ci-builds.apache.org/job/PDFBox/job/PDFBox-trunk/252/display/redirect?page=changes>
---------------------------------------------------------------------
To unsubscribe, e-mail: dev-unsubscribe@pdfbox.apache.org
For additional commands, e-mail: dev-help@pdfbox.apache.org
Jenkins build is still unstable: PDFBox » PDFBox-trunk #251
Posted by Apache Jenkins Server <je...@builds.apache.org>.
See <https://ci-builds.apache.org/job/PDFBox/job/PDFBox-trunk/251/display/redirect?page=changes>
---------------------------------------------------------------------
To unsubscribe, e-mail: dev-unsubscribe@pdfbox.apache.org
For additional commands, e-mail: dev-help@pdfbox.apache.org
Jenkins build is unstable: PDFBox » PDFBox-trunk #250
Posted by Apache Jenkins Server <je...@builds.apache.org>.
See <https://ci-builds.apache.org/job/PDFBox/job/PDFBox-trunk/250/display/redirect?page=changes>
---------------------------------------------------------------------
To unsubscribe, e-mail: dev-unsubscribe@pdfbox.apache.org
For additional commands, e-mail: dev-help@pdfbox.apache.org
Build failed in Jenkins: PDFBox » PDFBox-trunk #249
Posted by Apache Jenkins Server <je...@builds.apache.org>.
See <https://ci-builds.apache.org/job/PDFBox/job/PDFBox-trunk/249/display/redirect?page=changes>
Changes:
[Andreas Lehmkühler] PDFBOX-5017: switch test to junit5
[Andreas Lehmkühler] PDFBOX-5017: switch test to junit5
[Andreas Lehmkühler] PDFBOX-5017: switch test to junit5
[Andreas Lehmkühler] PDFBOX-5017: sonar fix
[Andreas Lehmkühler] PDFBOX-5017: sonar fix
------------------------------------------
[...truncated 98.05 KB...]
at hudson.model.Executor$2.call(Executor.java:932)
at hudson.util.InterceptingProxy$1.invoke(InterceptingProxy.java:23)
at com.sun.proxy.$Proxy180.execute(Unknown Source)
at hudson.maven.MavenBuildProxy$Filter$AsyncInvoker.call(MavenBuildProxy.java:294)
at hudson.remoting.UserRequest.perform(UserRequest.java:211)
at hudson.remoting.UserRequest.perform(UserRequest.java:54)
at hudson.remoting.Request$2.run(Request.java:369)
at hudson.remoting.InterceptingExecutorService$1.call(InterceptingExecutorService.java:72)
at org.jenkinsci.remoting.CallableDecorator.call(CallableDecorator.java:18)
at hudson.remoting.CallableDecoratorList$1.call(CallableDecoratorList.java:21)
at jenkins.util.ContextResettingExecutorService$2.call(ContextResettingExecutorService.java:46)
at jenkins.security.ImpersonatingExecutorService$2.call(ImpersonatingExecutorService.java:71)
... 4 more
Suppressed: hudson.remoting.Channel$CallSiteStackTrace: Remote call to channel
at hudson.remoting.Channel.attachCallSiteStackTrace(Channel.java:1788)
at hudson.remoting.UserRequest$ExceptionResponse.retrieve(UserRequest.java:356)
at hudson.remoting.Channel$2.adapt(Channel.java:1033)
at hudson.remoting.Channel$2.adapt(Channel.java:1029)
at hudson.remoting.FutureAdapter.get(FutureAdapter.java:55)
at hudson.maven.AbstractMavenBuilder.waitForAsynchronousExecutions(AbstractMavenBuilder.java:186)
at hudson.maven.Maven3Builder.call(Maven3Builder.java:146)
at hudson.maven.Maven3Builder.call(Maven3Builder.java:70)
at hudson.remoting.UserRequest.perform(UserRequest.java:211)
at hudson.remoting.UserRequest.perform(UserRequest.java:54)
at hudson.remoting.Request$2.run(Request.java:369)
at hudson.remoting.InterceptingExecutorService$1.call(InterceptingExecutorService.java:72)
... 4 more
ERROR: Asynchronous execution failure
java.util.concurrent.ExecutionException: java.io.IOException: Unexpected Fingerprint type. Expected class hudson.model.Fingerprint or subclass but got class hudson.model.Fingerprint$RangeSet
at hudson.remoting.Channel$2.adapt(Channel.java:1035)
at hudson.remoting.Channel$2.adapt(Channel.java:1029)
at hudson.remoting.FutureAdapter.get(FutureAdapter.java:55)
at hudson.maven.AbstractMavenBuilder.waitForAsynchronousExecutions(AbstractMavenBuilder.java:186)
at hudson.maven.Maven3Builder.call(Maven3Builder.java:146)
at hudson.maven.Maven3Builder.call(Maven3Builder.java:70)
at hudson.remoting.UserRequest.perform(UserRequest.java:211)
at hudson.remoting.UserRequest.perform(UserRequest.java:54)
at hudson.remoting.Request$2.run(Request.java:369)
at hudson.remoting.InterceptingExecutorService$1.call(InterceptingExecutorService.java:72)
at java.util.concurrent.FutureTask.run(FutureTask.java:266)
at java.util.concurrent.ThreadPoolExecutor.runWorker(ThreadPoolExecutor.java:1149)
at java.util.concurrent.ThreadPoolExecutor$Worker.run(ThreadPoolExecutor.java:624)
at java.lang.Thread.run(Thread.java:748)
Caused by: java.io.IOException: Unexpected Fingerprint type. Expected class hudson.model.Fingerprint or subclass but got class hudson.model.Fingerprint$RangeSet
at hudson.model.Fingerprint.load(Fingerprint.java:1387)
at hudson.model.Fingerprint.load(Fingerprint.java:1372)
at hudson.model.FingerprintMap.load(FingerprintMap.java:97)
at hudson.model.FingerprintMap.load(FingerprintMap.java:47)
at hudson.util.KeyedDataStorage.get(KeyedDataStorage.java:161)
at hudson.model.FingerprintMap.get(FingerprintMap.java:82)
at hudson.model.FingerprintMap.get(FingerprintMap.java:47)
at hudson.util.KeyedDataStorage.getOrCreate(KeyedDataStorage.java:111)
at hudson.model.FingerprintMap.getOrCreate(FingerprintMap.java:68)
at hudson.maven.reporters.MavenFingerprinter$PostBuildCallable.call(MavenFingerprinter.java:249)
at hudson.maven.reporters.MavenFingerprinter$PostBuildCallable.call(MavenFingerprinter.java:236)
at hudson.maven.MavenBuild$ProxyImpl.execute(MavenBuild.java:454)
at hudson.maven.MavenBuild$ProxyImpl2.execute(MavenBuild.java:586)
at sun.reflect.GeneratedMethodAccessor1162.invoke(Unknown Source)
at sun.reflect.DelegatingMethodAccessorImpl.invoke(DelegatingMethodAccessorImpl.java:43)
at java.lang.reflect.Method.invoke(Method.java:498)
at hudson.model.Executor$2.call(Executor.java:932)
at hudson.util.InterceptingProxy$1.invoke(InterceptingProxy.java:23)
at com.sun.proxy.$Proxy180.execute(Unknown Source)
at hudson.maven.MavenBuildProxy$Filter$AsyncInvoker.call(MavenBuildProxy.java:294)
at hudson.remoting.UserRequest.perform(UserRequest.java:211)
at hudson.remoting.UserRequest.perform(UserRequest.java:54)
at hudson.remoting.Request$2.run(Request.java:369)
at hudson.remoting.InterceptingExecutorService$1.call(InterceptingExecutorService.java:72)
at org.jenkinsci.remoting.CallableDecorator.call(CallableDecorator.java:18)
at hudson.remoting.CallableDecoratorList$1.call(CallableDecoratorList.java:21)
at jenkins.util.ContextResettingExecutorService$2.call(ContextResettingExecutorService.java:46)
at jenkins.security.ImpersonatingExecutorService$2.call(ImpersonatingExecutorService.java:71)
... 4 more
Suppressed: hudson.remoting.Channel$CallSiteStackTrace: Remote call to channel
at hudson.remoting.Channel.attachCallSiteStackTrace(Channel.java:1788)
at hudson.remoting.UserRequest$ExceptionResponse.retrieve(UserRequest.java:356)
at hudson.remoting.Channel$2.adapt(Channel.java:1033)
at hudson.remoting.Channel$2.adapt(Channel.java:1029)
at hudson.remoting.FutureAdapter.get(FutureAdapter.java:55)
at hudson.maven.AbstractMavenBuilder.waitForAsynchronousExecutions(AbstractMavenBuilder.java:186)
at hudson.maven.Maven3Builder.call(Maven3Builder.java:146)
at hudson.maven.Maven3Builder.call(Maven3Builder.java:70)
at hudson.remoting.UserRequest.perform(UserRequest.java:211)
at hudson.remoting.UserRequest.perform(UserRequest.java:54)
at hudson.remoting.Request$2.run(Request.java:369)
at hudson.remoting.InterceptingExecutorService$1.call(InterceptingExecutorService.java:72)
... 4 more
ERROR: Asynchronous execution failure
java.util.concurrent.ExecutionException: java.io.IOException: Unexpected Fingerprint type. Expected class hudson.model.Fingerprint or subclass but got class hudson.model.Fingerprint$RangeSet
at hudson.remoting.Channel$2.adapt(Channel.java:1035)
at hudson.remoting.Channel$2.adapt(Channel.java:1029)
at hudson.remoting.FutureAdapter.get(FutureAdapter.java:55)
at hudson.maven.AbstractMavenBuilder.waitForAsynchronousExecutions(AbstractMavenBuilder.java:186)
at hudson.maven.Maven3Builder.call(Maven3Builder.java:146)
at hudson.maven.Maven3Builder.call(Maven3Builder.java:70)
at hudson.remoting.UserRequest.perform(UserRequest.java:211)
at hudson.remoting.UserRequest.perform(UserRequest.java:54)
at hudson.remoting.Request$2.run(Request.java:369)
at hudson.remoting.InterceptingExecutorService$1.call(InterceptingExecutorService.java:72)
at java.util.concurrent.FutureTask.run(FutureTask.java:266)
at java.util.concurrent.ThreadPoolExecutor.runWorker(ThreadPoolExecutor.java:1149)
at java.util.concurrent.ThreadPoolExecutor$Worker.run(ThreadPoolExecutor.java:624)
at java.lang.Thread.run(Thread.java:748)
Caused by: java.io.IOException: Unexpected Fingerprint type. Expected class hudson.model.Fingerprint or subclass but got class hudson.model.Fingerprint$RangeSet
at hudson.model.Fingerprint.load(Fingerprint.java:1387)
at hudson.model.Fingerprint.load(Fingerprint.java:1372)
at hudson.model.FingerprintMap.load(FingerprintMap.java:97)
at hudson.model.FingerprintMap.load(FingerprintMap.java:47)
at hudson.util.KeyedDataStorage.get(KeyedDataStorage.java:161)
at hudson.model.FingerprintMap.get(FingerprintMap.java:82)
at hudson.model.FingerprintMap.get(FingerprintMap.java:47)
at hudson.util.KeyedDataStorage.getOrCreate(KeyedDataStorage.java:111)
at hudson.model.FingerprintMap.getOrCreate(FingerprintMap.java:68)
at hudson.maven.reporters.MavenFingerprinter$PostBuildCallable.call(MavenFingerprinter.java:249)
at hudson.maven.reporters.MavenFingerprinter$PostBuildCallable.call(MavenFingerprinter.java:236)
at hudson.maven.MavenBuild$ProxyImpl.execute(MavenBuild.java:454)
at hudson.maven.MavenBuild$ProxyImpl2.execute(MavenBuild.java:586)
at sun.reflect.GeneratedMethodAccessor1162.invoke(Unknown Source)
at sun.reflect.DelegatingMethodAccessorImpl.invoke(DelegatingMethodAccessorImpl.java:43)
at java.lang.reflect.Method.invoke(Method.java:498)
at hudson.model.Executor$2.call(Executor.java:932)
at hudson.util.InterceptingProxy$1.invoke(InterceptingProxy.java:23)
at com.sun.proxy.$Proxy180.execute(Unknown Source)
at hudson.maven.MavenBuildProxy$Filter$AsyncInvoker.call(MavenBuildProxy.java:294)
at hudson.remoting.UserRequest.perform(UserRequest.java:211)
at hudson.remoting.UserRequest.perform(UserRequest.java:54)
at hudson.remoting.Request$2.run(Request.java:369)
at hudson.remoting.InterceptingExecutorService$1.call(InterceptingExecutorService.java:72)
at org.jenkinsci.remoting.CallableDecorator.call(CallableDecorator.java:18)
at hudson.remoting.CallableDecoratorList$1.call(CallableDecoratorList.java:21)
at jenkins.util.ContextResettingExecutorService$2.call(ContextResettingExecutorService.java:46)
at jenkins.security.ImpersonatingExecutorService$2.call(ImpersonatingExecutorService.java:71)
... 4 more
Suppressed: hudson.remoting.Channel$CallSiteStackTrace: Remote call to channel
at hudson.remoting.Channel.attachCallSiteStackTrace(Channel.java:1788)
at hudson.remoting.UserRequest$ExceptionResponse.retrieve(UserRequest.java:356)
at hudson.remoting.Channel$2.adapt(Channel.java:1033)
at hudson.remoting.Channel$2.adapt(Channel.java:1029)
at hudson.remoting.FutureAdapter.get(FutureAdapter.java:55)
at hudson.maven.AbstractMavenBuilder.waitForAsynchronousExecutions(AbstractMavenBuilder.java:186)
at hudson.maven.Maven3Builder.call(Maven3Builder.java:146)
at hudson.maven.Maven3Builder.call(Maven3Builder.java:70)
at hudson.remoting.UserRequest.perform(UserRequest.java:211)
at hudson.remoting.UserRequest.perform(UserRequest.java:54)
at hudson.remoting.Request$2.run(Request.java:369)
at hudson.remoting.InterceptingExecutorService$1.call(InterceptingExecutorService.java:72)
... 4 more
ERROR: Asynchronous execution failure
java.util.concurrent.ExecutionException: java.io.IOException: Unexpected Fingerprint type. Expected class hudson.model.Fingerprint or subclass but got class hudson.model.Fingerprint$RangeSet
at hudson.remoting.Channel$2.adapt(Channel.java:1035)
at hudson.remoting.Channel$2.adapt(Channel.java:1029)
at hudson.remoting.FutureAdapter.get(FutureAdapter.java:55)
at hudson.maven.AbstractMavenBuilder.waitForAsynchronousExecutions(AbstractMavenBuilder.java:186)
at hudson.maven.Maven3Builder.call(Maven3Builder.java:146)
at hudson.maven.Maven3Builder.call(Maven3Builder.java:70)
at hudson.remoting.UserRequest.perform(UserRequest.java:211)
at hudson.remoting.UserRequest.perform(UserRequest.java:54)
at hudson.remoting.Request$2.run(Request.java:369)
at hudson.remoting.InterceptingExecutorService$1.call(InterceptingExecutorService.java:72)
at java.util.concurrent.FutureTask.run(FutureTask.java:266)
at java.util.concurrent.ThreadPoolExecutor.runWorker(ThreadPoolExecutor.java:1149)
at java.util.concurrent.ThreadPoolExecutor$Worker.run(ThreadPoolExecutor.java:624)
at java.lang.Thread.run(Thread.java:748)
Caused by: java.io.IOException: Unexpected Fingerprint type. Expected class hudson.model.Fingerprint or subclass but got class hudson.model.Fingerprint$RangeSet
at hudson.model.Fingerprint.load(Fingerprint.java:1387)
at hudson.model.Fingerprint.load(Fingerprint.java:1372)
at hudson.model.FingerprintMap.load(FingerprintMap.java:97)
at hudson.model.FingerprintMap.load(FingerprintMap.java:47)
at hudson.util.KeyedDataStorage.get(KeyedDataStorage.java:161)
at hudson.model.FingerprintMap.get(FingerprintMap.java:82)
at hudson.model.FingerprintMap.get(FingerprintMap.java:47)
at hudson.util.KeyedDataStorage.getOrCreate(KeyedDataStorage.java:111)
at hudson.model.FingerprintMap.getOrCreate(FingerprintMap.java:68)
at hudson.maven.reporters.MavenFingerprinter$PostBuildCallable.call(MavenFingerprinter.java:249)
at hudson.maven.reporters.MavenFingerprinter$PostBuildCallable.call(MavenFingerprinter.java:236)
at hudson.maven.MavenBuild$ProxyImpl.execute(MavenBuild.java:454)
at hudson.maven.MavenBuild$ProxyImpl2.execute(MavenBuild.java:586)
at sun.reflect.GeneratedMethodAccessor1162.invoke(Unknown Source)
at sun.reflect.DelegatingMethodAccessorImpl.invoke(DelegatingMethodAccessorImpl.java:43)
at java.lang.reflect.Method.invoke(Method.java:498)
at hudson.model.Executor$2.call(Executor.java:932)
at hudson.util.InterceptingProxy$1.invoke(InterceptingProxy.java:23)
at com.sun.proxy.$Proxy180.execute(Unknown Source)
at hudson.maven.MavenBuildProxy$Filter$AsyncInvoker.call(MavenBuildProxy.java:294)
at hudson.remoting.UserRequest.perform(UserRequest.java:211)
at hudson.remoting.UserRequest.perform(UserRequest.java:54)
at hudson.remoting.Request$2.run(Request.java:369)
at hudson.remoting.InterceptingExecutorService$1.call(InterceptingExecutorService.java:72)
at org.jenkinsci.remoting.CallableDecorator.call(CallableDecorator.java:18)
at hudson.remoting.CallableDecoratorList$1.call(CallableDecoratorList.java:21)
at jenkins.util.ContextResettingExecutorService$2.call(ContextResettingExecutorService.java:46)
at jenkins.security.ImpersonatingExecutorService$2.call(ImpersonatingExecutorService.java:71)
... 4 more
Suppressed: hudson.remoting.Channel$CallSiteStackTrace: Remote call to channel
at hudson.remoting.Channel.attachCallSiteStackTrace(Channel.java:1788)
at hudson.remoting.UserRequest$ExceptionResponse.retrieve(UserRequest.java:356)
at hudson.remoting.Channel$2.adapt(Channel.java:1033)
at hudson.remoting.Channel$2.adapt(Channel.java:1029)
at hudson.remoting.FutureAdapter.get(FutureAdapter.java:55)
at hudson.maven.AbstractMavenBuilder.waitForAsynchronousExecutions(AbstractMavenBuilder.java:186)
at hudson.maven.Maven3Builder.call(Maven3Builder.java:146)
at hudson.maven.Maven3Builder.call(Maven3Builder.java:70)
at hudson.remoting.UserRequest.perform(UserRequest.java:211)
at hudson.remoting.UserRequest.perform(UserRequest.java:54)
at hudson.remoting.Request$2.run(Request.java:369)
at hudson.remoting.InterceptingExecutorService$1.call(InterceptingExecutorService.java:72)
... 4 more
[ERROR] Failed to execute goal org.sonatype.ossindex.maven:ossindex-maven-plugin:3.1.0:audit (default-cli) on project pdfbox: Detected 1 vulnerable components:
[ERROR] junit:junit:jar:4.13:test; https://ossindex.sonatype.org/component/pkg:maven/junit/junit@4.13?utm_source=ossindex-client&utm_medium=integration&utm_content=1.1.1
[ERROR] * [CVE-2020-15250] In JUnit4 from version 4.7 and before 4.13.1, the test rule TemporaryFolder cont... (5.5); https://ossindex.sonatype.org/vuln/7ea56ad4-8a8b-4e51-8ed9-5aad83d8efb1?component-type=maven&component-name=junit.junit&utm_source=ossindex-client&utm_medium=integration&utm_content=1.1.1
[ERROR] -> [Help 1]
[ERROR]
[ERROR] To see the full stack trace of the errors, re-run Maven with the -e switch.
[ERROR] Re-run Maven using the -X switch to enable full debug logging.
[ERROR]
[ERROR] For more information about the errors and possible solutions, please read the following articles:
[ERROR] [Help 1] http://cwiki.apache.org/confluence/display/MAVEN/MojoFailureException
[ERROR]
[ERROR] After correcting the problems, you can resume the build with the command
[ERROR] mvn <goals> -rf :pdfbox
[JENKINS] Archiving <https://ci-builds.apache.org/job/PDFBox/job/PDFBox-trunk/ws/xmpbox/pom.xml> to org.apache.pdfbox/xmpbox/3.0.0-SNAPSHOT/xmpbox-3.0.0-SNAPSHOT.pom
[JENKINS] Archiving <https://ci-builds.apache.org/job/PDFBox/job/PDFBox-trunk/ws/xmpbox/target/xmpbox-3.0.0-SNAPSHOT.jar> to org.apache.pdfbox/xmpbox/3.0.0-20201117.170009-2271/xmpbox-3.0.0-20201117.170009-2271.jar
[JENKINS] Archiving <https://ci-builds.apache.org/job/PDFBox/job/PDFBox-trunk/ws/tools/pom.xml> to org.apache.pdfbox/pdfbox-tools/3.0.0-SNAPSHOT/pdfbox-tools-3.0.0-SNAPSHOT.pom
[JENKINS] Archiving <https://ci-builds.apache.org/job/PDFBox/job/PDFBox-trunk/ws/debugger/pom.xml> to org.apache.pdfbox/pdfbox-debugger/3.0.0-SNAPSHOT/pdfbox-debugger-3.0.0-SNAPSHOT.pom
[JENKINS] Archiving <https://ci-builds.apache.org/job/PDFBox/job/PDFBox-trunk/ws/preflight-app/pom.xml> to org.apache.pdfbox/preflight-app/3.0.0-SNAPSHOT/preflight-app-3.0.0-SNAPSHOT.pom
[JENKINS] Archiving <https://ci-builds.apache.org/job/PDFBox/job/PDFBox-trunk/ws/app/pom.xml> to org.apache.pdfbox/pdfbox-app/3.0.0-SNAPSHOT/pdfbox-app-3.0.0-SNAPSHOT.pom
[JENKINS] Archiving <https://ci-builds.apache.org/job/PDFBox/job/PDFBox-trunk/ws/examples/pom.xml> to org.apache.pdfbox/pdfbox-examples/3.0.0-SNAPSHOT/pdfbox-examples-3.0.0-SNAPSHOT.pom
[JENKINS] Archiving <https://ci-builds.apache.org/job/PDFBox/job/PDFBox-trunk/ws/preflight/pom.xml> to org.apache.pdfbox/preflight/3.0.0-SNAPSHOT/preflight-3.0.0-SNAPSHOT.pom
[JENKINS] Archiving <https://ci-builds.apache.org/job/PDFBox/job/PDFBox-trunk/ws/pom.xml> to org.apache.pdfbox/pdfbox-reactor/3.0.0-SNAPSHOT/pdfbox-reactor-3.0.0-SNAPSHOT.pom
[JENKINS] Archiving <https://ci-builds.apache.org/job/PDFBox/job/PDFBox-trunk/ws/parent/pom.xml> to org.apache.pdfbox/pdfbox-parent/3.0.0-SNAPSHOT/pdfbox-parent-3.0.0-SNAPSHOT.pom
[JENKINS] Archiving <https://ci-builds.apache.org/job/PDFBox/job/PDFBox-trunk/ws/pdfbox/pom.xml> to org.apache.pdfbox/pdfbox/3.0.0-SNAPSHOT/pdfbox-3.0.0-SNAPSHOT.pom
[JENKINS] Archiving <https://ci-builds.apache.org/job/PDFBox/job/PDFBox-trunk/ws/pdfbox/target/pdfbox-3.0.0-SNAPSHOT.jar> to org.apache.pdfbox/pdfbox/3.0.0-20201117.170116-2238/pdfbox-3.0.0-20201117.170116-2238.jar
[Fast Archiver] Compressed 2.66 MB of artifacts by 34.1% relative to #226
[JENKINS] Archiving <https://ci-builds.apache.org/job/PDFBox/job/PDFBox-trunk/ws/debugger-app/pom.xml> to org.apache.pdfbox/debugger-app/3.0.0-SNAPSHOT/debugger-app-3.0.0-SNAPSHOT.pom
[JENKINS] Archiving <https://ci-builds.apache.org/job/PDFBox/job/PDFBox-trunk/ws/fontbox/pom.xml> to org.apache.pdfbox/fontbox/3.0.0-SNAPSHOT/fontbox-3.0.0-SNAPSHOT.pom
[JENKINS] Archiving <https://ci-builds.apache.org/job/PDFBox/job/PDFBox-trunk/ws/fontbox/target/fontbox-3.0.0-SNAPSHOT.jar> to org.apache.pdfbox/fontbox/3.0.0-20201117.165943-2278/fontbox-3.0.0-20201117.165943-2278.jar
[Fast Archiver] Compressed 1.53 MB of artifacts by 71.4% relative to #248
No mail will be sent out, as 'PDFBox » PDFBox-trunk » Apache PDFBox examples #249' does not have a result yet. Please make sure you set a proper result in case of pipeline/build scripts.
Sending e-mails to: dev@pdfbox.apache.org
No mail will be sent out, as 'PDFBox » PDFBox-trunk » Apache PDFBox Debugger application #249' does not have a result yet. Please make sure you set a proper result in case of pipeline/build scripts.
Sending e-mails to: dev@pdfbox.apache.org
No mail will be sent out, as 'PDFBox » PDFBox-trunk » Apache PDFBox tools #249' does not have a result yet. Please make sure you set a proper result in case of pipeline/build scripts.
No mail will be sent out, as 'PDFBox » PDFBox-trunk » Apache PDFBox Debugger #249' does not have a result yet. Please make sure you set a proper result in case of pipeline/build scripts.
No mail will be sent out, as 'PDFBox » PDFBox-trunk » Apache Preflight application #249' does not have a result yet. Please make sure you set a proper result in case of pipeline/build scripts.
No mail will be sent out, as 'PDFBox » PDFBox-trunk » Apache PDFBox application #249' does not have a result yet. Please make sure you set a proper result in case of pipeline/build scripts.
No mail will be sent out, as 'PDFBox » PDFBox-trunk » Apache Preflight #249' does not have a result yet. Please make sure you set a proper result in case of pipeline/build scripts.
No mail will be sent out, as 'PDFBox » PDFBox-trunk » Apache PDFBox #249' does not have a result yet. Please make sure you set a proper result in case of pipeline/build scripts.
channel stopped
Archiving artifacts
---------------------------------------------------------------------
To unsubscribe, e-mail: dev-unsubscribe@pdfbox.apache.org
For additional commands, e-mail: dev-help@pdfbox.apache.org
Build failed in Jenkins: PDFBox » PDFBox-trunk #248
Posted by Apache Jenkins Server <je...@builds.apache.org>.
See <https://ci-builds.apache.org/job/PDFBox/job/PDFBox-trunk/248/display/redirect?page=changes>
Changes:
[Maruan Sahyoun] PDFBOX-5017: switch to JUnit5
[Maruan Sahyoun] PDFBOX-5017: switch to JUnit5
------------------------------------------
[...truncated 99.50 KB...]
at hudson.model.Executor$2.call(Executor.java:932)
at hudson.util.InterceptingProxy$1.invoke(InterceptingProxy.java:23)
at com.sun.proxy.$Proxy180.execute(Unknown Source)
at hudson.maven.MavenBuildProxy$Filter$AsyncInvoker.call(MavenBuildProxy.java:294)
at hudson.remoting.UserRequest.perform(UserRequest.java:211)
at hudson.remoting.UserRequest.perform(UserRequest.java:54)
at hudson.remoting.Request$2.run(Request.java:369)
at hudson.remoting.InterceptingExecutorService$1.call(InterceptingExecutorService.java:72)
at org.jenkinsci.remoting.CallableDecorator.call(CallableDecorator.java:18)
at hudson.remoting.CallableDecoratorList$1.call(CallableDecoratorList.java:21)
at jenkins.util.ContextResettingExecutorService$2.call(ContextResettingExecutorService.java:46)
at jenkins.security.ImpersonatingExecutorService$2.call(ImpersonatingExecutorService.java:71)
... 4 more
Suppressed: hudson.remoting.Channel$CallSiteStackTrace: Remote call to channel
at hudson.remoting.Channel.attachCallSiteStackTrace(Channel.java:1788)
at hudson.remoting.UserRequest$ExceptionResponse.retrieve(UserRequest.java:356)
at hudson.remoting.Channel$2.adapt(Channel.java:1033)
at hudson.remoting.Channel$2.adapt(Channel.java:1029)
at hudson.remoting.FutureAdapter.get(FutureAdapter.java:55)
at hudson.maven.AbstractMavenBuilder.waitForAsynchronousExecutions(AbstractMavenBuilder.java:186)
at hudson.maven.Maven3Builder.call(Maven3Builder.java:146)
at hudson.maven.Maven3Builder.call(Maven3Builder.java:70)
at hudson.remoting.UserRequest.perform(UserRequest.java:211)
at hudson.remoting.UserRequest.perform(UserRequest.java:54)
at hudson.remoting.Request$2.run(Request.java:369)
at hudson.remoting.InterceptingExecutorService$1.call(InterceptingExecutorService.java:72)
... 4 more
ERROR: Asynchronous execution failure
java.util.concurrent.ExecutionException: java.io.IOException: Unexpected Fingerprint type. Expected class hudson.model.Fingerprint or subclass but got class hudson.model.Fingerprint$RangeSet
at hudson.remoting.Channel$2.adapt(Channel.java:1035)
at hudson.remoting.Channel$2.adapt(Channel.java:1029)
at hudson.remoting.FutureAdapter.get(FutureAdapter.java:55)
at hudson.maven.AbstractMavenBuilder.waitForAsynchronousExecutions(AbstractMavenBuilder.java:186)
at hudson.maven.Maven3Builder.call(Maven3Builder.java:146)
at hudson.maven.Maven3Builder.call(Maven3Builder.java:70)
at hudson.remoting.UserRequest.perform(UserRequest.java:211)
at hudson.remoting.UserRequest.perform(UserRequest.java:54)
at hudson.remoting.Request$2.run(Request.java:369)
at hudson.remoting.InterceptingExecutorService$1.call(InterceptingExecutorService.java:72)
at java.util.concurrent.FutureTask.run(FutureTask.java:266)
at java.util.concurrent.ThreadPoolExecutor.runWorker(ThreadPoolExecutor.java:1149)
at java.util.concurrent.ThreadPoolExecutor$Worker.run(ThreadPoolExecutor.java:624)
at java.lang.Thread.run(Thread.java:748)
Caused by: java.io.IOException: Unexpected Fingerprint type. Expected class hudson.model.Fingerprint or subclass but got class hudson.model.Fingerprint$RangeSet
at hudson.model.Fingerprint.load(Fingerprint.java:1387)
at hudson.model.Fingerprint.load(Fingerprint.java:1372)
at hudson.model.FingerprintMap.load(FingerprintMap.java:97)
at hudson.model.FingerprintMap.load(FingerprintMap.java:47)
at hudson.util.KeyedDataStorage.get(KeyedDataStorage.java:161)
at hudson.model.FingerprintMap.get(FingerprintMap.java:82)
at hudson.model.FingerprintMap.get(FingerprintMap.java:47)
at hudson.util.KeyedDataStorage.getOrCreate(KeyedDataStorage.java:111)
at hudson.model.FingerprintMap.getOrCreate(FingerprintMap.java:68)
at hudson.maven.reporters.MavenFingerprinter$PostBuildCallable.call(MavenFingerprinter.java:249)
at hudson.maven.reporters.MavenFingerprinter$PostBuildCallable.call(MavenFingerprinter.java:236)
at hudson.maven.MavenBuild$ProxyImpl.execute(MavenBuild.java:454)
at hudson.maven.MavenBuild$ProxyImpl2.execute(MavenBuild.java:586)
at sun.reflect.GeneratedMethodAccessor1162.invoke(Unknown Source)
at sun.reflect.DelegatingMethodAccessorImpl.invoke(DelegatingMethodAccessorImpl.java:43)
at java.lang.reflect.Method.invoke(Method.java:498)
at hudson.model.Executor$2.call(Executor.java:932)
at hudson.util.InterceptingProxy$1.invoke(InterceptingProxy.java:23)
at com.sun.proxy.$Proxy180.execute(Unknown Source)
at hudson.maven.MavenBuildProxy$Filter$AsyncInvoker.call(MavenBuildProxy.java:294)
at hudson.remoting.UserRequest.perform(UserRequest.java:211)
at hudson.remoting.UserRequest.perform(UserRequest.java:54)
at hudson.remoting.Request$2.run(Request.java:369)
at hudson.remoting.InterceptingExecutorService$1.call(InterceptingExecutorService.java:72)
at org.jenkinsci.remoting.CallableDecorator.call(CallableDecorator.java:18)
at hudson.remoting.CallableDecoratorList$1.call(CallableDecoratorList.java:21)
at jenkins.util.ContextResettingExecutorService$2.call(ContextResettingExecutorService.java:46)
at jenkins.security.ImpersonatingExecutorService$2.call(ImpersonatingExecutorService.java:71)
... 4 more
Suppressed: hudson.remoting.Channel$CallSiteStackTrace: Remote call to channel
at hudson.remoting.Channel.attachCallSiteStackTrace(Channel.java:1788)
at hudson.remoting.UserRequest$ExceptionResponse.retrieve(UserRequest.java:356)
at hudson.remoting.Channel$2.adapt(Channel.java:1033)
at hudson.remoting.Channel$2.adapt(Channel.java:1029)
at hudson.remoting.FutureAdapter.get(FutureAdapter.java:55)
at hudson.maven.AbstractMavenBuilder.waitForAsynchronousExecutions(AbstractMavenBuilder.java:186)
at hudson.maven.Maven3Builder.call(Maven3Builder.java:146)
at hudson.maven.Maven3Builder.call(Maven3Builder.java:70)
at hudson.remoting.UserRequest.perform(UserRequest.java:211)
at hudson.remoting.UserRequest.perform(UserRequest.java:54)
at hudson.remoting.Request$2.run(Request.java:369)
at hudson.remoting.InterceptingExecutorService$1.call(InterceptingExecutorService.java:72)
... 4 more
ERROR: Asynchronous execution failure
java.util.concurrent.ExecutionException: java.io.IOException: Unexpected Fingerprint type. Expected class hudson.model.Fingerprint or subclass but got class hudson.model.Fingerprint$RangeSet
at hudson.remoting.Channel$2.adapt(Channel.java:1035)
at hudson.remoting.Channel$2.adapt(Channel.java:1029)
at hudson.remoting.FutureAdapter.get(FutureAdapter.java:55)
at hudson.maven.AbstractMavenBuilder.waitForAsynchronousExecutions(AbstractMavenBuilder.java:186)
at hudson.maven.Maven3Builder.call(Maven3Builder.java:146)
at hudson.maven.Maven3Builder.call(Maven3Builder.java:70)
at hudson.remoting.UserRequest.perform(UserRequest.java:211)
at hudson.remoting.UserRequest.perform(UserRequest.java:54)
at hudson.remoting.Request$2.run(Request.java:369)
at hudson.remoting.InterceptingExecutorService$1.call(InterceptingExecutorService.java:72)
at java.util.concurrent.FutureTask.run(FutureTask.java:266)
at java.util.concurrent.ThreadPoolExecutor.runWorker(ThreadPoolExecutor.java:1149)
at java.util.concurrent.ThreadPoolExecutor$Worker.run(ThreadPoolExecutor.java:624)
at java.lang.Thread.run(Thread.java:748)
Caused by: java.io.IOException: Unexpected Fingerprint type. Expected class hudson.model.Fingerprint or subclass but got class hudson.model.Fingerprint$RangeSet
at hudson.model.Fingerprint.load(Fingerprint.java:1387)
at hudson.model.Fingerprint.load(Fingerprint.java:1372)
at hudson.model.FingerprintMap.load(FingerprintMap.java:97)
at hudson.model.FingerprintMap.load(FingerprintMap.java:47)
at hudson.util.KeyedDataStorage.get(KeyedDataStorage.java:161)
at hudson.model.FingerprintMap.get(FingerprintMap.java:82)
at hudson.model.FingerprintMap.get(FingerprintMap.java:47)
at hudson.util.KeyedDataStorage.getOrCreate(KeyedDataStorage.java:111)
at hudson.model.FingerprintMap.getOrCreate(FingerprintMap.java:68)
at hudson.maven.reporters.MavenFingerprinter$PostBuildCallable.call(MavenFingerprinter.java:249)
at hudson.maven.reporters.MavenFingerprinter$PostBuildCallable.call(MavenFingerprinter.java:236)
at hudson.maven.MavenBuild$ProxyImpl.execute(MavenBuild.java:454)
at hudson.maven.MavenBuild$ProxyImpl2.execute(MavenBuild.java:586)
at sun.reflect.GeneratedMethodAccessor1162.invoke(Unknown Source)
at sun.reflect.DelegatingMethodAccessorImpl.invoke(DelegatingMethodAccessorImpl.java:43)
at java.lang.reflect.Method.invoke(Method.java:498)
at hudson.model.Executor$2.call(Executor.java:932)
at hudson.util.InterceptingProxy$1.invoke(InterceptingProxy.java:23)
at com.sun.proxy.$Proxy180.execute(Unknown Source)
at hudson.maven.MavenBuildProxy$Filter$AsyncInvoker.call(MavenBuildProxy.java:294)
at hudson.remoting.UserRequest.perform(UserRequest.java:211)
at hudson.remoting.UserRequest.perform(UserRequest.java:54)
at hudson.remoting.Request$2.run(Request.java:369)
at hudson.remoting.InterceptingExecutorService$1.call(InterceptingExecutorService.java:72)
at org.jenkinsci.remoting.CallableDecorator.call(CallableDecorator.java:18)
at hudson.remoting.CallableDecoratorList$1.call(CallableDecoratorList.java:21)
at jenkins.util.ContextResettingExecutorService$2.call(ContextResettingExecutorService.java:46)
at jenkins.security.ImpersonatingExecutorService$2.call(ImpersonatingExecutorService.java:71)
... 4 more
Suppressed: hudson.remoting.Channel$CallSiteStackTrace: Remote call to channel
at hudson.remoting.Channel.attachCallSiteStackTrace(Channel.java:1788)
at hudson.remoting.UserRequest$ExceptionResponse.retrieve(UserRequest.java:356)
at hudson.remoting.Channel$2.adapt(Channel.java:1033)
at hudson.remoting.Channel$2.adapt(Channel.java:1029)
at hudson.remoting.FutureAdapter.get(FutureAdapter.java:55)
at hudson.maven.AbstractMavenBuilder.waitForAsynchronousExecutions(AbstractMavenBuilder.java:186)
at hudson.maven.Maven3Builder.call(Maven3Builder.java:146)
at hudson.maven.Maven3Builder.call(Maven3Builder.java:70)
at hudson.remoting.UserRequest.perform(UserRequest.java:211)
at hudson.remoting.UserRequest.perform(UserRequest.java:54)
at hudson.remoting.Request$2.run(Request.java:369)
at hudson.remoting.InterceptingExecutorService$1.call(InterceptingExecutorService.java:72)
... 4 more
ERROR: Asynchronous execution failure
java.util.concurrent.ExecutionException: java.io.IOException: Unexpected Fingerprint type. Expected class hudson.model.Fingerprint or subclass but got class hudson.model.Fingerprint$RangeSet
at hudson.remoting.Channel$2.adapt(Channel.java:1035)
at hudson.remoting.Channel$2.adapt(Channel.java:1029)
at hudson.remoting.FutureAdapter.get(FutureAdapter.java:55)
at hudson.maven.AbstractMavenBuilder.waitForAsynchronousExecutions(AbstractMavenBuilder.java:186)
at hudson.maven.Maven3Builder.call(Maven3Builder.java:146)
at hudson.maven.Maven3Builder.call(Maven3Builder.java:70)
at hudson.remoting.UserRequest.perform(UserRequest.java:211)
at hudson.remoting.UserRequest.perform(UserRequest.java:54)
at hudson.remoting.Request$2.run(Request.java:369)
at hudson.remoting.InterceptingExecutorService$1.call(InterceptingExecutorService.java:72)
at java.util.concurrent.FutureTask.run(FutureTask.java:266)
at java.util.concurrent.ThreadPoolExecutor.runWorker(ThreadPoolExecutor.java:1149)
at java.util.concurrent.ThreadPoolExecutor$Worker.run(ThreadPoolExecutor.java:624)
at java.lang.Thread.run(Thread.java:748)
Caused by: java.io.IOException: Unexpected Fingerprint type. Expected class hudson.model.Fingerprint or subclass but got class hudson.model.Fingerprint$RangeSet
at hudson.model.Fingerprint.load(Fingerprint.java:1387)
at hudson.model.Fingerprint.load(Fingerprint.java:1372)
at hudson.model.FingerprintMap.load(FingerprintMap.java:97)
at hudson.model.FingerprintMap.load(FingerprintMap.java:47)
at hudson.util.KeyedDataStorage.get(KeyedDataStorage.java:161)
at hudson.model.FingerprintMap.get(FingerprintMap.java:82)
at hudson.model.FingerprintMap.get(FingerprintMap.java:47)
at hudson.util.KeyedDataStorage.getOrCreate(KeyedDataStorage.java:111)
at hudson.model.FingerprintMap.getOrCreate(FingerprintMap.java:68)
at hudson.maven.reporters.MavenFingerprinter$PostBuildCallable.call(MavenFingerprinter.java:249)
at hudson.maven.reporters.MavenFingerprinter$PostBuildCallable.call(MavenFingerprinter.java:236)
at hudson.maven.MavenBuild$ProxyImpl.execute(MavenBuild.java:454)
at hudson.maven.MavenBuild$ProxyImpl2.execute(MavenBuild.java:586)
at sun.reflect.GeneratedMethodAccessor1162.invoke(Unknown Source)
at sun.reflect.DelegatingMethodAccessorImpl.invoke(DelegatingMethodAccessorImpl.java:43)
at java.lang.reflect.Method.invoke(Method.java:498)
at hudson.model.Executor$2.call(Executor.java:932)
at hudson.util.InterceptingProxy$1.invoke(InterceptingProxy.java:23)
at com.sun.proxy.$Proxy180.execute(Unknown Source)
at hudson.maven.MavenBuildProxy$Filter$AsyncInvoker.call(MavenBuildProxy.java:294)
at hudson.remoting.UserRequest.perform(UserRequest.java:211)
at hudson.remoting.UserRequest.perform(UserRequest.java:54)
at hudson.remoting.Request$2.run(Request.java:369)
at hudson.remoting.InterceptingExecutorService$1.call(InterceptingExecutorService.java:72)
at org.jenkinsci.remoting.CallableDecorator.call(CallableDecorator.java:18)
at hudson.remoting.CallableDecoratorList$1.call(CallableDecoratorList.java:21)
at jenkins.util.ContextResettingExecutorService$2.call(ContextResettingExecutorService.java:46)
at jenkins.security.ImpersonatingExecutorService$2.call(ImpersonatingExecutorService.java:71)
[ERROR] Failed to execute goal org.sonatype.ossindex.maven:ossindex-maven-plugin:3.1.0:audit (default-cli) on project pdfbox: Detected 1 vulnerable components:
... 4 more
[ERROR] junit:junit:jar:4.13:test; https://ossindex.sonatype.org/component/pkg:maven/junit/junit@4.13?utm_source=ossindex-client&utm_medium=integration&utm_content=1.1.1
Suppressed: hudson.remoting.Channel$CallSiteStackTrace: Remote call to channel
at hudson.remoting.Channel.attachCallSiteStackTrace(Channel.java:1788)
[ERROR] * [CVE-2020-15250] In JUnit4 from version 4.7 and before 4.13.1, the test rule TemporaryFolder cont... (5.5); https://ossindex.sonatype.org/vuln/7ea56ad4-8a8b-4e51-8ed9-5aad83d8efb1?component-type=maven&component-name=junit.junit&utm_source=ossindex-client&utm_medium=integration&utm_content=1.1.1
at hudson.remoting.UserRequest$ExceptionResponse.retrieve(UserRequest.java:356)
at hudson.remoting.Channel$2.adapt(Channel.java:1033)
[ERROR] -> [Help 1]
at hudson.remoting.Channel$2.adapt(Channel.java:1029)
[ERROR]
at hudson.remoting.FutureAdapter.get(FutureAdapter.java:55)
[ERROR] To see the full stack trace of the errors, re-run Maven with the -e switch.
at hudson.maven.AbstractMavenBuilder.waitForAsynchronousExecutions(AbstractMavenBuilder.java:186)
[ERROR] Re-run Maven using the -X switch to enable full debug logging.
[ERROR]
at hudson.maven.Maven3Builder.call(Maven3Builder.java:146)
at hudson.maven.Maven3Builder.call(Maven3Builder.java:70)
[ERROR] For more information about the errors and possible solutions, please read the following articles:
[ERROR] [Help 1] http://cwiki.apache.org/confluence/display/MAVEN/MojoFailureException
at hudson.remoting.UserRequest.perform(UserRequest.java:211)
[ERROR]
at hudson.remoting.UserRequest.perform(UserRequest.java:54)
[ERROR] After correcting the problems, you can resume the build with the command
at hudson.remoting.Request$2.run(Request.java:369)
[ERROR] mvn <goals> -rf :pdfbox
at hudson.remoting.InterceptingExecutorService$1.call(InterceptingExecutorService.java:72)
... 4 more
[JENKINS] Archiving <https://ci-builds.apache.org/job/PDFBox/job/PDFBox-trunk/ws/xmpbox/pom.xml> to org.apache.pdfbox/xmpbox/3.0.0-SNAPSHOT/xmpbox-3.0.0-SNAPSHOT.pom
[JENKINS] Archiving <https://ci-builds.apache.org/job/PDFBox/job/PDFBox-trunk/ws/xmpbox/target/xmpbox-3.0.0-SNAPSHOT.jar> to org.apache.pdfbox/xmpbox/3.0.0-20201117.155938-2270/xmpbox-3.0.0-20201117.155938-2270.jar
[JENKINS] Archiving <https://ci-builds.apache.org/job/PDFBox/job/PDFBox-trunk/ws/tools/pom.xml> to org.apache.pdfbox/pdfbox-tools/3.0.0-SNAPSHOT/pdfbox-tools-3.0.0-SNAPSHOT.pom
[JENKINS] Archiving <https://ci-builds.apache.org/job/PDFBox/job/PDFBox-trunk/ws/debugger/pom.xml> to org.apache.pdfbox/pdfbox-debugger/3.0.0-SNAPSHOT/pdfbox-debugger-3.0.0-SNAPSHOT.pom
[JENKINS] Archiving <https://ci-builds.apache.org/job/PDFBox/job/PDFBox-trunk/ws/preflight-app/pom.xml> to org.apache.pdfbox/preflight-app/3.0.0-SNAPSHOT/preflight-app-3.0.0-SNAPSHOT.pom
[JENKINS] Archiving <https://ci-builds.apache.org/job/PDFBox/job/PDFBox-trunk/ws/app/pom.xml> to org.apache.pdfbox/pdfbox-app/3.0.0-SNAPSHOT/pdfbox-app-3.0.0-SNAPSHOT.pom
[JENKINS] Archiving <https://ci-builds.apache.org/job/PDFBox/job/PDFBox-trunk/ws/examples/pom.xml> to org.apache.pdfbox/pdfbox-examples/3.0.0-SNAPSHOT/pdfbox-examples-3.0.0-SNAPSHOT.pom
[JENKINS] Archiving <https://ci-builds.apache.org/job/PDFBox/job/PDFBox-trunk/ws/preflight/pom.xml> to org.apache.pdfbox/preflight/3.0.0-SNAPSHOT/preflight-3.0.0-SNAPSHOT.pom
[JENKINS] Archiving <https://ci-builds.apache.org/job/PDFBox/job/PDFBox-trunk/ws/pom.xml> to org.apache.pdfbox/pdfbox-reactor/3.0.0-SNAPSHOT/pdfbox-reactor-3.0.0-SNAPSHOT.pom
[JENKINS] Archiving <https://ci-builds.apache.org/job/PDFBox/job/PDFBox-trunk/ws/parent/pom.xml> to org.apache.pdfbox/pdfbox-parent/3.0.0-SNAPSHOT/pdfbox-parent-3.0.0-SNAPSHOT.pom
[JENKINS] Archiving <https://ci-builds.apache.org/job/PDFBox/job/PDFBox-trunk/ws/pdfbox/pom.xml> to org.apache.pdfbox/pdfbox/3.0.0-SNAPSHOT/pdfbox-3.0.0-SNAPSHOT.pom
[JENKINS] Archiving <https://ci-builds.apache.org/job/PDFBox/job/PDFBox-trunk/ws/pdfbox/target/pdfbox-3.0.0-SNAPSHOT.jar> to org.apache.pdfbox/pdfbox/3.0.0-20201117.160045-2237/pdfbox-3.0.0-20201117.160045-2237.jar
[Fast Archiver] Compressed 2.66 MB of artifacts by 34.1% relative to #226
[JENKINS] Archiving <https://ci-builds.apache.org/job/PDFBox/job/PDFBox-trunk/ws/debugger-app/pom.xml> to org.apache.pdfbox/debugger-app/3.0.0-SNAPSHOT/debugger-app-3.0.0-SNAPSHOT.pom
[JENKINS] Archiving <https://ci-builds.apache.org/job/PDFBox/job/PDFBox-trunk/ws/fontbox/pom.xml> to org.apache.pdfbox/fontbox/3.0.0-SNAPSHOT/fontbox-3.0.0-SNAPSHOT.pom
[JENKINS] Archiving <https://ci-builds.apache.org/job/PDFBox/job/PDFBox-trunk/ws/fontbox/target/fontbox-3.0.0-SNAPSHOT.jar> to org.apache.pdfbox/fontbox/3.0.0-20201117.155911-2277/fontbox-3.0.0-20201117.155911-2277.jar
[Fast Archiver] Compressed 1.53 MB of artifacts by 71.4% relative to #247
No mail will be sent out, as 'PDFBox » PDFBox-trunk » Apache PDFBox examples #248' does not have a result yet. Please make sure you set a proper result in case of pipeline/build scripts.
Sending e-mails to: dev@pdfbox.apache.org
No mail will be sent out, as 'PDFBox » PDFBox-trunk » Apache PDFBox Debugger application #248' does not have a result yet. Please make sure you set a proper result in case of pipeline/build scripts.
Sending e-mails to: dev@pdfbox.apache.org
No mail will be sent out, as 'PDFBox » PDFBox-trunk » Apache PDFBox tools #248' does not have a result yet. Please make sure you set a proper result in case of pipeline/build scripts.
No mail will be sent out, as 'PDFBox » PDFBox-trunk » Apache PDFBox Debugger #248' does not have a result yet. Please make sure you set a proper result in case of pipeline/build scripts.
No mail will be sent out, as 'PDFBox » PDFBox-trunk » Apache Preflight application #248' does not have a result yet. Please make sure you set a proper result in case of pipeline/build scripts.
No mail will be sent out, as 'PDFBox » PDFBox-trunk » Apache PDFBox application #248' does not have a result yet. Please make sure you set a proper result in case of pipeline/build scripts.
No mail will be sent out, as 'PDFBox » PDFBox-trunk » Apache Preflight #248' does not have a result yet. Please make sure you set a proper result in case of pipeline/build scripts.
No mail will be sent out, as 'PDFBox » PDFBox-trunk » Apache PDFBox #248' does not have a result yet. Please make sure you set a proper result in case of pipeline/build scripts.
channel stopped
Archiving artifacts
---------------------------------------------------------------------
To unsubscribe, e-mail: dev-unsubscribe@pdfbox.apache.org
For additional commands, e-mail: dev-help@pdfbox.apache.org