You are viewing a plain text version of this content. The canonical link for it is here.
Posted to notifications@jclouds.apache.org by je...@cloudbees.com on 2017/05/10 23:53:33 UTC

Build failed in Jenkins: jclouds-cli #1345

See <https://jclouds.ci.cloudbees.com/job/jclouds-cli/1345/display/redirect>

------------------------------------------
[...truncated 73.90 KB...]
  WARNING:  'org.apache.xerces.jaxp.SAXParserImpl: Property 'http://javax.xml.XMLConstants/property/accessExternalDTD' is not recognized.'
Warning:  org.apache.xerces.parsers.SAXParser: Feature 'http://javax.xml.XMLConstants/feature/secure-processing' is not recognized.
Warning:  org.apache.xerces.parsers.SAXParser: Property 'http://javax.xml.XMLConstants/property/accessExternalDTD' is not recognized.
Warning:  org.apache.xerces.parsers.SAXParser: Property 'http://www.oracle.com/xml/jaxp/properties/entityExpansionLimit' is not recognized.
[INFO] Rat check: Summary of files. Unapproved: 0 unknown: 0 generated: 0 approved: 2 licence.
[INFO] 
[INFO] --- maven-jar-plugin:2.4:test-jar (default) @ jclouds-cli-runner ---
[INFO] Building jar: <https://jclouds.ci.cloudbees.com/job/jclouds-cli/ws/runner/target/jclouds-cli-runner-2.1.0-SNAPSHOT-tests.jar>
[INFO] 
[INFO] --- maven-javadoc-plugin:2.9:jar (javadoc) @ jclouds-cli-runner ---
[INFO] 
2 warnings
[WARNING] Javadoc Warnings
[WARNING] <https://jclouds.ci.cloudbees.com/job/jclouds-cli/ws/runner/src/main/java/org/jclouds/cli/runner/Main.java>:317: warning - @return tag has no arguments.
[WARNING] <https://jclouds.ci.cloudbees.com/job/jclouds-cli/ws/runner/src/main/java/org/jclouds/cli/runner/Main.java>:327: warning - @return tag has no arguments.
[INFO] Building jar: <https://jclouds.ci.cloudbees.com/job/jclouds-cli/ws/runner/target/jclouds-cli-runner-2.1.0-SNAPSHOT-javadoc.jar>
[INFO] 
[INFO] --- maven-source-plugin:2.2:jar-no-fork (attach-sources) @ jclouds-cli-runner ---
[INFO] Building jar: <https://jclouds.ci.cloudbees.com/job/jclouds-cli/ws/runner/target/jclouds-cli-runner-2.1.0-SNAPSHOT-sources.jar>
[INFO] 
[INFO] --- maven-source-plugin:2.2:test-jar-no-fork (attach-sources) @ jclouds-cli-runner ---
[INFO] Building jar: <https://jclouds.ci.cloudbees.com/job/jclouds-cli/ws/runner/target/jclouds-cli-runner-2.1.0-SNAPSHOT-test-sources.jar>
[INFO] 
[INFO] --- maven-surefire-plugin:2.17:test (integration) @ jclouds-cli-runner ---
[JENKINS] Recording test results[INFO] 
[INFO] --- duplicate-finder-maven-plugin:1.1.1:check (default) @ jclouds-cli-runner ---

[INFO] Skipping duplicate-finder execution!
[INFO] 
[INFO] --- maven-checkstyle-plugin:2.15:check (default) @ jclouds-cli-runner ---
[INFO] 
[INFO] --- modernizer-maven-plugin:1.4.0:modernizer (modernizer) @ jclouds-cli-runner ---
[INFO] 
[INFO] --- maven-install-plugin:2.4:install (default-install) @ jclouds-cli-runner ---
[INFO] Installing <https://jclouds.ci.cloudbees.com/job/jclouds-cli/ws/runner/target/jclouds-cli-runner-2.1.0-SNAPSHOT.jar> to /home/jenkins/.m2/repository/org/apache/jclouds/cli/jclouds-cli-runner/2.1.0-SNAPSHOT/jclouds-cli-runner-2.1.0-SNAPSHOT.jar
[INFO] Installing <https://jclouds.ci.cloudbees.com/job/jclouds-cli/ws/runner/pom.xml> to /home/jenkins/.m2/repository/org/apache/jclouds/cli/jclouds-cli-runner/2.1.0-SNAPSHOT/jclouds-cli-runner-2.1.0-SNAPSHOT.pom
[INFO] Installing <https://jclouds.ci.cloudbees.com/job/jclouds-cli/ws/runner/target/jclouds-cli-runner-2.1.0-SNAPSHOT-tests.jar> to /home/jenkins/.m2/repository/org/apache/jclouds/cli/jclouds-cli-runner/2.1.0-SNAPSHOT/jclouds-cli-runner-2.1.0-SNAPSHOT-tests.jar
[INFO] Installing <https://jclouds.ci.cloudbees.com/job/jclouds-cli/ws/runner/target/jclouds-cli-runner-2.1.0-SNAPSHOT-javadoc.jar> to /home/jenkins/.m2/repository/org/apache/jclouds/cli/jclouds-cli-runner/2.1.0-SNAPSHOT/jclouds-cli-runner-2.1.0-SNAPSHOT-javadoc.jar
[INFO] Installing <https://jclouds.ci.cloudbees.com/job/jclouds-cli/ws/runner/target/jclouds-cli-runner-2.1.0-SNAPSHOT-sources.jar> to /home/jenkins/.m2/repository/org/apache/jclouds/cli/jclouds-cli-runner/2.1.0-SNAPSHOT/jclouds-cli-runner-2.1.0-SNAPSHOT-sources.jar
[INFO] Installing <https://jclouds.ci.cloudbees.com/job/jclouds-cli/ws/runner/target/jclouds-cli-runner-2.1.0-SNAPSHOT-test-sources.jar> to /home/jenkins/.m2/repository/org/apache/jclouds/cli/jclouds-cli-runner/2.1.0-SNAPSHOT/jclouds-cli-runner-2.1.0-SNAPSHOT-test-sources.jar
[INFO] 
[INFO] --- maven-deploy-plugin:2.7:deploy (default-deploy) @ jclouds-cli-runner ---
Downloading: https://repository.apache.org/content/repositories/snapshots/org/apache/jclouds/cli/jclouds-cli-runner/2.1.0-SNAPSHOT/maven-metadata.xml
Downloaded: https://repository.apache.org/content/repositories/snapshots/org/apache/jclouds/cli/jclouds-cli-runner/2.1.0-SNAPSHOT/maven-metadata.xml (2 KB at 33.0 KB/sec)
Uploading: https://repository.apache.org/content/repositories/snapshots/org/apache/jclouds/cli/jclouds-cli-runner/2.1.0-SNAPSHOT/jclouds-cli-runner-2.1.0-20170510.235318-97.jar
Uploaded: https://repository.apache.org/content/repositories/snapshots/org/apache/jclouds/cli/jclouds-cli-runner/2.1.0-SNAPSHOT/jclouds-cli-runner-2.1.0-20170510.235318-97.jar (20 KB at 119.8 KB/sec)
Uploading: https://repository.apache.org/content/repositories/snapshots/org/apache/jclouds/cli/jclouds-cli-runner/2.1.0-SNAPSHOT/jclouds-cli-runner-2.1.0-20170510.235318-97.pom
Uploaded: https://repository.apache.org/content/repositories/snapshots/org/apache/jclouds/cli/jclouds-cli-runner/2.1.0-SNAPSHOT/jclouds-cli-runner-2.1.0-20170510.235318-97.pom (3 KB at 19.1 KB/sec)
Downloading: https://repository.apache.org/content/repositories/snapshots/org/apache/jclouds/cli/jclouds-cli-runner/maven-metadata.xml
Downloaded: https://repository.apache.org/content/repositories/snapshots/org/apache/jclouds/cli/jclouds-cli-runner/maven-metadata.xml (440 B at 9.0 KB/sec)
Uploading: https://repository.apache.org/content/repositories/snapshots/org/apache/jclouds/cli/jclouds-cli-runner/2.1.0-SNAPSHOT/maven-metadata.xml
Uploaded: https://repository.apache.org/content/repositories/snapshots/org/apache/jclouds/cli/jclouds-cli-runner/2.1.0-SNAPSHOT/maven-metadata.xml (2 KB at 16.5 KB/sec)
Uploading: https://repository.apache.org/content/repositories/snapshots/org/apache/jclouds/cli/jclouds-cli-runner/maven-metadata.xml
Uploaded: https://repository.apache.org/content/repositories/snapshots/org/apache/jclouds/cli/jclouds-cli-runner/maven-metadata.xml (440 B at 5.2 KB/sec)
Uploading: https://repository.apache.org/content/repositories/snapshots/org/apache/jclouds/cli/jclouds-cli-runner/2.1.0-SNAPSHOT/jclouds-cli-runner-2.1.0-20170510.235318-97-tests.jar
Uploaded: https://repository.apache.org/content/repositories/snapshots/org/apache/jclouds/cli/jclouds-cli-runner/2.1.0-SNAPSHOT/jclouds-cli-runner-2.1.0-20170510.235318-97-tests.jar (9 KB at 101.6 KB/sec)
Uploading: https://repository.apache.org/content/repositories/snapshots/org/apache/jclouds/cli/jclouds-cli-runner/2.1.0-SNAPSHOT/maven-metadata.xml
Uploaded: https://repository.apache.org/content/repositories/snapshots/org/apache/jclouds/cli/jclouds-cli-runner/2.1.0-SNAPSHOT/maven-metadata.xml (2 KB at 20.0 KB/sec)
Uploading: https://repository.apache.org/content/repositories/snapshots/org/apache/jclouds/cli/jclouds-cli-runner/2.1.0-SNAPSHOT/jclouds-cli-runner-2.1.0-20170510.235318-97-javadoc.jar
Uploaded: https://repository.apache.org/content/repositories/snapshots/org/apache/jclouds/cli/jclouds-cli-runner/2.1.0-SNAPSHOT/jclouds-cli-runner-2.1.0-20170510.235318-97-javadoc.jar (47 KB at 462.9 KB/sec)
Uploading: https://repository.apache.org/content/repositories/snapshots/org/apache/jclouds/cli/jclouds-cli-runner/2.1.0-SNAPSHOT/maven-metadata.xml
Uploaded: https://repository.apache.org/content/repositories/snapshots/org/apache/jclouds/cli/jclouds-cli-runner/2.1.0-SNAPSHOT/maven-metadata.xml (2 KB at 20.0 KB/sec)
Uploading: https://repository.apache.org/content/repositories/snapshots/org/apache/jclouds/cli/jclouds-cli-runner/2.1.0-SNAPSHOT/jclouds-cli-runner-2.1.0-20170510.235318-97-sources.jar
Uploaded: https://repository.apache.org/content/repositories/snapshots/org/apache/jclouds/cli/jclouds-cli-runner/2.1.0-SNAPSHOT/jclouds-cli-runner-2.1.0-20170510.235318-97-sources.jar (13 KB at 147.6 KB/sec)
Uploading: https://repository.apache.org/content/repositories/snapshots/org/apache/jclouds/cli/jclouds-cli-runner/2.1.0-SNAPSHOT/maven-metadata.xml
Uploaded: https://repository.apache.org/content/repositories/snapshots/org/apache/jclouds/cli/jclouds-cli-runner/2.1.0-SNAPSHOT/maven-metadata.xml (2 KB at 21.3 KB/sec)
Uploading: https://repository.apache.org/content/repositories/snapshots/org/apache/jclouds/cli/jclouds-cli-runner/2.1.0-SNAPSHOT/jclouds-cli-runner-2.1.0-20170510.235318-97-test-sources.jar
Uploaded: https://repository.apache.org/content/repositories/snapshots/org/apache/jclouds/cli/jclouds-cli-runner/2.1.0-SNAPSHOT/jclouds-cli-runner-2.1.0-20170510.235318-97-test-sources.jar (7 KB at 73.0 KB/sec)
Uploading: https://repository.apache.org/content/repositories/snapshots/org/apache/jclouds/cli/jclouds-cli-runner/2.1.0-SNAPSHOT/maven-metadata.xml
Uploaded: https://repository.apache.org/content/repositories/snapshots/org/apache/jclouds/cli/jclouds-cli-runner/2.1.0-SNAPSHOT/maven-metadata.xml (2 KB at 20.2 KB/sec)
Started calculate disk usage of build
Finished Calculation of disk usage of build in 0 seconds
Started calculate disk usage of workspace
Finished Calculation of disk usage of workspace in 0 seconds
[INFO]                                                                         
[INFO] ------------------------------------------------------------------------
[INFO] Building jclouds :: cli :: assembly 2.1.0-SNAPSHOT
[INFO] ------------------------------------------------------------------------
[INFO] 
[INFO] --- maven-clean-plugin:2.5:clean (default-clean) @ jclouds-cli-assembly ---
[INFO] Deleting <https://jclouds.ci.cloudbees.com/job/jclouds-cli/ws/assembly/target>
[INFO] 
[INFO] --- maven-enforcer-plugin:1.1.1:enforce (enforce-banned-dependencies) @ jclouds-cli-assembly ---
[INFO] 
[INFO] --- maven-enforcer-plugin:1.1.1:enforce (enforce-java) @ jclouds-cli-assembly ---
[INFO] 
[INFO] --- maven-remote-resources-plugin:1.5:process (default) @ jclouds-cli-assembly ---
[INFO] 
[INFO] --- maven-resources-plugin:2.4.2:resources (filter) @ jclouds-cli-assembly ---
[INFO] Using 'UTF-8' encoding to copy filtered resources.
[INFO] skip non existing resourceDirectory <https://jclouds.ci.cloudbees.com/job/jclouds-cli/ws/assembly/src/main/resources>
[INFO] Copying 13 resources
[INFO] Copying 3 resources
[INFO] 
[INFO] --- maven-dependency-plugin:2.8:unpack (unpack-unix) @ jclouds-cli-assembly ---
[INFO] Configured Artifact: org.apache.karaf:apache-karaf:minimal:2.3.11:tar.gz
[INFO] Unpacking /home/jenkins/.m2/repository/org/apache/karaf/apache-karaf/2.3.11/apache-karaf-2.3.11-minimal.tar.gz to <https://jclouds.ci.cloudbees.com/job/jclouds-cli/ws/assembly/target/dependencies/unix> with includes "" and excludes ""
[INFO] Expanding: /home/jenkins/.m2/repository/org/apache/karaf/apache-karaf/2.3.11/apache-karaf-2.3.11-minimal.tar.gz into <https://jclouds.ci.cloudbees.com/job/jclouds-cli/ws/assembly/target/dependencies/unix>
[INFO] 
[INFO] --- maven-dependency-plugin:2.8:unpack (unpack-win) @ jclouds-cli-assembly ---
[INFO] Configured Artifact: org.apache.karaf:apache-karaf:minimal:2.3.11:zip
[INFO] Unpacking /home/jenkins/.m2/repository/org/apache/karaf/apache-karaf/2.3.11/apache-karaf-2.3.11-minimal.zip to <https://jclouds.ci.cloudbees.com/job/jclouds-cli/ws/assembly/target/dependencies/win> with includes "" and excludes ""
[INFO] 
[INFO] --- maven-resources-plugin:2.4.2:resources (default-resources) @ jclouds-cli-assembly ---
[INFO] Using 'UTF-8' encoding to copy filtered resources.
[INFO] skip non existing resourceDirectory <https://jclouds.ci.cloudbees.com/job/jclouds-cli/ws/assembly/src/main/resources>
[INFO] Copying 13 resources
[INFO] Copying 3 resources
[INFO] 
[INFO] --- maven-compiler-plugin:3.1:compile (default-compile) @ jclouds-cli-assembly ---
[INFO] No sources to compile
[INFO] 
[INFO] --- maven-enforcer-plugin:1.1.1:enforce (enforce-banned-dependencies) @ jclouds-cli-assembly ---
[INFO] 
[INFO] --- maven-enforcer-plugin:1.1.1:enforce (enforce-java) @ jclouds-cli-assembly ---
[INFO] 
[INFO] --- maven-remote-resources-plugin:1.5:process (default) @ jclouds-cli-assembly ---
[INFO] 
[INFO] --- maven-resources-plugin:2.4.2:resources (filter) @ jclouds-cli-assembly ---
[INFO] Using 'UTF-8' encoding to copy filtered resources.
[INFO] skip non existing resourceDirectory <https://jclouds.ci.cloudbees.com/job/jclouds-cli/ws/assembly/src/main/resources>
[INFO] Copying 13 resources
[INFO] Copying 3 resources
[INFO] Copying 3 resources
[INFO] 
[INFO] --- maven-dependency-plugin:2.8:unpack (unpack-unix) @ jclouds-cli-assembly ---
[INFO] Configured Artifact: org.apache.karaf:apache-karaf:minimal:2.3.11:tar.gz
[INFO] apache-karaf-2.3.11-minimal.tar.gz already unpacked.
[INFO] 
[INFO] --- maven-dependency-plugin:2.8:unpack (unpack-win) @ jclouds-cli-assembly ---
[INFO] Configured Artifact: org.apache.karaf:apache-karaf:minimal:2.3.11:zip
[INFO] apache-karaf-2.3.11-minimal.zip already unpacked.
[INFO] 
[INFO] --- maven-resources-plugin:2.4.2:resources (default-resources) @ jclouds-cli-assembly ---
[INFO] Using 'UTF-8' encoding to copy filtered resources.
[INFO] skip non existing resourceDirectory <https://jclouds.ci.cloudbees.com/job/jclouds-cli/ws/assembly/src/main/resources>
[INFO] Copying 13 resources
[INFO] Copying 3 resources
[INFO] Copying 3 resources
[INFO] 
[INFO] --- maven-compiler-plugin:3.1:compile (default-compile) @ jclouds-cli-assembly ---
[INFO] No sources to compile
[WARNING] Failed to getClass for org.apache.karaf.tooling.features.AddFeaturesToRepoMojo
[INFO] 
[INFO] --- features-maven-plugin:2.3.11:add-features-to-repo (add-features-to-repo) @ jclouds-cli-assembly ---
[INFO] Copying bundle: org.apache.karaf.assemblies.features:standard:xml:features:2.3.11
[INFO] Copying bundle: org.apache.karaf.assemblies.features:enterprise:xml:features:2.3.11
[INFO] Copying bundle: org.apache.karaf.assemblies.features:enterprise:xml:features:2.3.11
[INFO] Copying bundle: org.ops4j.pax.cdi:pax-cdi-features:xml:features:0.8.0
[INFO] Copying bundle: org.apache.karaf.assemblies.features:standard:xml:features:2.3.11
[INFO] Copying bundle: org.apache.karaf.assemblies.features:standard:xml:features:2.3.11
[INFO] Copying bundle: org.apache.jclouds.karaf:jclouds-karaf:xml:features:2.1.0-SNAPSHOT
Downloading: http://repository.apache.org/snapshots/org/apache/jclouds/karaf/jclouds-karaf/2.1.0-SNAPSHOT/maven-metadata.xml
Downloading: https://repository-jclouds.forge.cloudbees.com/snapshot/org/apache/jclouds/karaf/jclouds-karaf/2.1.0-SNAPSHOT/maven-metadata.xml
Downloading: https://repository.apache.org/content/repositories/snapshots/org/apache/jclouds/karaf/jclouds-karaf/2.1.0-SNAPSHOT/maven-metadata.xml
Downloaded: https://repository.apache.org/content/repositories/snapshots/org/apache/jclouds/karaf/jclouds-karaf/2.1.0-SNAPSHOT/maven-metadata.xml (2 KB at 22.5 KB/sec)
Downloaded: http://repository.apache.org/snapshots/org/apache/jclouds/karaf/jclouds-karaf/2.1.0-SNAPSHOT/maven-metadata.xml (2 KB at 19.7 KB/sec)
Downloading: https://repository.apache.org/content/repositories/snapshots/org/apache/jclouds/karaf/jclouds-karaf/2.1.0-SNAPSHOT/jclouds-karaf-2.1.0-20170510.235320-133-features.xml
Downloaded: https://repository.apache.org/content/repositories/snapshots/org/apache/jclouds/karaf/jclouds-karaf/2.1.0-SNAPSHOT/jclouds-karaf-2.1.0-20170510.235320-133-features.xml (43 KB at 942.6 KB/sec)
Started calculate disk usage of build
Finished Calculation of disk usage of build in 0 seconds
Started calculate disk usage of workspace
Finished Calculation of disk usage of workspace in 0 seconds
[INFO] ------------------------------------------------------------------------
[INFO] Reactor Summary:
[INFO] 
[INFO] Apache jclouds :: cli ............................. SUCCESS [7.936s]
[INFO] jclouds :: cli :: branding ........................ SUCCESS [3.705s]
[INFO] jclouds :: cli :: runner .......................... SUCCESS [25.315s]
[INFO] jclouds :: cli :: assembly ........................ FAILURE [7.413s]
[INFO] Apache jclouds :: cli ............................. SKIPPED
[INFO] ------------------------------------------------------------------------
[INFO] BUILD FAILURE
[INFO] ------------------------------------------------------------------------
[INFO] Total time: 47.886s
[INFO] Finished at: Wed May 10 19:53:27 EDT 2017
[INFO] Final Memory: 51M/251M
[INFO] ------------------------------------------------------------------------
Waiting for Jenkins to finish collecting data
[ERROR] Failed to execute goal org.apache.karaf.tooling:features-maven-plugin:2.3.11:add-features-to-repo (add-features-to-repo) on project jclouds-cli-assembly: Error populating repository: Unable to find the feature 'jclouds-api-cloudsigma2' -> [Help 1]
org.apache.maven.lifecycle.LifecycleExecutionException: Failed to execute goal org.apache.karaf.tooling:features-maven-plugin:2.3.11:add-features-to-repo (add-features-to-repo) on project jclouds-cli-assembly: Error populating repository
	at org.apache.maven.lifecycle.internal.MojoExecutor.execute(MojoExecutor.java:217)
	at org.apache.maven.lifecycle.internal.MojoExecutor.execute(MojoExecutor.java:153)
	at org.apache.maven.lifecycle.internal.MojoExecutor.execute(MojoExecutor.java:145)
	at org.apache.maven.lifecycle.internal.LifecycleModuleBuilder.buildProject(LifecycleModuleBuilder.java:84)
	at org.apache.maven.lifecycle.internal.LifecycleModuleBuilder.buildProject(LifecycleModuleBuilder.java:59)
	at org.apache.maven.lifecycle.internal.LifecycleStarter.singleThreadedBuild(LifecycleStarter.java:183)
	at org.apache.maven.lifecycle.internal.LifecycleStarter.execute(LifecycleStarter.java:161)
	at org.apache.maven.DefaultMaven.doExecute(DefaultMaven.java:320)
	at org.apache.maven.DefaultMaven.execute(DefaultMaven.java:156)
	at org.jvnet.hudson.maven3.launcher.Maven3Launcher.main(Maven3Launcher.java:117)
	at sun.reflect.NativeMethodAccessorImpl.invoke0(Native Method)
	at sun.reflect.NativeMethodAccessorImpl.invoke(NativeMethodAccessorImpl.java:57)
	at sun.reflect.DelegatingMethodAccessorImpl.invoke(DelegatingMethodAccessorImpl.java:43)
	at java.lang.reflect.Method.invoke(Method.java:606)
	at org.codehaus.plexus.classworlds.launcher.Launcher.launchStandard(Launcher.java:329)
	at org.codehaus.plexus.classworlds.launcher.Launcher.launch(Launcher.java:239)
	at org.jvnet.hudson.maven3.agent.Maven3Main.launch(Maven3Main.java:181)
	at sun.reflect.NativeMethodAccessorImpl.invoke0(Native Method)
	at sun.reflect.NativeMethodAccessorImpl.invoke(NativeMethodAccessorImpl.java:57)
	at sun.reflect.DelegatingMethodAccessorImpl.invoke(DelegatingMethodAccessorImpl.java:43)
	at java.lang.reflect.Method.invoke(Method.java:606)
	at hudson.maven.Maven3Builder.call(Maven3Builder.java:139)
	at hudson.maven.Maven3Builder.call(Maven3Builder.java:70)
	at hudson.remoting.UserRequest.perform(UserRequest.java:153)
	at hudson.remoting.UserRequest.perform(UserRequest.java:50)
	at hudson.remoting.Request$2.run(Request.java:336)
	at hudson.remoting.InterceptingExecutorService$1.call(InterceptingExecutorService.java:68)
	at java.util.concurrent.FutureTask.run(FutureTask.java:262)
	at java.util.concurrent.ThreadPoolExecutor.runWorker(ThreadPoolExecutor.java:1145)
	at java.util.concurrent.ThreadPoolExecutor$Worker.run(ThreadPoolExecutor.java:615)
	at java.lang.Thread.run(Thread.java:745)
Caused by: org.apache.maven.plugin.MojoExecutionException: Error populating repository
	at org.apache.karaf.tooling.features.AddFeaturesToRepoMojo.execute(AddFeaturesToRepoMojo.java:226)
	at org.apache.maven.plugin.DefaultBuildPluginManager.executeMojo(DefaultBuildPluginManager.java:101)
	at org.apache.maven.lifecycle.internal.MojoExecutor.execute(MojoExecutor.java:209)
	... 30 more
Caused by: java.lang.IllegalArgumentException: Unable to find the feature 'jclouds-api-cloudsigma2'
	at org.apache.karaf.tooling.features.AddFeaturesToRepoMojo.addFeatures(AddFeaturesToRepoMojo.java:328)
	at org.apache.karaf.tooling.features.AddFeaturesToRepoMojo.execute(AddFeaturesToRepoMojo.java:165)
	... 32 more
[ERROR] 
[ERROR] Re-run Maven using the -X switch to enable full debug logging.
[ERROR] 
[ERROR] For more information about the errors and possible solutions, please read the following articles:
[ERROR] [Help 1] http://cwiki.apache.org/confluence/display/MAVEN/MojoExecutionException
[ERROR] 
[ERROR] After correcting the problems, you can resume the build with the command
[ERROR]   mvn <goals> -rf :jclouds-cli-assembly
[JENKINS] Archiving <https://jclouds.ci.cloudbees.com/job/jclouds-cli/ws/branding/pom.xml> to org.apache.jclouds.cli/jclouds-cli-branding/2.1.0-SNAPSHOT/jclouds-cli-branding-2.1.0-SNAPSHOT.pom
[JENKINS] Archiving <https://jclouds.ci.cloudbees.com/job/jclouds-cli/ws/branding/target/jclouds-cli-branding-2.1.0-SNAPSHOT.jar> to org.apache.jclouds.cli/jclouds-cli-branding/2.1.0-20170510.235253-99/jclouds-cli-branding-2.1.0-20170510.235253-99.jar
[JENKINS] Archiving <https://jclouds.ci.cloudbees.com/job/jclouds-cli/ws/branding/target/jclouds-cli-branding-2.1.0-SNAPSHOT-tests.jar> to org.apache.jclouds.cli/jclouds-cli-branding/2.1.0-20170510.235253-99/jclouds-cli-branding-2.1.0-20170510.235253-99-tests.jar
[JENKINS] Archiving <https://jclouds.ci.cloudbees.com/job/jclouds-cli/ws/branding/target/jclouds-cli-branding-2.1.0-SNAPSHOT-sources.jar> to org.apache.jclouds.cli/jclouds-cli-branding/2.1.0-20170510.235253-99/jclouds-cli-branding-2.1.0-20170510.235253-99-sources.jar
[JENKINS] Archiving <https://jclouds.ci.cloudbees.com/job/jclouds-cli/ws/branding/target/jclouds-cli-branding-2.1.0-SNAPSHOT-test-sources.jar> to org.apache.jclouds.cli/jclouds-cli-branding/2.1.0-20170510.235253-99/jclouds-cli-branding-2.1.0-20170510.235253-99-test-sources.jar
[JENKINS] Archiving <https://jclouds.ci.cloudbees.com/job/jclouds-cli/ws/assembly/pom.xml> to org.apache.jclouds.cli/jclouds-cli-assembly/2.1.0-SNAPSHOT/jclouds-cli-assembly-2.1.0-SNAPSHOT.pom
[JENKINS] Archiving <https://jclouds.ci.cloudbees.com/job/jclouds-cli/ws/pom.xml> to org.apache.jclouds.cli/jclouds-cli/2.1.0-SNAPSHOT/jclouds-cli-2.1.0-SNAPSHOT.pom
[JENKINS] Archiving <https://jclouds.ci.cloudbees.com/job/jclouds-cli/ws/runner/pom.xml> to org.apache.jclouds.cli/jclouds-cli-runner/2.1.0-SNAPSHOT/jclouds-cli-runner-2.1.0-SNAPSHOT.pom
[JENKINS] Archiving <https://jclouds.ci.cloudbees.com/job/jclouds-cli/ws/runner/target/jclouds-cli-runner-2.1.0-SNAPSHOT.jar> to org.apache.jclouds.cli/jclouds-cli-runner/2.1.0-20170510.235318-97/jclouds-cli-runner-2.1.0-20170510.235318-97.jar
[JENKINS] Archiving <https://jclouds.ci.cloudbees.com/job/jclouds-cli/ws/runner/target/jclouds-cli-runner-2.1.0-SNAPSHOT-tests.jar> to org.apache.jclouds.cli/jclouds-cli-runner/2.1.0-20170510.235318-97/jclouds-cli-runner-2.1.0-20170510.235318-97-tests.jar
[JENKINS] Archiving <https://jclouds.ci.cloudbees.com/job/jclouds-cli/ws/runner/target/jclouds-cli-runner-2.1.0-SNAPSHOT-javadoc.jar> to org.apache.jclouds.cli/jclouds-cli-runner/2.1.0-20170510.235318-97/jclouds-cli-runner-2.1.0-20170510.235318-97-javadoc.jar
[JENKINS] Archiving <https://jclouds.ci.cloudbees.com/job/jclouds-cli/ws/runner/target/jclouds-cli-runner-2.1.0-SNAPSHOT-sources.jar> to org.apache.jclouds.cli/jclouds-cli-runner/2.1.0-20170510.235318-97/jclouds-cli-runner-2.1.0-20170510.235318-97-sources.jar
[JENKINS] Archiving <https://jclouds.ci.cloudbees.com/job/jclouds-cli/ws/runner/target/jclouds-cli-runner-2.1.0-SNAPSHOT-test-sources.jar> to org.apache.jclouds.cli/jclouds-cli-runner/2.1.0-20170510.235318-97/jclouds-cli-runner-2.1.0-20170510.235318-97-test-sources.jar
[JENKINS] Archiving <https://jclouds.ci.cloudbees.com/job/jclouds-cli/ws/project/pom.xml> to org.apache.jclouds.cli/jclouds-cli-project/2.1.0-SNAPSHOT/jclouds-cli-project-2.1.0-SNAPSHOT.pom
[JENKINS] Archiving <https://jclouds.ci.cloudbees.com/job/jclouds-cli/ws/project/target/jclouds-cli-project-2.1.0-SNAPSHOT-tests.jar> to org.apache.jclouds.cli/jclouds-cli-project/2.1.0-20170510.235249-99/jclouds-cli-project-2.1.0-20170510.235249-99-tests.jar
channel stopped
Started calculate disk usage of build
Finished Calculation of disk usage of build in 0 seconds
Started calculate disk usage of workspace
Finished Calculation of disk usage of workspace in 0 seconds

Jenkins build is back to normal : jclouds-cli #1350

Posted by je...@cloudbees.com.
See <https://jclouds.ci.cloudbees.com/job/jclouds-cli/1350/display/redirect?page=changes>


Build failed in Jenkins: jclouds-cli #1349

Posted by je...@cloudbees.com.
See <https://jclouds.ci.cloudbees.com/job/jclouds-cli/1349/display/redirect>

------------------------------------------
[...truncated 274.19 KB...]
Downloading: https://repo.cloudbees.com/content/repositories/central/org/sonatype/sisu/inject/guava-parent/0.9.9/guava-parent-0.9.9.pom
Downloaded: https://repo.cloudbees.com/content/repositories/central/org/sonatype/sisu/inject/guava-parent/0.9.9/guava-parent-0.9.9.pom (11 KB at 716.6 KB/sec)
Downloading: https://repository-jclouds.forge.cloudbees.com/release/org/apache/maven/maven-project/3.0-alpha-2/maven-project-3.0-alpha-2.pom
Downloading: https://repo.cloudbees.com/content/repositories/central/org/apache/maven/maven-project/3.0-alpha-2/maven-project-3.0-alpha-2.pom
Downloaded: https://repo.cloudbees.com/content/repositories/central/org/apache/maven/maven-project/3.0-alpha-2/maven-project-3.0-alpha-2.pom (4 KB at 214.7 KB/sec)
Downloading: https://repository-jclouds.forge.cloudbees.com/release/org/apache/maven/maven/3.0-alpha-2/maven-3.0-alpha-2.pom
Downloading: https://repo.cloudbees.com/content/repositories/central/org/apache/maven/maven/3.0-alpha-2/maven-3.0-alpha-2.pom
Downloaded: https://repo.cloudbees.com/content/repositories/central/org/apache/maven/maven/3.0-alpha-2/maven-3.0-alpha-2.pom (21 KB at 1491.0 KB/sec)
Downloading: https://repository-jclouds.forge.cloudbees.com/release/org/apache/maven/maven-model/3.0-alpha-2/maven-model-3.0-alpha-2.pom
Downloading: https://repo.cloudbees.com/content/repositories/central/org/apache/maven/maven-model/3.0-alpha-2/maven-model-3.0-alpha-2.pom
Downloaded: https://repo.cloudbees.com/content/repositories/central/org/apache/maven/maven-model/3.0-alpha-2/maven-model-3.0-alpha-2.pom (4 KB at 228.6 KB/sec)
Downloading: https://repository-jclouds.forge.cloudbees.com/release/org/codehaus/plexus/plexus-interpolation/1.1/plexus-interpolation-1.1.pom
Downloading: https://repo.cloudbees.com/content/repositories/central/org/codehaus/plexus/plexus-interpolation/1.1/plexus-interpolation-1.1.pom
Downloaded: https://repo.cloudbees.com/content/repositories/central/org/codehaus/plexus/plexus-interpolation/1.1/plexus-interpolation-1.1.pom (2 KB at 107.9 KB/sec)
Downloading: https://repository-jclouds.forge.cloudbees.com/release/org/apache/maven/maven-compat/3.0-alpha-2/maven-compat-3.0-alpha-2.pom
Downloading: https://repo.cloudbees.com/content/repositories/central/org/apache/maven/maven-compat/3.0-alpha-2/maven-compat-3.0-alpha-2.pom
Downloaded: https://repo.cloudbees.com/content/repositories/central/org/apache/maven/maven-compat/3.0-alpha-2/maven-compat-3.0-alpha-2.pom (3 KB at 202.9 KB/sec)
Downloading: https://repository-jclouds.forge.cloudbees.com/release/org/codehaus/plexus/plexus-container-default/1.0-beta-3.0.5/plexus-container-default-1.0-beta-3.0.5.pom
Downloading: https://repo.cloudbees.com/content/repositories/central/org/codehaus/plexus/plexus-container-default/1.0-beta-3.0.5/plexus-container-default-1.0-beta-3.0.5.pom
Downloaded: https://repo.cloudbees.com/content/repositories/central/org/codehaus/plexus/plexus-container-default/1.0-beta-3.0.5/plexus-container-default-1.0-beta-3.0.5.pom (2 KB at 85.8 KB/sec)
Downloading: https://repository-jclouds.forge.cloudbees.com/release/org/codehaus/plexus/plexus-containers/1.0-beta-3.0.5/plexus-containers-1.0-beta-3.0.5.pom
Downloading: https://repo.cloudbees.com/content/repositories/central/org/codehaus/plexus/plexus-containers/1.0-beta-3.0.5/plexus-containers-1.0-beta-3.0.5.pom
Downloaded: https://repo.cloudbees.com/content/repositories/central/org/codehaus/plexus/plexus-containers/1.0-beta-3.0.5/plexus-containers-1.0-beta-3.0.5.pom (5 KB at 223.1 KB/sec)
Downloading: https://repository-jclouds.forge.cloudbees.com/release/org/codehaus/plexus/plexus-classworlds/1.4/plexus-classworlds-1.4.pom
Downloading: https://repo.cloudbees.com/content/repositories/central/org/codehaus/plexus/plexus-classworlds/1.4/plexus-classworlds-1.4.pom
Downloaded: https://repo.cloudbees.com/content/repositories/central/org/codehaus/plexus/plexus-classworlds/1.4/plexus-classworlds-1.4.pom (5 KB at 350.7 KB/sec)
Downloading: https://repository-jclouds.forge.cloudbees.com/release/org/codehaus/plexus/plexus/2.0.0/plexus-2.0.0.pom
Downloading: https://repo.cloudbees.com/content/repositories/central/org/codehaus/plexus/plexus/2.0.0/plexus-2.0.0.pom
Downloaded: https://repo.cloudbees.com/content/repositories/central/org/codehaus/plexus/plexus/2.0.0/plexus-2.0.0.pom (8 KB at 598.5 KB/sec)
Downloading: https://repository-jclouds.forge.cloudbees.com/release/com/google/code/google-collections/google-collect/snapshot-20080530/google-collect-snapshot-20080530.pom
Downloading: https://repo.cloudbees.com/content/repositories/central/com/google/code/google-collections/google-collect/snapshot-20080530/google-collect-snapshot-20080530.pom
Downloaded: https://repo.cloudbees.com/content/repositories/central/com/google/code/google-collections/google-collect/snapshot-20080530/google-collect-snapshot-20080530.pom (2 KB at 101.3 KB/sec)
Downloading: https://repository-jclouds.forge.cloudbees.com/release/org/codehaus/plexus/plexus-component-annotations/1.0-beta-3.0.5/plexus-component-annotations-1.0-beta-3.0.5.pom
Downloading: https://repo.cloudbees.com/content/repositories/central/org/codehaus/plexus/plexus-component-annotations/1.0-beta-3.0.5/plexus-component-annotations-1.0-beta-3.0.5.pom
Downloaded: https://repo.cloudbees.com/content/repositories/central/org/codehaus/plexus/plexus-component-annotations/1.0-beta-3.0.5/plexus-component-annotations-1.0-beta-3.0.5.pom (602 B at 42.0 KB/sec)
Downloading: https://repository-jclouds.forge.cloudbees.com/release/org/apache/maven/wagon/wagon-provider-api/1.0-beta-4/wagon-provider-api-1.0-beta-4.pom
Downloading: https://repo.cloudbees.com/content/repositories/central/org/apache/maven/wagon/wagon-provider-api/1.0-beta-4/wagon-provider-api-1.0-beta-4.pom
Downloaded: https://repo.cloudbees.com/content/repositories/central/org/apache/maven/wagon/wagon-provider-api/1.0-beta-4/wagon-provider-api-1.0-beta-4.pom (906 B at 68.1 KB/sec)
Downloading: https://repository-jclouds.forge.cloudbees.com/release/org/apache/maven/wagon/wagon/1.0-beta-4/wagon-1.0-beta-4.pom
Downloading: https://repo.cloudbees.com/content/repositories/central/org/apache/maven/wagon/wagon/1.0-beta-4/wagon-1.0-beta-4.pom
Downloaded: https://repo.cloudbees.com/content/repositories/central/org/apache/maven/wagon/wagon/1.0-beta-4/wagon-1.0-beta-4.pom (11 KB at 787.6 KB/sec)
Downloading: https://repository-jclouds.forge.cloudbees.com/release/org/codehaus/woodstox/wstx-asl/3.2.6/wstx-asl-3.2.6.pom
Downloading: https://repo.cloudbees.com/content/repositories/central/org/codehaus/woodstox/wstx-asl/3.2.6/wstx-asl-3.2.6.pom
Downloaded: https://repo.cloudbees.com/content/repositories/central/org/codehaus/woodstox/wstx-asl/3.2.6/wstx-asl-3.2.6.pom (2 KB at 94.2 KB/sec)
Downloading: https://repository-jclouds.forge.cloudbees.com/release/stax/stax-api/1.0.1/stax-api-1.0.1.pom
Downloading: https://repo.cloudbees.com/content/repositories/central/stax/stax-api/1.0.1/stax-api-1.0.1.pom
Downloaded: https://repo.cloudbees.com/content/repositories/central/stax/stax-api/1.0.1/stax-api-1.0.1.pom (2 KB at 114.6 KB/sec)
Downloading: https://repository-jclouds.forge.cloudbees.com/release/org/sonatype/spice/model-builder/1.3/model-builder-1.3.pom
Downloading: https://repo.cloudbees.com/content/repositories/central/org/sonatype/spice/model-builder/1.3/model-builder-1.3.pom
Downloaded: https://repo.cloudbees.com/content/repositories/central/org/sonatype/spice/model-builder/1.3/model-builder-1.3.pom (3 KB at 216.3 KB/sec)
Downloading: https://repository-jclouds.forge.cloudbees.com/release/org/apache/maven/maven-project-builder/3.0-alpha-2/maven-project-builder-3.0-alpha-2.pom
Downloading: https://repo.cloudbees.com/content/repositories/central/org/apache/maven/maven-project-builder/3.0-alpha-2/maven-project-builder-3.0-alpha-2.pom
Downloaded: https://repo.cloudbees.com/content/repositories/central/org/apache/maven/maven-project-builder/3.0-alpha-2/maven-project-builder-3.0-alpha-2.pom (2 KB at 126.7 KB/sec)
Downloading: https://repository-jclouds.forge.cloudbees.com/release/org/apache/felix/maven-bundle-plugin/2.4.0/maven-bundle-plugin-2.4.0.pom
Downloading: https://repo.cloudbees.com/content/repositories/central/org/apache/felix/maven-bundle-plugin/2.4.0/maven-bundle-plugin-2.4.0.pom
Downloaded: https://repo.cloudbees.com/content/repositories/central/org/apache/felix/maven-bundle-plugin/2.4.0/maven-bundle-plugin-2.4.0.pom (4 KB at 302.7 KB/sec)
Downloading: https://repository-jclouds.forge.cloudbees.com/release/biz/aQute/bnd/bndlib/2.3.0/bndlib-2.3.0.pom
Downloading: https://repo.cloudbees.com/content/repositories/central/biz/aQute/bnd/bndlib/2.3.0/bndlib-2.3.0.pom
Downloaded: https://repo.cloudbees.com/content/repositories/central/biz/aQute/bnd/bndlib/2.3.0/bndlib-2.3.0.pom (2 KB at 106.9 KB/sec)
Downloading: https://repository-jclouds.forge.cloudbees.com/release/biz/aQute/bnd/parent/2.3.0/parent-2.3.0.pom
Downloading: https://repo.cloudbees.com/content/repositories/central/biz/aQute/bnd/parent/2.3.0/parent-2.3.0.pom
Downloaded: https://repo.cloudbees.com/content/repositories/central/biz/aQute/bnd/parent/2.3.0/parent-2.3.0.pom (5 KB at 311.6 KB/sec)
Downloading: https://repository-jclouds.forge.cloudbees.com/release/org/osgi/org.osgi.core/4.3.1/org.osgi.core-4.3.1.pom
Downloading: https://repo.cloudbees.com/content/repositories/central/org/osgi/org.osgi.core/4.3.1/org.osgi.core-4.3.1.pom
Downloaded: https://repo.cloudbees.com/content/repositories/central/org/osgi/org.osgi.core/4.3.1/org.osgi.core-4.3.1.pom (2 KB at 98.6 KB/sec)
Downloading: https://repository-jclouds.forge.cloudbees.com/release/org/easymock/easymock/3.2/easymock-3.2.pom
Downloading: https://repo.cloudbees.com/content/repositories/central/org/easymock/easymock/3.2/easymock-3.2.pom
Downloaded: https://repo.cloudbees.com/content/repositories/central/org/easymock/easymock/3.2/easymock-3.2.pom (5 KB at 362.5 KB/sec)
Downloading: https://repository-jclouds.forge.cloudbees.com/release/org/easymock/easymock-parent/3.2/easymock-parent-3.2.pom
Downloading: https://repo.cloudbees.com/content/repositories/central/org/easymock/easymock-parent/3.2/easymock-parent-3.2.pom
Downloaded: https://repo.cloudbees.com/content/repositories/central/org/easymock/easymock-parent/3.2/easymock-parent-3.2.pom (17 KB at 1143.3 KB/sec)
Downloading: https://repository-jclouds.forge.cloudbees.com/release/org/objenesis/objenesis/1.3/objenesis-1.3.pom
Downloading: https://repo.cloudbees.com/content/repositories/central/org/objenesis/objenesis/1.3/objenesis-1.3.pom
Downloaded: https://repo.cloudbees.com/content/repositories/central/org/objenesis/objenesis/1.3/objenesis-1.3.pom (3 KB at 190.9 KB/sec)
Downloading: https://repository-jclouds.forge.cloudbees.com/release/org/objenesis/objenesis-parent/1.3/objenesis-parent-1.3.pom
Downloading: https://repo.cloudbees.com/content/repositories/central/org/objenesis/objenesis-parent/1.3/objenesis-parent-1.3.pom
Downloaded: https://repo.cloudbees.com/content/repositories/central/org/objenesis/objenesis-parent/1.3/objenesis-parent-1.3.pom (14 KB at 954.6 KB/sec)
Downloading: https://repository-jclouds.forge.cloudbees.com/release/org/apache/maven/maven-plugin-api/3.0-alpha-2/maven-plugin-api-3.0-alpha-2.pom
Downloading: https://repo.cloudbees.com/content/repositories/central/org/apache/maven/maven-plugin-api/3.0-alpha-2/maven-plugin-api-3.0-alpha-2.pom
Downloaded: https://repo.cloudbees.com/content/repositories/central/org/apache/maven/maven-plugin-api/3.0-alpha-2/maven-plugin-api-3.0-alpha-2.pom (2 KB at 148.6 KB/sec)
Downloading: https://repository-jclouds.forge.cloudbees.com/release/org/osgi/org.osgi.compendium/4.3.1/org.osgi.compendium-4.3.1.pom
Downloading: https://repo.cloudbees.com/content/repositories/central/org/osgi/org.osgi.compendium/4.3.1/org.osgi.compendium-4.3.1.pom
Downloaded: https://repo.cloudbees.com/content/repositories/central/org/osgi/org.osgi.compendium/4.3.1/org.osgi.compendium-4.3.1.pom (2 KB at 107.0 KB/sec)
Downloading: https://repository-jclouds.forge.cloudbees.com/release/org/apache/servicemix/bundles/org.apache.servicemix.bundles.ant/1.8.4_1/org.apache.servicemix.bundles.ant-1.8.4_1.pom
Downloading: https://repo.cloudbees.com/content/repositories/central/org/apache/servicemix/bundles/org.apache.servicemix.bundles.ant/1.8.4_1/org.apache.servicemix.bundles.ant-1.8.4_1.pom
Downloaded: https://repo.cloudbees.com/content/repositories/central/org/apache/servicemix/bundles/org.apache.servicemix.bundles.ant/1.8.4_1/org.apache.servicemix.bundles.ant-1.8.4_1.pom (4 KB at 276.3 KB/sec)
Downloading: https://repository-jclouds.forge.cloudbees.com/release/org/apache/servicemix/bundles/bundles-pom/10/bundles-pom-10.pom
Downloading: https://repo.cloudbees.com/content/repositories/central/org/apache/servicemix/bundles/bundles-pom/10/bundles-pom-10.pom
Downloaded: https://repo.cloudbees.com/content/repositories/central/org/apache/servicemix/bundles/bundles-pom/10/bundles-pom-10.pom (15 KB at 898.9 KB/sec)
Downloading: https://repository-jclouds.forge.cloudbees.com/release/org/slf4j/slf4j-jdk14/1.7.7/slf4j-jdk14-1.7.7.jar
Downloading: https://repository-jclouds.forge.cloudbees.com/release/org/sonatype/sisu/sisu-inject-bean/2.3.0/sisu-inject-bean-2.3.0.jar
Downloading: https://repository-jclouds.forge.cloudbees.com/release/org/sonatype/sisu/sisu-guice/3.1.0/sisu-guice-3.1.0-no_aop.jar
Downloading: https://repository-jclouds.forge.cloudbees.com/release/org/sonatype/sisu/sisu-guava/0.9.9/sisu-guava-0.9.9.jar
Downloading: https://repository-jclouds.forge.cloudbees.com/release/org/codehaus/plexus/plexus-interpolation/1.1/plexus-interpolation-1.1.jar
Downloading: https://repository-jclouds.forge.cloudbees.com/release/com/google/code/google-collections/google-collect/snapshot-20080530/google-collect-snapshot-20080530.jar
Downloading: https://repository-jclouds.forge.cloudbees.com/release/org/codehaus/woodstox/wstx-asl/3.2.6/wstx-asl-3.2.6.jar
Downloading: https://repository-jclouds.forge.cloudbees.com/release/stax/stax-api/1.0.1/stax-api-1.0.1.jar
Downloading: https://repository-jclouds.forge.cloudbees.com/release/org/sonatype/spice/model-builder/1.3/model-builder-1.3.jar
Downloading: https://repository-jclouds.forge.cloudbees.com/release/org/apache/maven/maven-project-builder/3.0-alpha-2/maven-project-builder-3.0-alpha-2.jar
Downloading: https://repository-jclouds.forge.cloudbees.com/release/org/apache/felix/maven-bundle-plugin/2.4.0/maven-bundle-plugin-2.4.0.jar
Downloading: https://repository-jclouds.forge.cloudbees.com/release/biz/aQute/bnd/bndlib/2.3.0/bndlib-2.3.0.jar
Downloading: https://repository-jclouds.forge.cloudbees.com/release/org/osgi/org.osgi.core/4.3.1/org.osgi.core-4.3.1.jar
Downloading: https://repository-jclouds.forge.cloudbees.com/release/org/easymock/easymock/3.2/easymock-3.2.jar
Downloading: https://repository-jclouds.forge.cloudbees.com/release/org/objenesis/objenesis/1.3/objenesis-1.3.jar
Downloading: https://repository-jclouds.forge.cloudbees.com/release/org/osgi/org.osgi.compendium/4.3.1/org.osgi.compendium-4.3.1.jar
Downloading: https://repository-jclouds.forge.cloudbees.com/release/org/apache/servicemix/bundles/org.apache.servicemix.bundles.ant/1.8.4_1/org.apache.servicemix.bundles.ant-1.8.4_1.jar
Downloading: https://repo.cloudbees.com/content/repositories/central/org/slf4j/slf4j-jdk14/1.7.7/slf4j-jdk14-1.7.7.jar
Downloading: https://repo.cloudbees.com/content/repositories/central/org/sonatype/sisu/sisu-inject-bean/2.3.0/sisu-inject-bean-2.3.0.jar
Downloading: https://repo.cloudbees.com/content/repositories/central/org/sonatype/sisu/sisu-guice/3.1.0/sisu-guice-3.1.0-no_aop.jar
Downloading: https://repo.cloudbees.com/content/repositories/central/org/sonatype/sisu/sisu-guava/0.9.9/sisu-guava-0.9.9.jar
Downloading: https://repo.cloudbees.com/content/repositories/central/org/codehaus/plexus/plexus-interpolation/1.1/plexus-interpolation-1.1.jar
Downloaded: https://repo.cloudbees.com/content/repositories/central/org/slf4j/slf4j-jdk14/1.7.7/slf4j-jdk14-1.7.7.jar (8 KB at 266.1 KB/sec)
Downloading: https://repo.cloudbees.com/content/repositories/central/com/google/code/google-collections/google-collect/snapshot-20080530/google-collect-snapshot-20080530.jar
Downloaded: https://repo.cloudbees.com/content/repositories/central/org/codehaus/plexus/plexus-interpolation/1.1/plexus-interpolation-1.1.jar (35 KB at 770.0 KB/sec)
Downloading: https://repo.cloudbees.com/content/repositories/central/org/codehaus/woodstox/wstx-asl/3.2.6/wstx-asl-3.2.6.jar
Downloaded: https://repo.cloudbees.com/content/repositories/central/org/sonatype/sisu/sisu-inject-bean/2.3.0/sisu-inject-bean-2.3.0.jar (283 KB at 4091.2 KB/sec)
Downloading: https://repo.cloudbees.com/content/repositories/central/stax/stax-api/1.0.1/stax-api-1.0.1.jar
Downloaded: https://repo.cloudbees.com/content/repositories/central/org/sonatype/sisu/sisu-guice/3.1.0/sisu-guice-3.1.0-no_aop.jar (350 KB at 4781.5 KB/sec)
Downloading: https://repo.cloudbees.com/content/repositories/central/org/sonatype/spice/model-builder/1.3/model-builder-1.3.jar
Downloaded: https://repo.cloudbees.com/content/repositories/central/stax/stax-api/1.0.1/stax-api-1.0.1.jar (26 KB at 681.4 KB/sec)
Downloading: https://repo.cloudbees.com/content/repositories/central/org/apache/maven/maven-project-builder/3.0-alpha-2/maven-project-builder-3.0-alpha-2.jar
Downloaded: https://repo.cloudbees.com/content/repositories/central/org/sonatype/spice/model-builder/1.3/model-builder-1.3.jar (35 KB at 827.1 KB/sec)
Downloading: https://repo.cloudbees.com/content/repositories/central/org/apache/felix/maven-bundle-plugin/2.4.0/maven-bundle-plugin-2.4.0.jar
Downloaded: https://repo.cloudbees.com/content/repositories/central/com/google/code/google-collections/google-collect/snapshot-20080530/google-collect-snapshot-20080530.jar (490 KB at 5267.1 KB/sec)
Downloading: https://repo.cloudbees.com/content/repositories/central/biz/aQute/bnd/bndlib/2.3.0/bndlib-2.3.0.jar
Downloaded: https://repo.cloudbees.com/content/repositories/central/org/codehaus/woodstox/wstx-asl/3.2.6/wstx-asl-3.2.6.jar (509 KB at 4098.3 KB/sec)
Downloading: https://repo.cloudbees.com/content/repositories/central/org/osgi/org.osgi.core/4.3.1/org.osgi.core-4.3.1.jar
Downloaded: https://repo.cloudbees.com/content/repositories/central/org/apache/felix/maven-bundle-plugin/2.4.0/maven-bundle-plugin-2.4.0.jar (124 KB at 2125.7 KB/sec)
Downloading: https://repo.cloudbees.com/content/repositories/central/org/easymock/easymock/3.2/easymock-3.2.jar
Downloaded: https://repo.cloudbees.com/content/repositories/central/org/sonatype/sisu/sisu-guava/0.9.9/sisu-guava-0.9.9.jar (1473 KB at 8413.1 KB/sec)
Downloading: https://repo.cloudbees.com/content/repositories/central/org/objenesis/objenesis/1.3/objenesis-1.3.jar
Downloaded: https://repo.cloudbees.com/content/repositories/central/org/apache/maven/maven-project-builder/3.0-alpha-2/maven-project-builder-3.0-alpha-2.jar (166 KB at 2261.8 KB/sec)
Downloading: https://repo.cloudbees.com/content/repositories/central/org/osgi/org.osgi.compendium/4.3.1/org.osgi.compendium-4.3.1.jar
Downloaded: https://repo.cloudbees.com/content/repositories/central/org/easymock/easymock/3.2/easymock-3.2.jar (117 KB at 2542.9 KB/sec)
Downloading: https://repo.cloudbees.com/content/repositories/central/org/apache/servicemix/bundles/org.apache.servicemix.bundles.ant/1.8.4_1/org.apache.servicemix.bundles.ant-1.8.4_1.jar
Downloaded: https://repo.cloudbees.com/content/repositories/central/org/osgi/org.osgi.compendium/4.3.1/org.osgi.compendium-4.3.1.jar (750 KB at 10857.4 KB/sec)
Downloaded: https://repo.cloudbees.com/content/repositories/central/org/objenesis/objenesis/1.3/objenesis-1.3.jar (40 KB at 528.2 KB/sec)
Downloaded: https://repo.cloudbees.com/content/repositories/central/org/osgi/org.osgi.core/4.3.1/org.osgi.core-4.3.1.jar (342 KB at 3523.5 KB/sec)
Downloaded: https://repo.cloudbees.com/content/repositories/central/biz/aQute/bnd/bndlib/2.3.0/bndlib-2.3.0.jar (1744 KB at 11179.4 KB/sec)
Downloaded: https://repo.cloudbees.com/content/repositories/central/org/apache/servicemix/bundles/org.apache.servicemix.bundles.ant/1.8.4_1/org.apache.servicemix.bundles.ant-1.8.4_1.jar (1927 KB at 14594.8 KB/sec)
[INFO] Copying bundle: org.apache.karaf.assemblies.features:standard:xml:features:2.3.11
Downloading: https://repo.cloudbees.com/content/repositories/central/org/apache/karaf/assemblies/features/standard/2.3.11/standard-2.3.11-features.xml
Downloaded: https://repo.cloudbees.com/content/repositories/central/org/apache/karaf/assemblies/features/standard/2.3.11/standard-2.3.11-features.xml (38 KB at 1997.7 KB/sec)
[INFO] Copying bundle: org.apache.karaf.assemblies.features:enterprise:xml:features:2.3.11
Downloading: https://repo.cloudbees.com/content/repositories/central/org/apache/karaf/assemblies/features/enterprise/2.3.11/enterprise-2.3.11-features.xml
Downloaded: https://repo.cloudbees.com/content/repositories/central/org/apache/karaf/assemblies/features/enterprise/2.3.11/enterprise-2.3.11-features.xml (20 KB at 1363.8 KB/sec)
[INFO] Copying bundle: org.apache.karaf.assemblies.features:enterprise:xml:features:2.3.11
[INFO] Copying bundle: org.ops4j.pax.cdi:pax-cdi-features:xml:features:0.8.0
Downloading: https://repo.cloudbees.com/content/repositories/central/org/ops4j/pax/cdi/pax-cdi-features/0.8.0/pax-cdi-features-0.8.0-features.xml
Downloaded: https://repo.cloudbees.com/content/repositories/central/org/ops4j/pax/cdi/pax-cdi-features/0.8.0/pax-cdi-features-0.8.0-features.xml (11 KB at 807.2 KB/sec)
[INFO] Copying bundle: org.apache.karaf.assemblies.features:standard:xml:features:2.3.11
[INFO] Copying bundle: org.apache.karaf.assemblies.features:standard:xml:features:2.3.11
[INFO] Copying bundle: org.apache.jclouds.karaf:jclouds-karaf:xml:features:2.1.0-SNAPSHOT
Downloading: https://repository-jclouds.forge.cloudbees.com/snapshot/org/apache/jclouds/karaf/jclouds-karaf/2.1.0-SNAPSHOT/maven-metadata.xml
Downloading: https://repository.apache.org/content/repositories/snapshots/org/apache/jclouds/karaf/jclouds-karaf/2.1.0-SNAPSHOT/maven-metadata.xml
Downloading: http://repository.apache.org/snapshots/org/apache/jclouds/karaf/jclouds-karaf/2.1.0-SNAPSHOT/maven-metadata.xml
Downloaded: https://repository.apache.org/content/repositories/snapshots/org/apache/jclouds/karaf/jclouds-karaf/2.1.0-SNAPSHOT/maven-metadata.xml (2 KB at 11.8 KB/sec)
Downloaded: http://repository.apache.org/snapshots/org/apache/jclouds/karaf/jclouds-karaf/2.1.0-SNAPSHOT/maven-metadata.xml (2 KB at 9.5 KB/sec)
Started calculate disk usage of build
Finished Calculation of disk usage of build in 0 seconds
Started calculate disk usage of workspace
Finished Calculation of disk usage of workspace in 0 seconds
[INFO] ------------------------------------------------------------------------
[INFO] Reactor Summary:
[INFO] 
[INFO] Apache jclouds :: cli ............................. SUCCESS [12.027s]
[INFO] jclouds :: cli :: branding ........................ SUCCESS [3.935s]
[INFO] jclouds :: cli :: runner .......................... SUCCESS [24.800s]
[INFO] jclouds :: cli :: assembly ........................ FAILURE [13.405s]
[INFO] Apache jclouds :: cli ............................. SKIPPED
[INFO] ------------------------------------------------------------------------
[INFO] BUILD FAILURE
[INFO] ------------------------------------------------------------------------
[INFO] Total time: 1:01.090s
[INFO] Finished at: Fri May 12 03:40:38 EDT 2017
[INFO] Final Memory: 50M/253M
[INFO] ------------------------------------------------------------------------
Waiting for Jenkins to finish collecting data
[ERROR] Failed to execute goal org.apache.karaf.tooling:features-maven-plugin:2.3.11:add-features-to-repo (add-features-to-repo) on project jclouds-cli-assembly: Error populating repository: Unable to find the feature 'shell-compat' -> [Help 1]
org.apache.maven.lifecycle.LifecycleExecutionException: Failed to execute goal org.apache.karaf.tooling:features-maven-plugin:2.3.11:add-features-to-repo (add-features-to-repo) on project jclouds-cli-assembly: Error populating repository
	at org.apache.maven.lifecycle.internal.MojoExecutor.execute(MojoExecutor.java:217)
	at org.apache.maven.lifecycle.internal.MojoExecutor.execute(MojoExecutor.java:153)
	at org.apache.maven.lifecycle.internal.MojoExecutor.execute(MojoExecutor.java:145)
	at org.apache.maven.lifecycle.internal.LifecycleModuleBuilder.buildProject(LifecycleModuleBuilder.java:84)
	at org.apache.maven.lifecycle.internal.LifecycleModuleBuilder.buildProject(LifecycleModuleBuilder.java:59)
	at org.apache.maven.lifecycle.internal.LifecycleStarter.singleThreadedBuild(LifecycleStarter.java:183)
	at org.apache.maven.lifecycle.internal.LifecycleStarter.execute(LifecycleStarter.java:161)
	at org.apache.maven.DefaultMaven.doExecute(DefaultMaven.java:320)
	at org.apache.maven.DefaultMaven.execute(DefaultMaven.java:156)
	at org.jvnet.hudson.maven3.launcher.Maven3Launcher.main(Maven3Launcher.java:117)
	at sun.reflect.NativeMethodAccessorImpl.invoke0(Native Method)
	at sun.reflect.NativeMethodAccessorImpl.invoke(NativeMethodAccessorImpl.java:57)
	at sun.reflect.DelegatingMethodAccessorImpl.invoke(DelegatingMethodAccessorImpl.java:43)
	at java.lang.reflect.Method.invoke(Method.java:606)
	at org.codehaus.plexus.classworlds.launcher.Launcher.launchStandard(Launcher.java:329)
	at org.codehaus.plexus.classworlds.launcher.Launcher.launch(Launcher.java:239)
	at org.jvnet.hudson.maven3.agent.Maven3Main.launch(Maven3Main.java:181)
	at sun.reflect.NativeMethodAccessorImpl.invoke0(Native Method)
	at sun.reflect.NativeMethodAccessorImpl.invoke(NativeMethodAccessorImpl.java:57)
	at sun.reflect.DelegatingMethodAccessorImpl.invoke(DelegatingMethodAccessorImpl.java:43)
	at java.lang.reflect.Method.invoke(Method.java:606)
	at hudson.maven.Maven3Builder.call(Maven3Builder.java:139)
	at hudson.maven.Maven3Builder.call(Maven3Builder.java:70)
	at hudson.remoting.UserRequest.perform(UserRequest.java:153)
	at hudson.remoting.UserRequest.perform(UserRequest.java:50)
	at hudson.remoting.Request$2.run(Request.java:336)
	at hudson.remoting.InterceptingExecutorService$1.call(InterceptingExecutorService.java:68)
	at java.util.concurrent.FutureTask.run(FutureTask.java:262)
	at java.util.concurrent.ThreadPoolExecutor.runWorker(ThreadPoolExecutor.java:1145)
	at java.util.concurrent.ThreadPoolExecutor$Worker.run(ThreadPoolExecutor.java:615)
	at java.lang.Thread.run(Thread.java:745)
Caused by: org.apache.maven.plugin.MojoExecutionException: Error populating repository
	at org.apache.karaf.tooling.features.AddFeaturesToRepoMojo.execute(AddFeaturesToRepoMojo.java:226)
	at org.apache.maven.plugin.DefaultBuildPluginManager.executeMojo(DefaultBuildPluginManager.java:101)
	at org.apache.maven.lifecycle.internal.MojoExecutor.execute(MojoExecutor.java:209)
	... 30 more
Caused by: java.lang.IllegalArgumentException: Unable to find the feature 'shell-compat'
	at org.apache.karaf.tooling.features.AddFeaturesToRepoMojo.addFeatures(AddFeaturesToRepoMojo.java:328)
	at org.apache.karaf.tooling.features.AddFeaturesToRepoMojo.addFeatures(AddFeaturesToRepoMojo.java:341)
	at org.apache.karaf.tooling.features.AddFeaturesToRepoMojo.execute(AddFeaturesToRepoMojo.java:165)
	... 32 more
[ERROR] 
[ERROR] Re-run Maven using the -X switch to enable full debug logging.
[ERROR] 
[ERROR] For more information about the errors and possible solutions, please read the following articles:
[ERROR] [Help 1] http://cwiki.apache.org/confluence/display/MAVEN/MojoExecutionException
[ERROR] 
[ERROR] After correcting the problems, you can resume the build with the command
[ERROR]   mvn <goals> -rf :jclouds-cli-assembly
[JENKINS] Archiving <https://jclouds.ci.cloudbees.com/job/jclouds-cli/ws/branding/pom.xml> to org.apache.jclouds.cli/jclouds-cli-branding/2.1.0-SNAPSHOT/jclouds-cli-branding-2.1.0-SNAPSHOT.pom
[JENKINS] Archiving <https://jclouds.ci.cloudbees.com/job/jclouds-cli/ws/branding/target/jclouds-cli-branding-2.1.0-SNAPSHOT.jar> to org.apache.jclouds.cli/jclouds-cli-branding/2.1.0-20170512.073958-103/jclouds-cli-branding-2.1.0-20170512.073958-103.jar
[JENKINS] Archiving <https://jclouds.ci.cloudbees.com/job/jclouds-cli/ws/branding/target/jclouds-cli-branding-2.1.0-SNAPSHOT-tests.jar> to org.apache.jclouds.cli/jclouds-cli-branding/2.1.0-20170512.073958-103/jclouds-cli-branding-2.1.0-20170512.073958-103-tests.jar
[JENKINS] Archiving <https://jclouds.ci.cloudbees.com/job/jclouds-cli/ws/branding/target/jclouds-cli-branding-2.1.0-SNAPSHOT-sources.jar> to org.apache.jclouds.cli/jclouds-cli-branding/2.1.0-20170512.073958-103/jclouds-cli-branding-2.1.0-20170512.073958-103-sources.jar
[JENKINS] Archiving <https://jclouds.ci.cloudbees.com/job/jclouds-cli/ws/branding/target/jclouds-cli-branding-2.1.0-SNAPSHOT-test-sources.jar> to org.apache.jclouds.cli/jclouds-cli-branding/2.1.0-20170512.073958-103/jclouds-cli-branding-2.1.0-20170512.073958-103-test-sources.jar
[JENKINS] Archiving <https://jclouds.ci.cloudbees.com/job/jclouds-cli/ws/assembly/pom.xml> to org.apache.jclouds.cli/jclouds-cli-assembly/2.1.0-SNAPSHOT/jclouds-cli-assembly-2.1.0-SNAPSHOT.pom
[JENKINS] Archiving <https://jclouds.ci.cloudbees.com/job/jclouds-cli/ws/pom.xml> to org.apache.jclouds.cli/jclouds-cli/2.1.0-SNAPSHOT/jclouds-cli-2.1.0-SNAPSHOT.pom
[JENKINS] Archiving <https://jclouds.ci.cloudbees.com/job/jclouds-cli/ws/runner/pom.xml> to org.apache.jclouds.cli/jclouds-cli-runner/2.1.0-SNAPSHOT/jclouds-cli-runner-2.1.0-SNAPSHOT.pom
[JENKINS] Archiving <https://jclouds.ci.cloudbees.com/job/jclouds-cli/ws/runner/target/jclouds-cli-runner-2.1.0-SNAPSHOT.jar> to org.apache.jclouds.cli/jclouds-cli-runner/2.1.0-20170512.074023-101/jclouds-cli-runner-2.1.0-20170512.074023-101.jar
[JENKINS] Archiving <https://jclouds.ci.cloudbees.com/job/jclouds-cli/ws/runner/target/jclouds-cli-runner-2.1.0-SNAPSHOT-tests.jar> to org.apache.jclouds.cli/jclouds-cli-runner/2.1.0-20170512.074023-101/jclouds-cli-runner-2.1.0-20170512.074023-101-tests.jar
[JENKINS] Archiving <https://jclouds.ci.cloudbees.com/job/jclouds-cli/ws/runner/target/jclouds-cli-runner-2.1.0-SNAPSHOT-javadoc.jar> to org.apache.jclouds.cli/jclouds-cli-runner/2.1.0-20170512.074023-101/jclouds-cli-runner-2.1.0-20170512.074023-101-javadoc.jar
[JENKINS] Archiving <https://jclouds.ci.cloudbees.com/job/jclouds-cli/ws/runner/target/jclouds-cli-runner-2.1.0-SNAPSHOT-sources.jar> to org.apache.jclouds.cli/jclouds-cli-runner/2.1.0-20170512.074023-101/jclouds-cli-runner-2.1.0-20170512.074023-101-sources.jar
[JENKINS] Archiving <https://jclouds.ci.cloudbees.com/job/jclouds-cli/ws/runner/target/jclouds-cli-runner-2.1.0-SNAPSHOT-test-sources.jar> to org.apache.jclouds.cli/jclouds-cli-runner/2.1.0-20170512.074023-101/jclouds-cli-runner-2.1.0-20170512.074023-101-test-sources.jar
[JENKINS] Archiving <https://jclouds.ci.cloudbees.com/job/jclouds-cli/ws/project/pom.xml> to org.apache.jclouds.cli/jclouds-cli-project/2.1.0-SNAPSHOT/jclouds-cli-project-2.1.0-SNAPSHOT.pom
[JENKINS] Archiving <https://jclouds.ci.cloudbees.com/job/jclouds-cli/ws/project/target/jclouds-cli-project-2.1.0-SNAPSHOT-tests.jar> to org.apache.jclouds.cli/jclouds-cli-project/2.1.0-20170512.073950-103/jclouds-cli-project-2.1.0-20170512.073950-103-tests.jar
channel stopped
Started calculate disk usage of build
Finished Calculation of disk usage of build in 0 seconds
Started calculate disk usage of workspace
Finished Calculation of disk usage of workspace in 0 seconds

Build failed in Jenkins: jclouds-cli #1348

Posted by je...@cloudbees.com.
See <https://jclouds.ci.cloudbees.com/job/jclouds-cli/1348/display/redirect>

------------------------------------------
[...truncated 529.25 KB...]
Downloading: https://repository-jclouds.forge.cloudbees.com/release/org/apache/maven/maven-project/3.0-alpha-2/maven-project-3.0-alpha-2.pom
Downloading: https://repo.cloudbees.com/content/repositories/central/org/apache/maven/maven-project/3.0-alpha-2/maven-project-3.0-alpha-2.pom
Downloaded: https://repo.cloudbees.com/content/repositories/central/org/apache/maven/maven-project/3.0-alpha-2/maven-project-3.0-alpha-2.pom (4 KB at 230.1 KB/sec)
Downloading: https://repository-jclouds.forge.cloudbees.com/release/org/apache/maven/maven/3.0-alpha-2/maven-3.0-alpha-2.pom
Downloading: https://repo.cloudbees.com/content/repositories/central/org/apache/maven/maven/3.0-alpha-2/maven-3.0-alpha-2.pom
Downloaded: https://repo.cloudbees.com/content/repositories/central/org/apache/maven/maven/3.0-alpha-2/maven-3.0-alpha-2.pom (21 KB at 1227.9 KB/sec)
Downloading: https://repository-jclouds.forge.cloudbees.com/release/org/apache/maven/maven-model/3.0-alpha-2/maven-model-3.0-alpha-2.pom
Downloading: https://repo.cloudbees.com/content/repositories/central/org/apache/maven/maven-model/3.0-alpha-2/maven-model-3.0-alpha-2.pom
Downloaded: https://repo.cloudbees.com/content/repositories/central/org/apache/maven/maven-model/3.0-alpha-2/maven-model-3.0-alpha-2.pom (4 KB at 244.9 KB/sec)
Downloading: https://repository-jclouds.forge.cloudbees.com/release/org/codehaus/plexus/plexus-interpolation/1.1/plexus-interpolation-1.1.pom
Downloading: https://repo.cloudbees.com/content/repositories/central/org/codehaus/plexus/plexus-interpolation/1.1/plexus-interpolation-1.1.pom
Downloaded: https://repo.cloudbees.com/content/repositories/central/org/codehaus/plexus/plexus-interpolation/1.1/plexus-interpolation-1.1.pom (2 KB at 107.9 KB/sec)
Downloading: https://repository-jclouds.forge.cloudbees.com/release/org/apache/maven/maven-compat/3.0-alpha-2/maven-compat-3.0-alpha-2.pom
Downloading: https://repo.cloudbees.com/content/repositories/central/org/apache/maven/maven-compat/3.0-alpha-2/maven-compat-3.0-alpha-2.pom
Downloaded: https://repo.cloudbees.com/content/repositories/central/org/apache/maven/maven-compat/3.0-alpha-2/maven-compat-3.0-alpha-2.pom (3 KB at 157.8 KB/sec)
Downloading: https://repository-jclouds.forge.cloudbees.com/release/org/codehaus/plexus/plexus-container-default/1.0-beta-3.0.5/plexus-container-default-1.0-beta-3.0.5.pom
Downloading: https://repo.cloudbees.com/content/repositories/central/org/codehaus/plexus/plexus-container-default/1.0-beta-3.0.5/plexus-container-default-1.0-beta-3.0.5.pom
Downloaded: https://repo.cloudbees.com/content/repositories/central/org/codehaus/plexus/plexus-container-default/1.0-beta-3.0.5/plexus-container-default-1.0-beta-3.0.5.pom (2 KB at 98.1 KB/sec)
Downloading: https://repository-jclouds.forge.cloudbees.com/release/org/codehaus/plexus/plexus-containers/1.0-beta-3.0.5/plexus-containers-1.0-beta-3.0.5.pom
Downloading: https://repo.cloudbees.com/content/repositories/central/org/codehaus/plexus/plexus-containers/1.0-beta-3.0.5/plexus-containers-1.0-beta-3.0.5.pom
Downloaded: https://repo.cloudbees.com/content/repositories/central/org/codehaus/plexus/plexus-containers/1.0-beta-3.0.5/plexus-containers-1.0-beta-3.0.5.pom (5 KB at 251.0 KB/sec)
Downloading: https://repository-jclouds.forge.cloudbees.com/release/org/codehaus/plexus/plexus-classworlds/1.4/plexus-classworlds-1.4.pom
Downloading: https://repo.cloudbees.com/content/repositories/central/org/codehaus/plexus/plexus-classworlds/1.4/plexus-classworlds-1.4.pom
Downloaded: https://repo.cloudbees.com/content/repositories/central/org/codehaus/plexus/plexus-classworlds/1.4/plexus-classworlds-1.4.pom (5 KB at 228.0 KB/sec)
Downloading: https://repository-jclouds.forge.cloudbees.com/release/org/codehaus/plexus/plexus/2.0.0/plexus-2.0.0.pom
Downloading: https://repo.cloudbees.com/content/repositories/central/org/codehaus/plexus/plexus/2.0.0/plexus-2.0.0.pom
Downloaded: https://repo.cloudbees.com/content/repositories/central/org/codehaus/plexus/plexus/2.0.0/plexus-2.0.0.pom (8 KB at 409.5 KB/sec)
Downloading: https://repository-jclouds.forge.cloudbees.com/release/com/google/code/google-collections/google-collect/snapshot-20080530/google-collect-snapshot-20080530.pom
Downloading: https://repo.cloudbees.com/content/repositories/central/com/google/code/google-collections/google-collect/snapshot-20080530/google-collect-snapshot-20080530.pom
Downloaded: https://repo.cloudbees.com/content/repositories/central/com/google/code/google-collections/google-collect/snapshot-20080530/google-collect-snapshot-20080530.pom (2 KB at 64.5 KB/sec)
Downloading: https://repository-jclouds.forge.cloudbees.com/release/org/codehaus/plexus/plexus-component-annotations/1.0-beta-3.0.5/plexus-component-annotations-1.0-beta-3.0.5.pom
Downloading: https://repo.cloudbees.com/content/repositories/central/org/codehaus/plexus/plexus-component-annotations/1.0-beta-3.0.5/plexus-component-annotations-1.0-beta-3.0.5.pom
Downloaded: https://repo.cloudbees.com/content/repositories/central/org/codehaus/plexus/plexus-component-annotations/1.0-beta-3.0.5/plexus-component-annotations-1.0-beta-3.0.5.pom (602 B at 34.6 KB/sec)
Downloading: https://repository-jclouds.forge.cloudbees.com/release/org/apache/maven/wagon/wagon-provider-api/1.0-beta-4/wagon-provider-api-1.0-beta-4.pom
Downloading: https://repo.cloudbees.com/content/repositories/central/org/apache/maven/wagon/wagon-provider-api/1.0-beta-4/wagon-provider-api-1.0-beta-4.pom
Downloaded: https://repo.cloudbees.com/content/repositories/central/org/apache/maven/wagon/wagon-provider-api/1.0-beta-4/wagon-provider-api-1.0-beta-4.pom (906 B at 59.0 KB/sec)
Downloading: https://repository-jclouds.forge.cloudbees.com/release/org/apache/maven/wagon/wagon/1.0-beta-4/wagon-1.0-beta-4.pom
Downloading: https://repo.cloudbees.com/content/repositories/central/org/apache/maven/wagon/wagon/1.0-beta-4/wagon-1.0-beta-4.pom
Downloaded: https://repo.cloudbees.com/content/repositories/central/org/apache/maven/wagon/wagon/1.0-beta-4/wagon-1.0-beta-4.pom (11 KB at 682.6 KB/sec)
Downloading: https://repository-jclouds.forge.cloudbees.com/release/org/codehaus/woodstox/wstx-asl/3.2.6/wstx-asl-3.2.6.pom
Downloading: https://repo.cloudbees.com/content/repositories/central/org/codehaus/woodstox/wstx-asl/3.2.6/wstx-asl-3.2.6.pom
Downloaded: https://repo.cloudbees.com/content/repositories/central/org/codehaus/woodstox/wstx-asl/3.2.6/wstx-asl-3.2.6.pom (2 KB at 45.4 KB/sec)
Downloading: https://repository-jclouds.forge.cloudbees.com/release/stax/stax-api/1.0.1/stax-api-1.0.1.pom
Downloading: https://repo.cloudbees.com/content/repositories/central/stax/stax-api/1.0.1/stax-api-1.0.1.pom
Downloaded: https://repo.cloudbees.com/content/repositories/central/stax/stax-api/1.0.1/stax-api-1.0.1.pom (2 KB at 99.3 KB/sec)
Downloading: https://repository-jclouds.forge.cloudbees.com/release/org/sonatype/spice/model-builder/1.3/model-builder-1.3.pom
Downloading: https://repo.cloudbees.com/content/repositories/central/org/sonatype/spice/model-builder/1.3/model-builder-1.3.pom
Downloaded: https://repo.cloudbees.com/content/repositories/central/org/sonatype/spice/model-builder/1.3/model-builder-1.3.pom (3 KB at 187.4 KB/sec)
Downloading: https://repository-jclouds.forge.cloudbees.com/release/org/apache/maven/maven-project-builder/3.0-alpha-2/maven-project-builder-3.0-alpha-2.pom
Downloading: https://repo.cloudbees.com/content/repositories/central/org/apache/maven/maven-project-builder/3.0-alpha-2/maven-project-builder-3.0-alpha-2.pom
Downloaded: https://repo.cloudbees.com/content/repositories/central/org/apache/maven/maven-project-builder/3.0-alpha-2/maven-project-builder-3.0-alpha-2.pom (2 KB at 102.9 KB/sec)
Downloading: https://repository-jclouds.forge.cloudbees.com/release/org/apache/felix/maven-bundle-plugin/2.4.0/maven-bundle-plugin-2.4.0.pom
Downloading: https://repo.cloudbees.com/content/repositories/central/org/apache/felix/maven-bundle-plugin/2.4.0/maven-bundle-plugin-2.4.0.pom
Downloaded: https://repo.cloudbees.com/content/repositories/central/org/apache/felix/maven-bundle-plugin/2.4.0/maven-bundle-plugin-2.4.0.pom (4 KB at 262.3 KB/sec)
Downloading: https://repository-jclouds.forge.cloudbees.com/release/biz/aQute/bnd/bndlib/2.3.0/bndlib-2.3.0.pom
Downloading: https://repo.cloudbees.com/content/repositories/central/biz/aQute/bnd/bndlib/2.3.0/bndlib-2.3.0.pom
Downloaded: https://repo.cloudbees.com/content/repositories/central/biz/aQute/bnd/bndlib/2.3.0/bndlib-2.3.0.pom (2 KB at 115.8 KB/sec)
Downloading: https://repository-jclouds.forge.cloudbees.com/release/biz/aQute/bnd/parent/2.3.0/parent-2.3.0.pom
Downloading: https://repo.cloudbees.com/content/repositories/central/biz/aQute/bnd/parent/2.3.0/parent-2.3.0.pom
Downloaded: https://repo.cloudbees.com/content/repositories/central/biz/aQute/bnd/parent/2.3.0/parent-2.3.0.pom (5 KB at 289.3 KB/sec)
Downloading: https://repository-jclouds.forge.cloudbees.com/release/org/osgi/org.osgi.core/4.3.1/org.osgi.core-4.3.1.pom
Downloading: https://repo.cloudbees.com/content/repositories/central/org/osgi/org.osgi.core/4.3.1/org.osgi.core-4.3.1.pom
Downloaded: https://repo.cloudbees.com/content/repositories/central/org/osgi/org.osgi.core/4.3.1/org.osgi.core-4.3.1.pom (2 KB at 98.6 KB/sec)
Downloading: https://repository-jclouds.forge.cloudbees.com/release/org/easymock/easymock/3.2/easymock-3.2.pom
Downloading: https://repo.cloudbees.com/content/repositories/central/org/easymock/easymock/3.2/easymock-3.2.pom
Downloaded: https://repo.cloudbees.com/content/repositories/central/org/easymock/easymock/3.2/easymock-3.2.pom (5 KB at 314.2 KB/sec)
Downloading: https://repository-jclouds.forge.cloudbees.com/release/org/easymock/easymock-parent/3.2/easymock-parent-3.2.pom
Downloading: https://repo.cloudbees.com/content/repositories/central/org/easymock/easymock-parent/3.2/easymock-parent-3.2.pom
Downloaded: https://repo.cloudbees.com/content/repositories/central/org/easymock/easymock-parent/3.2/easymock-parent-3.2.pom (17 KB at 941.6 KB/sec)
Downloading: https://repository-jclouds.forge.cloudbees.com/release/org/objenesis/objenesis/1.3/objenesis-1.3.pom
Downloading: https://repo.cloudbees.com/content/repositories/central/org/objenesis/objenesis/1.3/objenesis-1.3.pom
Downloaded: https://repo.cloudbees.com/content/repositories/central/org/objenesis/objenesis/1.3/objenesis-1.3.pom (3 KB at 112.8 KB/sec)
Downloading: https://repository-jclouds.forge.cloudbees.com/release/org/objenesis/objenesis-parent/1.3/objenesis-parent-1.3.pom
Downloading: https://repo.cloudbees.com/content/repositories/central/org/objenesis/objenesis-parent/1.3/objenesis-parent-1.3.pom
Downloaded: https://repo.cloudbees.com/content/repositories/central/org/objenesis/objenesis-parent/1.3/objenesis-parent-1.3.pom (14 KB at 835.3 KB/sec)
Downloading: https://repository-jclouds.forge.cloudbees.com/release/org/apache/maven/maven-plugin-api/3.0-alpha-2/maven-plugin-api-3.0-alpha-2.pom
Downloading: https://repo.cloudbees.com/content/repositories/central/org/apache/maven/maven-plugin-api/3.0-alpha-2/maven-plugin-api-3.0-alpha-2.pom
Downloaded: https://repo.cloudbees.com/content/repositories/central/org/apache/maven/maven-plugin-api/3.0-alpha-2/maven-plugin-api-3.0-alpha-2.pom (2 KB at 138.0 KB/sec)
Downloading: https://repository-jclouds.forge.cloudbees.com/release/org/osgi/org.osgi.compendium/4.3.1/org.osgi.compendium-4.3.1.pom
Downloading: https://repo.cloudbees.com/content/repositories/central/org/osgi/org.osgi.compendium/4.3.1/org.osgi.compendium-4.3.1.pom
Downloaded: https://repo.cloudbees.com/content/repositories/central/org/osgi/org.osgi.compendium/4.3.1/org.osgi.compendium-4.3.1.pom (2 KB at 107.0 KB/sec)
Downloading: https://repository-jclouds.forge.cloudbees.com/release/org/apache/servicemix/bundles/org.apache.servicemix.bundles.ant/1.8.4_1/org.apache.servicemix.bundles.ant-1.8.4_1.pom
Downloading: https://repo.cloudbees.com/content/repositories/central/org/apache/servicemix/bundles/org.apache.servicemix.bundles.ant/1.8.4_1/org.apache.servicemix.bundles.ant-1.8.4_1.pom
Downloaded: https://repo.cloudbees.com/content/repositories/central/org/apache/servicemix/bundles/org.apache.servicemix.bundles.ant/1.8.4_1/org.apache.servicemix.bundles.ant-1.8.4_1.pom (4 KB at 207.2 KB/sec)
Downloading: https://repository-jclouds.forge.cloudbees.com/release/org/apache/servicemix/bundles/bundles-pom/10/bundles-pom-10.pom
Downloading: https://repo.cloudbees.com/content/repositories/central/org/apache/servicemix/bundles/bundles-pom/10/bundles-pom-10.pom
Downloaded: https://repo.cloudbees.com/content/repositories/central/org/apache/servicemix/bundles/bundles-pom/10/bundles-pom-10.pom (15 KB at 1027.3 KB/sec)
Downloading: https://repository-jclouds.forge.cloudbees.com/release/org/slf4j/slf4j-jdk14/1.7.7/slf4j-jdk14-1.7.7.jar
Downloading: https://repository-jclouds.forge.cloudbees.com/release/org/sonatype/sisu/sisu-inject-bean/2.3.0/sisu-inject-bean-2.3.0.jar
Downloading: https://repository-jclouds.forge.cloudbees.com/release/org/sonatype/sisu/sisu-guice/3.1.0/sisu-guice-3.1.0-no_aop.jar
Downloading: https://repository-jclouds.forge.cloudbees.com/release/org/sonatype/sisu/sisu-guava/0.9.9/sisu-guava-0.9.9.jar
Downloading: https://repository-jclouds.forge.cloudbees.com/release/org/codehaus/plexus/plexus-interpolation/1.1/plexus-interpolation-1.1.jar
Downloading: https://repository-jclouds.forge.cloudbees.com/release/com/google/code/google-collections/google-collect/snapshot-20080530/google-collect-snapshot-20080530.jar
Downloading: https://repository-jclouds.forge.cloudbees.com/release/org/codehaus/woodstox/wstx-asl/3.2.6/wstx-asl-3.2.6.jar
Downloading: https://repository-jclouds.forge.cloudbees.com/release/stax/stax-api/1.0.1/stax-api-1.0.1.jar
Downloading: https://repository-jclouds.forge.cloudbees.com/release/org/sonatype/spice/model-builder/1.3/model-builder-1.3.jar
Downloading: https://repository-jclouds.forge.cloudbees.com/release/org/apache/maven/maven-project-builder/3.0-alpha-2/maven-project-builder-3.0-alpha-2.jar
Downloading: https://repository-jclouds.forge.cloudbees.com/release/org/apache/felix/maven-bundle-plugin/2.4.0/maven-bundle-plugin-2.4.0.jar
Downloading: https://repository-jclouds.forge.cloudbees.com/release/biz/aQute/bnd/bndlib/2.3.0/bndlib-2.3.0.jar
Downloading: https://repository-jclouds.forge.cloudbees.com/release/org/osgi/org.osgi.core/4.3.1/org.osgi.core-4.3.1.jar
Downloading: https://repository-jclouds.forge.cloudbees.com/release/org/easymock/easymock/3.2/easymock-3.2.jar
Downloading: https://repository-jclouds.forge.cloudbees.com/release/org/objenesis/objenesis/1.3/objenesis-1.3.jar
Downloading: https://repository-jclouds.forge.cloudbees.com/release/org/osgi/org.osgi.compendium/4.3.1/org.osgi.compendium-4.3.1.jar
Downloading: https://repository-jclouds.forge.cloudbees.com/release/org/apache/servicemix/bundles/org.apache.servicemix.bundles.ant/1.8.4_1/org.apache.servicemix.bundles.ant-1.8.4_1.jar
Downloading: https://repo.cloudbees.com/content/repositories/central/org/slf4j/slf4j-jdk14/1.7.7/slf4j-jdk14-1.7.7.jar
Downloading: https://repo.cloudbees.com/content/repositories/central/org/sonatype/sisu/sisu-inject-bean/2.3.0/sisu-inject-bean-2.3.0.jar
Downloading: https://repo.cloudbees.com/content/repositories/central/org/sonatype/sisu/sisu-guice/3.1.0/sisu-guice-3.1.0-no_aop.jar
Downloading: https://repo.cloudbees.com/content/repositories/central/org/sonatype/sisu/sisu-guava/0.9.9/sisu-guava-0.9.9.jar
Downloading: https://repo.cloudbees.com/content/repositories/central/org/codehaus/plexus/plexus-interpolation/1.1/plexus-interpolation-1.1.jar
Downloaded: https://repo.cloudbees.com/content/repositories/central/org/slf4j/slf4j-jdk14/1.7.7/slf4j-jdk14-1.7.7.jar (8 KB at 248.9 KB/sec)
Downloading: https://repo.cloudbees.com/content/repositories/central/com/google/code/google-collections/google-collect/snapshot-20080530/google-collect-snapshot-20080530.jar
Downloaded: https://repo.cloudbees.com/content/repositories/central/org/codehaus/plexus/plexus-interpolation/1.1/plexus-interpolation-1.1.jar (35 KB at 1050.0 KB/sec)
Downloading: https://repo.cloudbees.com/content/repositories/central/org/codehaus/woodstox/wstx-asl/3.2.6/wstx-asl-3.2.6.jar
Downloaded: https://repo.cloudbees.com/content/repositories/central/org/sonatype/sisu/sisu-guice/3.1.0/sisu-guice-3.1.0-no_aop.jar (350 KB at 4654.0 KB/sec)
Downloading: https://repo.cloudbees.com/content/repositories/central/stax/stax-api/1.0.1/stax-api-1.0.1.jar
Downloaded: https://repo.cloudbees.com/content/repositories/central/org/sonatype/sisu/sisu-inject-bean/2.3.0/sisu-inject-bean-2.3.0.jar (283 KB at 3321.1 KB/sec)
Downloading: https://repo.cloudbees.com/content/repositories/central/org/sonatype/spice/model-builder/1.3/model-builder-1.3.jar
Downloaded: https://repo.cloudbees.com/content/repositories/central/org/sonatype/spice/model-builder/1.3/model-builder-1.3.jar (35 KB at 2316.0 KB/sec)
Downloading: https://repo.cloudbees.com/content/repositories/central/org/apache/maven/maven-project-builder/3.0-alpha-2/maven-project-builder-3.0-alpha-2.jar
Downloaded: https://repo.cloudbees.com/content/repositories/central/stax/stax-api/1.0.1/stax-api-1.0.1.jar (26 KB at 550.9 KB/sec)
Downloading: https://repo.cloudbees.com/content/repositories/central/org/apache/felix/maven-bundle-plugin/2.4.0/maven-bundle-plugin-2.4.0.jar
Downloaded: https://repo.cloudbees.com/content/repositories/central/com/google/code/google-collections/google-collect/snapshot-20080530/google-collect-snapshot-20080530.jar (490 KB at 5102.5 KB/sec)
Downloading: https://repo.cloudbees.com/content/repositories/central/biz/aQute/bnd/bndlib/2.3.0/bndlib-2.3.0.jar
Downloaded: https://repo.cloudbees.com/content/repositories/central/org/codehaus/woodstox/wstx-asl/3.2.6/wstx-asl-3.2.6.jar (509 KB at 3025.0 KB/sec)
Downloading: https://repo.cloudbees.com/content/repositories/central/org/osgi/org.osgi.core/4.3.1/org.osgi.core-4.3.1.jar
Downloaded: https://repo.cloudbees.com/content/repositories/central/org/apache/felix/maven-bundle-plugin/2.4.0/maven-bundle-plugin-2.4.0.jar (124 KB at 1385.3 KB/sec)
Downloading: https://repo.cloudbees.com/content/repositories/central/org/easymock/easymock/3.2/easymock-3.2.jar
Downloaded: https://repo.cloudbees.com/content/repositories/central/org/apache/maven/maven-project-builder/3.0-alpha-2/maven-project-builder-3.0-alpha-2.jar (166 KB at 1435.8 KB/sec)
Downloading: https://repo.cloudbees.com/content/repositories/central/org/objenesis/objenesis/1.3/objenesis-1.3.jar
Downloaded: https://repo.cloudbees.com/content/repositories/central/org/sonatype/sisu/sisu-guava/0.9.9/sisu-guava-0.9.9.jar (1473 KB at 6401.2 KB/sec)
Downloading: https://repo.cloudbees.com/content/repositories/central/org/osgi/org.osgi.compendium/4.3.1/org.osgi.compendium-4.3.1.jar
Downloaded: https://repo.cloudbees.com/content/repositories/central/org/objenesis/objenesis/1.3/objenesis-1.3.jar (40 KB at 1467.3 KB/sec)
Downloading: https://repo.cloudbees.com/content/repositories/central/org/apache/servicemix/bundles/org.apache.servicemix.bundles.ant/1.8.4_1/org.apache.servicemix.bundles.ant-1.8.4_1.jar
Downloaded: https://repo.cloudbees.com/content/repositories/central/biz/aQute/bnd/bndlib/2.3.0/bndlib-2.3.0.jar (1744 KB at 13312.9 KB/sec)
Downloaded: https://repo.cloudbees.com/content/repositories/central/org/osgi/org.osgi.core/4.3.1/org.osgi.core-4.3.1.jar (342 KB at 5996.2 KB/sec)
Downloaded: https://repo.cloudbees.com/content/repositories/central/org/easymock/easymock/3.2/easymock-3.2.jar (117 KB at 1695.3 KB/sec)
Downloaded: https://repo.cloudbees.com/content/repositories/central/org/osgi/org.osgi.compendium/4.3.1/org.osgi.compendium-4.3.1.jar (750 KB at 4540.4 KB/sec)
Downloaded: https://repo.cloudbees.com/content/repositories/central/org/apache/servicemix/bundles/org.apache.servicemix.bundles.ant/1.8.4_1/org.apache.servicemix.bundles.ant-1.8.4_1.jar (1927 KB at 9981.9 KB/sec)
[INFO] Copying bundle: org.apache.karaf.assemblies.features:standard:xml:features:2.3.11
Downloading: https://repo.cloudbees.com/content/repositories/central/org/apache/karaf/assemblies/features/standard/2.3.11/standard-2.3.11-features.xml
Downloaded: https://repo.cloudbees.com/content/repositories/central/org/apache/karaf/assemblies/features/standard/2.3.11/standard-2.3.11-features.xml (38 KB at 1581.5 KB/sec)
[INFO] Copying bundle: org.apache.karaf.assemblies.features:enterprise:xml:features:2.3.11
Downloading: https://repo.cloudbees.com/content/repositories/central/org/apache/karaf/assemblies/features/enterprise/2.3.11/enterprise-2.3.11-features.xml
Downloaded: https://repo.cloudbees.com/content/repositories/central/org/apache/karaf/assemblies/features/enterprise/2.3.11/enterprise-2.3.11-features.xml (20 KB at 1060.8 KB/sec)
[INFO] Copying bundle: org.apache.karaf.assemblies.features:enterprise:xml:features:2.3.11
[INFO] Copying bundle: org.ops4j.pax.cdi:pax-cdi-features:xml:features:0.8.0
Downloading: https://repo.cloudbees.com/content/repositories/central/org/ops4j/pax/cdi/pax-cdi-features/0.8.0/pax-cdi-features-0.8.0-features.xml
Downloaded: https://repo.cloudbees.com/content/repositories/central/org/ops4j/pax/cdi/pax-cdi-features/0.8.0/pax-cdi-features-0.8.0-features.xml (11 KB at 617.3 KB/sec)
[INFO] Copying bundle: org.apache.karaf.assemblies.features:standard:xml:features:2.3.11
[INFO] Copying bundle: org.apache.karaf.assemblies.features:standard:xml:features:2.3.11
[INFO] Copying bundle: org.apache.jclouds.karaf:jclouds-karaf:xml:features:2.1.0-SNAPSHOT
Downloading: https://repository-jclouds.forge.cloudbees.com/snapshot/org/apache/jclouds/karaf/jclouds-karaf/2.1.0-SNAPSHOT/maven-metadata.xml
Downloading: https://repository.apache.org/content/repositories/snapshots/org/apache/jclouds/karaf/jclouds-karaf/2.1.0-SNAPSHOT/maven-metadata.xml
Downloading: http://repository.apache.org/snapshots/org/apache/jclouds/karaf/jclouds-karaf/2.1.0-SNAPSHOT/maven-metadata.xml
Downloaded: https://repository.apache.org/content/repositories/snapshots/org/apache/jclouds/karaf/jclouds-karaf/2.1.0-SNAPSHOT/maven-metadata.xml (2 KB at 28.8 KB/sec)
Downloaded: http://repository.apache.org/snapshots/org/apache/jclouds/karaf/jclouds-karaf/2.1.0-SNAPSHOT/maven-metadata.xml (2 KB at 22.9 KB/sec)
Downloading: https://repository.apache.org/content/repositories/snapshots/org/apache/jclouds/karaf/jclouds-karaf/2.1.0-SNAPSHOT/jclouds-karaf-2.1.0-20170512.070723-135-features.xml
Downloaded: https://repository.apache.org/content/repositories/snapshots/org/apache/jclouds/karaf/jclouds-karaf/2.1.0-SNAPSHOT/jclouds-karaf-2.1.0-20170512.070723-135-features.xml (36 KB at 778.2 KB/sec)
Started calculate disk usage of build
Finished Calculation of disk usage of build in 0 seconds
Started calculate disk usage of workspace
Finished Calculation of disk usage of workspace in 0 seconds
[INFO] ------------------------------------------------------------------------
[INFO] Reactor Summary:
[INFO] 
[INFO] Apache jclouds :: cli ............................. SUCCESS [21.538s]
[INFO] jclouds :: cli :: branding ........................ SUCCESS [4.847s]
[INFO] jclouds :: cli :: runner .......................... SUCCESS [25.290s]
[INFO] jclouds :: cli :: assembly ........................ FAILURE [16.718s]
[INFO] Apache jclouds :: cli ............................. SKIPPED
[INFO] ------------------------------------------------------------------------
[INFO] BUILD FAILURE
[INFO] ------------------------------------------------------------------------
[INFO] Total time: 1:14.860s
[INFO] Finished at: Fri May 12 03:10:09 EDT 2017
[INFO] Final Memory: 52M/272M
[INFO] ------------------------------------------------------------------------
Waiting for Jenkins to finish collecting data
[ERROR] Failed to execute goal org.apache.karaf.tooling:features-maven-plugin:2.3.11:add-features-to-repo (add-features-to-repo) on project jclouds-cli-assembly: Error populating repository: Unable to find the feature 'shell-compat' -> [Help 1]
org.apache.maven.lifecycle.LifecycleExecutionException: Failed to execute goal org.apache.karaf.tooling:features-maven-plugin:2.3.11:add-features-to-repo (add-features-to-repo) on project jclouds-cli-assembly: Error populating repository
	at org.apache.maven.lifecycle.internal.MojoExecutor.execute(MojoExecutor.java:217)
	at org.apache.maven.lifecycle.internal.MojoExecutor.execute(MojoExecutor.java:153)
	at org.apache.maven.lifecycle.internal.MojoExecutor.execute(MojoExecutor.java:145)
	at org.apache.maven.lifecycle.internal.LifecycleModuleBuilder.buildProject(LifecycleModuleBuilder.java:84)
	at org.apache.maven.lifecycle.internal.LifecycleModuleBuilder.buildProject(LifecycleModuleBuilder.java:59)
	at org.apache.maven.lifecycle.internal.LifecycleStarter.singleThreadedBuild(LifecycleStarter.java:183)
	at org.apache.maven.lifecycle.internal.LifecycleStarter.execute(LifecycleStarter.java:161)
	at org.apache.maven.DefaultMaven.doExecute(DefaultMaven.java:320)
	at org.apache.maven.DefaultMaven.execute(DefaultMaven.java:156)
	at org.jvnet.hudson.maven3.launcher.Maven3Launcher.main(Maven3Launcher.java:117)
	at sun.reflect.NativeMethodAccessorImpl.invoke0(Native Method)
	at sun.reflect.NativeMethodAccessorImpl.invoke(NativeMethodAccessorImpl.java:57)
	at sun.reflect.DelegatingMethodAccessorImpl.invoke(DelegatingMethodAccessorImpl.java:43)
	at java.lang.reflect.Method.invoke(Method.java:606)
	at org.codehaus.plexus.classworlds.launcher.Launcher.launchStandard(Launcher.java:329)
	at org.codehaus.plexus.classworlds.launcher.Launcher.launch(Launcher.java:239)
	at org.jvnet.hudson.maven3.agent.Maven3Main.launch(Maven3Main.java:181)
	at sun.reflect.NativeMethodAccessorImpl.invoke0(Native Method)
	at sun.reflect.NativeMethodAccessorImpl.invoke(NativeMethodAccessorImpl.java:57)
	at sun.reflect.DelegatingMethodAccessorImpl.invoke(DelegatingMethodAccessorImpl.java:43)
	at java.lang.reflect.Method.invoke(Method.java:606)
	at hudson.maven.Maven3Builder.call(Maven3Builder.java:139)
	at hudson.maven.Maven3Builder.call(Maven3Builder.java:70)
	at hudson.remoting.UserRequest.perform(UserRequest.java:153)
	at hudson.remoting.UserRequest.perform(UserRequest.java:50)
	at hudson.remoting.Request$2.run(Request.java:336)
	at hudson.remoting.InterceptingExecutorService$1.call(InterceptingExecutorService.java:68)
	at java.util.concurrent.FutureTask.run(FutureTask.java:262)
	at java.util.concurrent.ThreadPoolExecutor.runWorker(ThreadPoolExecutor.java:1145)
	at java.util.concurrent.ThreadPoolExecutor$Worker.run(ThreadPoolExecutor.java:615)
	at java.lang.Thread.run(Thread.java:745)
Caused by: org.apache.maven.plugin.MojoExecutionException: Error populating repository
	at org.apache.karaf.tooling.features.AddFeaturesToRepoMojo.execute(AddFeaturesToRepoMojo.java:226)
	at org.apache.maven.plugin.DefaultBuildPluginManager.executeMojo(DefaultBuildPluginManager.java:101)
	at org.apache.maven.lifecycle.internal.MojoExecutor.execute(MojoExecutor.java:209)
	... 30 more
Caused by: java.lang.IllegalArgumentException: Unable to find the feature 'shell-compat'
	at org.apache.karaf.tooling.features.AddFeaturesToRepoMojo.addFeatures(AddFeaturesToRepoMojo.java:328)
	at org.apache.karaf.tooling.features.AddFeaturesToRepoMojo.addFeatures(AddFeaturesToRepoMojo.java:341)
	at org.apache.karaf.tooling.features.AddFeaturesToRepoMojo.execute(AddFeaturesToRepoMojo.java:165)
	... 32 more
[ERROR] 
[ERROR] Re-run Maven using the -X switch to enable full debug logging.
[ERROR] 
[ERROR] For more information about the errors and possible solutions, please read the following articles:
[ERROR] [Help 1] http://cwiki.apache.org/confluence/display/MAVEN/MojoExecutionException
[ERROR] 
[ERROR] After correcting the problems, you can resume the build with the command
[ERROR]   mvn <goals> -rf :jclouds-cli-assembly
[JENKINS] Archiving <https://jclouds.ci.cloudbees.com/job/jclouds-cli/ws/branding/pom.xml> to org.apache.jclouds.cli/jclouds-cli-branding/2.1.0-SNAPSHOT/jclouds-cli-branding-2.1.0-SNAPSHOT.pom
[JENKINS] Archiving <https://jclouds.ci.cloudbees.com/job/jclouds-cli/ws/branding/target/jclouds-cli-branding-2.1.0-SNAPSHOT.jar> to org.apache.jclouds.cli/jclouds-cli-branding/2.1.0-20170512.070924-102/jclouds-cli-branding-2.1.0-20170512.070924-102.jar
[JENKINS] Archiving <https://jclouds.ci.cloudbees.com/job/jclouds-cli/ws/branding/target/jclouds-cli-branding-2.1.0-SNAPSHOT-tests.jar> to org.apache.jclouds.cli/jclouds-cli-branding/2.1.0-20170512.070924-102/jclouds-cli-branding-2.1.0-20170512.070924-102-tests.jar
[JENKINS] Archiving <https://jclouds.ci.cloudbees.com/job/jclouds-cli/ws/branding/target/jclouds-cli-branding-2.1.0-SNAPSHOT-sources.jar> to org.apache.jclouds.cli/jclouds-cli-branding/2.1.0-20170512.070924-102/jclouds-cli-branding-2.1.0-20170512.070924-102-sources.jar
[JENKINS] Archiving <https://jclouds.ci.cloudbees.com/job/jclouds-cli/ws/branding/target/jclouds-cli-branding-2.1.0-SNAPSHOT-test-sources.jar> to org.apache.jclouds.cli/jclouds-cli-branding/2.1.0-20170512.070924-102/jclouds-cli-branding-2.1.0-20170512.070924-102-test-sources.jar
[JENKINS] Archiving <https://jclouds.ci.cloudbees.com/job/jclouds-cli/ws/assembly/pom.xml> to org.apache.jclouds.cli/jclouds-cli-assembly/2.1.0-SNAPSHOT/jclouds-cli-assembly-2.1.0-SNAPSHOT.pom
[JENKINS] Archiving <https://jclouds.ci.cloudbees.com/job/jclouds-cli/ws/pom.xml> to org.apache.jclouds.cli/jclouds-cli/2.1.0-SNAPSHOT/jclouds-cli-2.1.0-SNAPSHOT.pom
[JENKINS] Archiving <https://jclouds.ci.cloudbees.com/job/jclouds-cli/ws/runner/pom.xml> to org.apache.jclouds.cli/jclouds-cli-runner/2.1.0-SNAPSHOT/jclouds-cli-runner-2.1.0-SNAPSHOT.pom
[JENKINS] Archiving <https://jclouds.ci.cloudbees.com/job/jclouds-cli/ws/runner/target/jclouds-cli-runner-2.1.0-SNAPSHOT.jar> to org.apache.jclouds.cli/jclouds-cli-runner/2.1.0-20170512.070950-100/jclouds-cli-runner-2.1.0-20170512.070950-100.jar
[JENKINS] Archiving <https://jclouds.ci.cloudbees.com/job/jclouds-cli/ws/runner/target/jclouds-cli-runner-2.1.0-SNAPSHOT-tests.jar> to org.apache.jclouds.cli/jclouds-cli-runner/2.1.0-20170512.070950-100/jclouds-cli-runner-2.1.0-20170512.070950-100-tests.jar
[JENKINS] Archiving <https://jclouds.ci.cloudbees.com/job/jclouds-cli/ws/runner/target/jclouds-cli-runner-2.1.0-SNAPSHOT-javadoc.jar> to org.apache.jclouds.cli/jclouds-cli-runner/2.1.0-20170512.070950-100/jclouds-cli-runner-2.1.0-20170512.070950-100-javadoc.jar
[JENKINS] Archiving <https://jclouds.ci.cloudbees.com/job/jclouds-cli/ws/runner/target/jclouds-cli-runner-2.1.0-SNAPSHOT-sources.jar> to org.apache.jclouds.cli/jclouds-cli-runner/2.1.0-20170512.070950-100/jclouds-cli-runner-2.1.0-20170512.070950-100-sources.jar
[JENKINS] Archiving <https://jclouds.ci.cloudbees.com/job/jclouds-cli/ws/runner/target/jclouds-cli-runner-2.1.0-SNAPSHOT-test-sources.jar> to org.apache.jclouds.cli/jclouds-cli-runner/2.1.0-20170512.070950-100/jclouds-cli-runner-2.1.0-20170512.070950-100-test-sources.jar
[JENKINS] Archiving <https://jclouds.ci.cloudbees.com/job/jclouds-cli/ws/project/pom.xml> to org.apache.jclouds.cli/jclouds-cli-project/2.1.0-SNAPSHOT/jclouds-cli-project-2.1.0-SNAPSHOT.pom
[JENKINS] Archiving <https://jclouds.ci.cloudbees.com/job/jclouds-cli/ws/project/target/jclouds-cli-project-2.1.0-SNAPSHOT-tests.jar> to org.apache.jclouds.cli/jclouds-cli-project/2.1.0-20170512.070919-102/jclouds-cli-project-2.1.0-20170512.070919-102-tests.jar
channel stopped
Started calculate disk usage of build
Finished Calculation of disk usage of build in 0 seconds
Started calculate disk usage of workspace
Finished Calculation of disk usage of workspace in 0 seconds

Build failed in Jenkins: jclouds-cli #1347

Posted by je...@cloudbees.com.
See <https://jclouds.ci.cloudbees.com/job/jclouds-cli/1347/display/redirect>

------------------------------------------
[...truncated 260.79 KB...]
Downloading: https://repo.cloudbees.com/content/repositories/central/org/sonatype/sisu/inject/guava-parent/0.9.9/guava-parent-0.9.9.pom
Downloaded: https://repo.cloudbees.com/content/repositories/central/org/sonatype/sisu/inject/guava-parent/0.9.9/guava-parent-0.9.9.pom (11 KB at 767.8 KB/sec)
Downloading: https://repository-jclouds.forge.cloudbees.com/release/org/apache/maven/maven-project/3.0-alpha-2/maven-project-3.0-alpha-2.pom
Downloading: https://repo.cloudbees.com/content/repositories/central/org/apache/maven/maven-project/3.0-alpha-2/maven-project-3.0-alpha-2.pom
Downloaded: https://repo.cloudbees.com/content/repositories/central/org/apache/maven/maven-project/3.0-alpha-2/maven-project-3.0-alpha-2.pom (4 KB at 247.7 KB/sec)
Downloading: https://repository-jclouds.forge.cloudbees.com/release/org/apache/maven/maven/3.0-alpha-2/maven-3.0-alpha-2.pom
Downloading: https://repo.cloudbees.com/content/repositories/central/org/apache/maven/maven/3.0-alpha-2/maven-3.0-alpha-2.pom
Downloaded: https://repo.cloudbees.com/content/repositories/central/org/apache/maven/maven/3.0-alpha-2/maven-3.0-alpha-2.pom (21 KB at 1391.6 KB/sec)
Downloading: https://repository-jclouds.forge.cloudbees.com/release/org/apache/maven/maven-model/3.0-alpha-2/maven-model-3.0-alpha-2.pom
Downloading: https://repo.cloudbees.com/content/repositories/central/org/apache/maven/maven-model/3.0-alpha-2/maven-model-3.0-alpha-2.pom
Downloaded: https://repo.cloudbees.com/content/repositories/central/org/apache/maven/maven-model/3.0-alpha-2/maven-model-3.0-alpha-2.pom (4 KB at 244.9 KB/sec)
Downloading: https://repository-jclouds.forge.cloudbees.com/release/org/codehaus/plexus/plexus-interpolation/1.1/plexus-interpolation-1.1.pom
Downloading: https://repo.cloudbees.com/content/repositories/central/org/codehaus/plexus/plexus-interpolation/1.1/plexus-interpolation-1.1.pom
Downloaded: https://repo.cloudbees.com/content/repositories/central/org/codehaus/plexus/plexus-interpolation/1.1/plexus-interpolation-1.1.pom (2 KB at 78.0 KB/sec)
Downloading: https://repository-jclouds.forge.cloudbees.com/release/org/apache/maven/maven-compat/3.0-alpha-2/maven-compat-3.0-alpha-2.pom
Downloading: https://repo.cloudbees.com/content/repositories/central/org/apache/maven/maven-compat/3.0-alpha-2/maven-compat-3.0-alpha-2.pom
Downloaded: https://repo.cloudbees.com/content/repositories/central/org/apache/maven/maven-compat/3.0-alpha-2/maven-compat-3.0-alpha-2.pom (3 KB at 218.5 KB/sec)
Downloading: https://repository-jclouds.forge.cloudbees.com/release/org/codehaus/plexus/plexus-container-default/1.0-beta-3.0.5/plexus-container-default-1.0-beta-3.0.5.pom
Downloading: https://repo.cloudbees.com/content/repositories/central/org/codehaus/plexus/plexus-container-default/1.0-beta-3.0.5/plexus-container-default-1.0-beta-3.0.5.pom
Downloaded: https://repo.cloudbees.com/content/repositories/central/org/codehaus/plexus/plexus-container-default/1.0-beta-3.0.5/plexus-container-default-1.0-beta-3.0.5.pom (2 KB at 98.1 KB/sec)
Downloading: https://repository-jclouds.forge.cloudbees.com/release/org/codehaus/plexus/plexus-containers/1.0-beta-3.0.5/plexus-containers-1.0-beta-3.0.5.pom
Downloading: https://repo.cloudbees.com/content/repositories/central/org/codehaus/plexus/plexus-containers/1.0-beta-3.0.5/plexus-containers-1.0-beta-3.0.5.pom
Downloaded: https://repo.cloudbees.com/content/repositories/central/org/codehaus/plexus/plexus-containers/1.0-beta-3.0.5/plexus-containers-1.0-beta-3.0.5.pom (5 KB at 286.8 KB/sec)
Downloading: https://repository-jclouds.forge.cloudbees.com/release/org/codehaus/plexus/plexus-classworlds/1.4/plexus-classworlds-1.4.pom
Downloading: https://repo.cloudbees.com/content/repositories/central/org/codehaus/plexus/plexus-classworlds/1.4/plexus-classworlds-1.4.pom
Downloaded: https://repo.cloudbees.com/content/repositories/central/org/codehaus/plexus/plexus-classworlds/1.4/plexus-classworlds-1.4.pom (5 KB at 350.7 KB/sec)
Downloading: https://repository-jclouds.forge.cloudbees.com/release/org/codehaus/plexus/plexus/2.0.0/plexus-2.0.0.pom
Downloading: https://repo.cloudbees.com/content/repositories/central/org/codehaus/plexus/plexus/2.0.0/plexus-2.0.0.pom
Downloaded: https://repo.cloudbees.com/content/repositories/central/org/codehaus/plexus/plexus/2.0.0/plexus-2.0.0.pom (8 KB at 457.7 KB/sec)
Downloading: https://repository-jclouds.forge.cloudbees.com/release/com/google/code/google-collections/google-collect/snapshot-20080530/google-collect-snapshot-20080530.pom
Downloading: https://repo.cloudbees.com/content/repositories/central/com/google/code/google-collections/google-collect/snapshot-20080530/google-collect-snapshot-20080530.pom
Downloaded: https://repo.cloudbees.com/content/repositories/central/com/google/code/google-collections/google-collect/snapshot-20080530/google-collect-snapshot-20080530.pom (2 KB at 64.5 KB/sec)
Downloading: https://repository-jclouds.forge.cloudbees.com/release/org/codehaus/plexus/plexus-component-annotations/1.0-beta-3.0.5/plexus-component-annotations-1.0-beta-3.0.5.pom
Downloading: https://repo.cloudbees.com/content/repositories/central/org/codehaus/plexus/plexus-component-annotations/1.0-beta-3.0.5/plexus-component-annotations-1.0-beta-3.0.5.pom
Downloaded: https://repo.cloudbees.com/content/repositories/central/org/codehaus/plexus/plexus-component-annotations/1.0-beta-3.0.5/plexus-component-annotations-1.0-beta-3.0.5.pom (602 B at 42.0 KB/sec)
Downloading: https://repository-jclouds.forge.cloudbees.com/release/org/apache/maven/wagon/wagon-provider-api/1.0-beta-4/wagon-provider-api-1.0-beta-4.pom
Downloading: https://repo.cloudbees.com/content/repositories/central/org/apache/maven/wagon/wagon-provider-api/1.0-beta-4/wagon-provider-api-1.0-beta-4.pom
Downloaded: https://repo.cloudbees.com/content/repositories/central/org/apache/maven/wagon/wagon-provider-api/1.0-beta-4/wagon-provider-api-1.0-beta-4.pom (906 B at 63.2 KB/sec)
Downloading: https://repository-jclouds.forge.cloudbees.com/release/org/apache/maven/wagon/wagon/1.0-beta-4/wagon-1.0-beta-4.pom
Downloading: https://repo.cloudbees.com/content/repositories/central/org/apache/maven/wagon/wagon/1.0-beta-4/wagon-1.0-beta-4.pom
Downloaded: https://repo.cloudbees.com/content/repositories/central/org/apache/maven/wagon/wagon/1.0-beta-4/wagon-1.0-beta-4.pom (11 KB at 682.6 KB/sec)
Downloading: https://repository-jclouds.forge.cloudbees.com/release/org/codehaus/woodstox/wstx-asl/3.2.6/wstx-asl-3.2.6.pom
Downloading: https://repo.cloudbees.com/content/repositories/central/org/codehaus/woodstox/wstx-asl/3.2.6/wstx-asl-3.2.6.pom
Downloaded: https://repo.cloudbees.com/content/repositories/central/org/codehaus/woodstox/wstx-asl/3.2.6/wstx-asl-3.2.6.pom (2 KB at 94.2 KB/sec)
Downloading: https://repository-jclouds.forge.cloudbees.com/release/stax/stax-api/1.0.1/stax-api-1.0.1.pom
Downloading: https://repo.cloudbees.com/content/repositories/central/stax/stax-api/1.0.1/stax-api-1.0.1.pom
Downloaded: https://repo.cloudbees.com/content/repositories/central/stax/stax-api/1.0.1/stax-api-1.0.1.pom (2 KB at 114.6 KB/sec)
Downloading: https://repository-jclouds.forge.cloudbees.com/release/org/sonatype/spice/model-builder/1.3/model-builder-1.3.pom
Downloading: https://repo.cloudbees.com/content/repositories/central/org/sonatype/spice/model-builder/1.3/model-builder-1.3.pom
Downloaded: https://repo.cloudbees.com/content/repositories/central/org/sonatype/spice/model-builder/1.3/model-builder-1.3.pom (3 KB at 216.3 KB/sec)
Downloading: https://repository-jclouds.forge.cloudbees.com/release/org/apache/maven/maven-project-builder/3.0-alpha-2/maven-project-builder-3.0-alpha-2.pom
Downloading: https://repo.cloudbees.com/content/repositories/central/org/apache/maven/maven-project-builder/3.0-alpha-2/maven-project-builder-3.0-alpha-2.pom
Downloaded: https://repo.cloudbees.com/content/repositories/central/org/apache/maven/maven-project-builder/3.0-alpha-2/maven-project-builder-3.0-alpha-2.pom (2 KB at 126.7 KB/sec)
Downloading: https://repository-jclouds.forge.cloudbees.com/release/org/apache/felix/maven-bundle-plugin/2.4.0/maven-bundle-plugin-2.4.0.pom
Downloading: https://repo.cloudbees.com/content/repositories/central/org/apache/felix/maven-bundle-plugin/2.4.0/maven-bundle-plugin-2.4.0.pom
Downloaded: https://repo.cloudbees.com/content/repositories/central/org/apache/felix/maven-bundle-plugin/2.4.0/maven-bundle-plugin-2.4.0.pom (4 KB at 262.3 KB/sec)
Downloading: https://repository-jclouds.forge.cloudbees.com/release/biz/aQute/bnd/bndlib/2.3.0/bndlib-2.3.0.pom
Downloading: https://repo.cloudbees.com/content/repositories/central/biz/aQute/bnd/bndlib/2.3.0/bndlib-2.3.0.pom
Downloaded: https://repo.cloudbees.com/content/repositories/central/biz/aQute/bnd/bndlib/2.3.0/bndlib-2.3.0.pom (2 KB at 92.6 KB/sec)
Downloading: https://repository-jclouds.forge.cloudbees.com/release/biz/aQute/bnd/parent/2.3.0/parent-2.3.0.pom
Downloading: https://repo.cloudbees.com/content/repositories/central/biz/aQute/bnd/parent/2.3.0/parent-2.3.0.pom
Downloaded: https://repo.cloudbees.com/content/repositories/central/biz/aQute/bnd/parent/2.3.0/parent-2.3.0.pom (5 KB at 270.1 KB/sec)
Downloading: https://repository-jclouds.forge.cloudbees.com/release/org/osgi/org.osgi.core/4.3.1/org.osgi.core-4.3.1.pom
Downloading: https://repo.cloudbees.com/content/repositories/central/org/osgi/org.osgi.core/4.3.1/org.osgi.core-4.3.1.pom
Downloaded: https://repo.cloudbees.com/content/repositories/central/org/osgi/org.osgi.core/4.3.1/org.osgi.core-4.3.1.pom (2 KB at 92.0 KB/sec)
Downloading: https://repository-jclouds.forge.cloudbees.com/release/org/easymock/easymock/3.2/easymock-3.2.pom
Downloading: https://repo.cloudbees.com/content/repositories/central/org/easymock/easymock/3.2/easymock-3.2.pom
Downloaded: https://repo.cloudbees.com/content/repositories/central/org/easymock/easymock/3.2/easymock-3.2.pom (5 KB at 362.5 KB/sec)
Downloading: https://repository-jclouds.forge.cloudbees.com/release/org/easymock/easymock-parent/3.2/easymock-parent-3.2.pom
Downloading: https://repo.cloudbees.com/content/repositories/central/org/easymock/easymock-parent/3.2/easymock-parent-3.2.pom
Downloaded: https://repo.cloudbees.com/content/repositories/central/org/easymock/easymock-parent/3.2/easymock-parent-3.2.pom (17 KB at 1067.1 KB/sec)
Downloading: https://repository-jclouds.forge.cloudbees.com/release/org/objenesis/objenesis/1.3/objenesis-1.3.pom
Downloading: https://repo.cloudbees.com/content/repositories/central/org/objenesis/objenesis/1.3/objenesis-1.3.pom
Downloaded: https://repo.cloudbees.com/content/repositories/central/org/objenesis/objenesis/1.3/objenesis-1.3.pom (3 KB at 177.2 KB/sec)
Downloading: https://repository-jclouds.forge.cloudbees.com/release/org/objenesis/objenesis-parent/1.3/objenesis-parent-1.3.pom
Downloading: https://repo.cloudbees.com/content/repositories/central/org/objenesis/objenesis-parent/1.3/objenesis-parent-1.3.pom
Downloaded: https://repo.cloudbees.com/content/repositories/central/org/objenesis/objenesis-parent/1.3/objenesis-parent-1.3.pom (14 KB at 891.0 KB/sec)
Downloading: https://repository-jclouds.forge.cloudbees.com/release/org/apache/maven/maven-plugin-api/3.0-alpha-2/maven-plugin-api-3.0-alpha-2.pom
Downloading: https://repo.cloudbees.com/content/repositories/central/org/apache/maven/maven-plugin-api/3.0-alpha-2/maven-plugin-api-3.0-alpha-2.pom
Downloaded: https://repo.cloudbees.com/content/repositories/central/org/apache/maven/maven-plugin-api/3.0-alpha-2/maven-plugin-api-3.0-alpha-2.pom (2 KB at 113.6 KB/sec)
Downloading: https://repository-jclouds.forge.cloudbees.com/release/org/osgi/org.osgi.compendium/4.3.1/org.osgi.compendium-4.3.1.pom
Downloading: https://repo.cloudbees.com/content/repositories/central/org/osgi/org.osgi.compendium/4.3.1/org.osgi.compendium-4.3.1.pom
Downloaded: https://repo.cloudbees.com/content/repositories/central/org/osgi/org.osgi.compendium/4.3.1/org.osgi.compendium-4.3.1.pom (2 KB at 107.0 KB/sec)
Downloading: https://repository-jclouds.forge.cloudbees.com/release/org/apache/servicemix/bundles/org.apache.servicemix.bundles.ant/1.8.4_1/org.apache.servicemix.bundles.ant-1.8.4_1.pom
Downloading: https://repo.cloudbees.com/content/repositories/central/org/apache/servicemix/bundles/org.apache.servicemix.bundles.ant/1.8.4_1/org.apache.servicemix.bundles.ant-1.8.4_1.pom
Downloaded: https://repo.cloudbees.com/content/repositories/central/org/apache/servicemix/bundles/org.apache.servicemix.bundles.ant/1.8.4_1/org.apache.servicemix.bundles.ant-1.8.4_1.pom (4 KB at 184.2 KB/sec)
Downloading: https://repository-jclouds.forge.cloudbees.com/release/org/apache/servicemix/bundles/bundles-pom/10/bundles-pom-10.pom
Downloading: https://repo.cloudbees.com/content/repositories/central/org/apache/servicemix/bundles/bundles-pom/10/bundles-pom-10.pom
Downloaded: https://repo.cloudbees.com/content/repositories/central/org/apache/servicemix/bundles/bundles-pom/10/bundles-pom-10.pom (15 KB at 846.0 KB/sec)
Downloading: https://repository-jclouds.forge.cloudbees.com/release/org/slf4j/slf4j-jdk14/1.7.7/slf4j-jdk14-1.7.7.jar
Downloading: https://repository-jclouds.forge.cloudbees.com/release/org/sonatype/sisu/sisu-inject-bean/2.3.0/sisu-inject-bean-2.3.0.jar
Downloading: https://repository-jclouds.forge.cloudbees.com/release/org/sonatype/sisu/sisu-guice/3.1.0/sisu-guice-3.1.0-no_aop.jar
Downloading: https://repository-jclouds.forge.cloudbees.com/release/org/sonatype/sisu/sisu-guava/0.9.9/sisu-guava-0.9.9.jar
Downloading: https://repository-jclouds.forge.cloudbees.com/release/org/codehaus/plexus/plexus-interpolation/1.1/plexus-interpolation-1.1.jar
Downloading: https://repository-jclouds.forge.cloudbees.com/release/com/google/code/google-collections/google-collect/snapshot-20080530/google-collect-snapshot-20080530.jar
Downloading: https://repository-jclouds.forge.cloudbees.com/release/org/codehaus/woodstox/wstx-asl/3.2.6/wstx-asl-3.2.6.jar
Downloading: https://repository-jclouds.forge.cloudbees.com/release/stax/stax-api/1.0.1/stax-api-1.0.1.jar
Downloading: https://repository-jclouds.forge.cloudbees.com/release/org/sonatype/spice/model-builder/1.3/model-builder-1.3.jar
Downloading: https://repository-jclouds.forge.cloudbees.com/release/org/apache/maven/maven-project-builder/3.0-alpha-2/maven-project-builder-3.0-alpha-2.jar
Downloading: https://repository-jclouds.forge.cloudbees.com/release/org/apache/felix/maven-bundle-plugin/2.4.0/maven-bundle-plugin-2.4.0.jar
Downloading: https://repository-jclouds.forge.cloudbees.com/release/biz/aQute/bnd/bndlib/2.3.0/bndlib-2.3.0.jar
Downloading: https://repository-jclouds.forge.cloudbees.com/release/org/osgi/org.osgi.core/4.3.1/org.osgi.core-4.3.1.jar
Downloading: https://repository-jclouds.forge.cloudbees.com/release/org/easymock/easymock/3.2/easymock-3.2.jar
Downloading: https://repository-jclouds.forge.cloudbees.com/release/org/objenesis/objenesis/1.3/objenesis-1.3.jar
Downloading: https://repository-jclouds.forge.cloudbees.com/release/org/osgi/org.osgi.compendium/4.3.1/org.osgi.compendium-4.3.1.jar
Downloading: https://repository-jclouds.forge.cloudbees.com/release/org/apache/servicemix/bundles/org.apache.servicemix.bundles.ant/1.8.4_1/org.apache.servicemix.bundles.ant-1.8.4_1.jar
Downloading: https://repo.cloudbees.com/content/repositories/central/org/slf4j/slf4j-jdk14/1.7.7/slf4j-jdk14-1.7.7.jar
Downloading: https://repo.cloudbees.com/content/repositories/central/org/sonatype/sisu/sisu-inject-bean/2.3.0/sisu-inject-bean-2.3.0.jar
Downloading: https://repo.cloudbees.com/content/repositories/central/org/sonatype/sisu/sisu-guice/3.1.0/sisu-guice-3.1.0-no_aop.jar
Downloading: https://repo.cloudbees.com/content/repositories/central/org/sonatype/sisu/sisu-guava/0.9.9/sisu-guava-0.9.9.jar
Downloading: https://repo.cloudbees.com/content/repositories/central/org/codehaus/plexus/plexus-interpolation/1.1/plexus-interpolation-1.1.jar
Downloaded: https://repo.cloudbees.com/content/repositories/central/org/slf4j/slf4j-jdk14/1.7.7/slf4j-jdk14-1.7.7.jar (8 KB at 285.8 KB/sec)
Downloading: https://repo.cloudbees.com/content/repositories/central/com/google/code/google-collections/google-collect/snapshot-20080530/google-collect-snapshot-20080530.jar
Downloaded: https://repo.cloudbees.com/content/repositories/central/org/codehaus/plexus/plexus-interpolation/1.1/plexus-interpolation-1.1.jar (35 KB at 1117.7 KB/sec)
Downloading: https://repo.cloudbees.com/content/repositories/central/org/codehaus/woodstox/wstx-asl/3.2.6/wstx-asl-3.2.6.jar
Downloaded: https://repo.cloudbees.com/content/repositories/central/org/sonatype/sisu/sisu-guice/3.1.0/sisu-guice-3.1.0-no_aop.jar (350 KB at 7426.6 KB/sec)
Downloading: https://repo.cloudbees.com/content/repositories/central/stax/stax-api/1.0.1/stax-api-1.0.1.jar
Downloaded: https://repo.cloudbees.com/content/repositories/central/org/sonatype/sisu/sisu-inject-bean/2.3.0/sisu-inject-bean-2.3.0.jar (283 KB at 3814.7 KB/sec)
Downloading: https://repo.cloudbees.com/content/repositories/central/org/sonatype/spice/model-builder/1.3/model-builder-1.3.jar
Downloaded: https://repo.cloudbees.com/content/repositories/central/org/sonatype/spice/model-builder/1.3/model-builder-1.3.jar (35 KB at 755.2 KB/sec)
Downloading: https://repo.cloudbees.com/content/repositories/central/org/apache/maven/maven-project-builder/3.0-alpha-2/maven-project-builder-3.0-alpha-2.jar
Downloaded: https://repo.cloudbees.com/content/repositories/central/stax/stax-api/1.0.1/stax-api-1.0.1.jar (26 KB at 301.1 KB/sec)
Downloading: https://repo.cloudbees.com/content/repositories/central/org/apache/felix/maven-bundle-plugin/2.4.0/maven-bundle-plugin-2.4.0.jar
Downloaded: https://repo.cloudbees.com/content/repositories/central/org/apache/felix/maven-bundle-plugin/2.4.0/maven-bundle-plugin-2.4.0.jar (124 KB at 4931.6 KB/sec)
Downloading: https://repo.cloudbees.com/content/repositories/central/biz/aQute/bnd/bndlib/2.3.0/bndlib-2.3.0.jar
Downloaded: https://repo.cloudbees.com/content/repositories/central/com/google/code/google-collections/google-collect/snapshot-20080530/google-collect-snapshot-20080530.jar (490 KB at 3061.5 KB/sec)
Downloading: https://repo.cloudbees.com/content/repositories/central/org/osgi/org.osgi.core/4.3.1/org.osgi.core-4.3.1.jar
Downloaded: https://repo.cloudbees.com/content/repositories/central/org/codehaus/woodstox/wstx-asl/3.2.6/wstx-asl-3.2.6.jar (509 KB at 3137.0 KB/sec)
Downloading: https://repo.cloudbees.com/content/repositories/central/org/easymock/easymock/3.2/easymock-3.2.jar
Downloaded: https://repo.cloudbees.com/content/repositories/central/org/apache/maven/maven-project-builder/3.0-alpha-2/maven-project-builder-3.0-alpha-2.jar (166 KB at 1794.7 KB/sec)
Downloading: https://repo.cloudbees.com/content/repositories/central/org/objenesis/objenesis/1.3/objenesis-1.3.jar
Downloaded: https://repo.cloudbees.com/content/repositories/central/org/sonatype/sisu/sisu-guava/0.9.9/sisu-guava-0.9.9.jar (1473 KB at 6602.2 KB/sec)
Downloading: https://repo.cloudbees.com/content/repositories/central/org/osgi/org.osgi.compendium/4.3.1/org.osgi.compendium-4.3.1.jar
Downloaded: https://repo.cloudbees.com/content/repositories/central/org/osgi/org.osgi.core/4.3.1/org.osgi.core-4.3.1.jar (342 KB at 6975.1 KB/sec)
Downloading: https://repo.cloudbees.com/content/repositories/central/org/apache/servicemix/bundles/org.apache.servicemix.bundles.ant/1.8.4_1/org.apache.servicemix.bundles.ant-1.8.4_1.jar
Downloaded: https://repo.cloudbees.com/content/repositories/central/org/easymock/easymock/3.2/easymock-3.2.jar (117 KB at 2658.5 KB/sec)
Downloaded: https://repo.cloudbees.com/content/repositories/central/org/objenesis/objenesis/1.3/objenesis-1.3.jar (40 KB at 1278.0 KB/sec)
Downloaded: https://repo.cloudbees.com/content/repositories/central/org/osgi/org.osgi.compendium/4.3.1/org.osgi.compendium-4.3.1.jar (750 KB at 3690.5 KB/sec)
Downloaded: https://repo.cloudbees.com/content/repositories/central/biz/aQute/bnd/bndlib/2.3.0/bndlib-2.3.0.jar (1744 KB at 6013.8 KB/sec)
Downloaded: https://repo.cloudbees.com/content/repositories/central/org/apache/servicemix/bundles/org.apache.servicemix.bundles.ant/1.8.4_1/org.apache.servicemix.bundles.ant-1.8.4_1.jar (1927 KB at 7584.7 KB/sec)
[INFO] Copying bundle: org.apache.karaf.assemblies.features:standard:xml:features:2.3.11
Downloading: https://repo.cloudbees.com/content/repositories/central/org/apache/karaf/assemblies/features/standard/2.3.11/standard-2.3.11-features.xml
Downloaded: https://repo.cloudbees.com/content/repositories/central/org/apache/karaf/assemblies/features/standard/2.3.11/standard-2.3.11-features.xml (38 KB at 1807.4 KB/sec)
[INFO] Copying bundle: org.apache.karaf.assemblies.features:enterprise:xml:features:2.3.11
Downloading: https://repo.cloudbees.com/content/repositories/central/org/apache/karaf/assemblies/features/enterprise/2.3.11/enterprise-2.3.11-features.xml
Downloaded: https://repo.cloudbees.com/content/repositories/central/org/apache/karaf/assemblies/features/enterprise/2.3.11/enterprise-2.3.11-features.xml (20 KB at 1004.9 KB/sec)
[INFO] Copying bundle: org.apache.karaf.assemblies.features:enterprise:xml:features:2.3.11
[INFO] Copying bundle: org.ops4j.pax.cdi:pax-cdi-features:xml:features:0.8.0
Downloading: https://repo.cloudbees.com/content/repositories/central/org/ops4j/pax/cdi/pax-cdi-features/0.8.0/pax-cdi-features-0.8.0-features.xml
Downloaded: https://repo.cloudbees.com/content/repositories/central/org/ops4j/pax/cdi/pax-cdi-features/0.8.0/pax-cdi-features-0.8.0-features.xml (11 KB at 552.3 KB/sec)
[INFO] Copying bundle: org.apache.karaf.assemblies.features:standard:xml:features:2.3.11
[INFO] Copying bundle: org.apache.karaf.assemblies.features:standard:xml:features:2.3.11
[INFO] Copying bundle: org.apache.jclouds.karaf:jclouds-karaf:xml:features:2.1.0-SNAPSHOT
Downloading: https://repository.apache.org/content/repositories/snapshots/org/apache/jclouds/karaf/jclouds-karaf/2.1.0-SNAPSHOT/maven-metadata.xml
Downloading: http://repository.apache.org/snapshots/org/apache/jclouds/karaf/jclouds-karaf/2.1.0-SNAPSHOT/maven-metadata.xml
Downloading: https://repository-jclouds.forge.cloudbees.com/snapshot/org/apache/jclouds/karaf/jclouds-karaf/2.1.0-SNAPSHOT/maven-metadata.xml
Downloaded: https://repository.apache.org/content/repositories/snapshots/org/apache/jclouds/karaf/jclouds-karaf/2.1.0-SNAPSHOT/maven-metadata.xml (2 KB at 26.9 KB/sec)
Downloaded: http://repository.apache.org/snapshots/org/apache/jclouds/karaf/jclouds-karaf/2.1.0-SNAPSHOT/maven-metadata.xml (2 KB at 19.1 KB/sec)
Started calculate disk usage of build
Finished Calculation of disk usage of build in 0 seconds
Started calculate disk usage of workspace
Finished Calculation of disk usage of workspace in 0 seconds
[INFO] ------------------------------------------------------------------------
[INFO] Reactor Summary:
[INFO] 
[INFO] Apache jclouds :: cli ............................. SUCCESS [11.574s]
[INFO] jclouds :: cli :: branding ........................ SUCCESS [4.038s]
[INFO] jclouds :: cli :: runner .......................... SUCCESS [29.247s]
[INFO] jclouds :: cli :: assembly ........................ FAILURE [18.787s]
[INFO] Apache jclouds :: cli ............................. SKIPPED
[INFO] ------------------------------------------------------------------------
[INFO] BUILD FAILURE
[INFO] ------------------------------------------------------------------------
[INFO] Total time: 1:08.029s
[INFO] Finished at: Thu May 11 08:09:45 EDT 2017
[INFO] Final Memory: 51M/240M
[INFO] ------------------------------------------------------------------------
Waiting for Jenkins to finish collecting data
[ERROR] Failed to execute goal org.apache.karaf.tooling:features-maven-plugin:2.3.11:add-features-to-repo (add-features-to-repo) on project jclouds-cli-assembly: Error populating repository: Unable to find the feature 'shell-compat' -> [Help 1]
org.apache.maven.lifecycle.LifecycleExecutionException: Failed to execute goal org.apache.karaf.tooling:features-maven-plugin:2.3.11:add-features-to-repo (add-features-to-repo) on project jclouds-cli-assembly: Error populating repository
	at org.apache.maven.lifecycle.internal.MojoExecutor.execute(MojoExecutor.java:217)
	at org.apache.maven.lifecycle.internal.MojoExecutor.execute(MojoExecutor.java:153)
	at org.apache.maven.lifecycle.internal.MojoExecutor.execute(MojoExecutor.java:145)
	at org.apache.maven.lifecycle.internal.LifecycleModuleBuilder.buildProject(LifecycleModuleBuilder.java:84)
	at org.apache.maven.lifecycle.internal.LifecycleModuleBuilder.buildProject(LifecycleModuleBuilder.java:59)
	at org.apache.maven.lifecycle.internal.LifecycleStarter.singleThreadedBuild(LifecycleStarter.java:183)
	at org.apache.maven.lifecycle.internal.LifecycleStarter.execute(LifecycleStarter.java:161)
	at org.apache.maven.DefaultMaven.doExecute(DefaultMaven.java:320)
	at org.apache.maven.DefaultMaven.execute(DefaultMaven.java:156)
	at org.jvnet.hudson.maven3.launcher.Maven3Launcher.main(Maven3Launcher.java:117)
	at sun.reflect.NativeMethodAccessorImpl.invoke0(Native Method)
	at sun.reflect.NativeMethodAccessorImpl.invoke(NativeMethodAccessorImpl.java:57)
	at sun.reflect.DelegatingMethodAccessorImpl.invoke(DelegatingMethodAccessorImpl.java:43)
	at java.lang.reflect.Method.invoke(Method.java:606)
	at org.codehaus.plexus.classworlds.launcher.Launcher.launchStandard(Launcher.java:329)
	at org.codehaus.plexus.classworlds.launcher.Launcher.launch(Launcher.java:239)
	at org.jvnet.hudson.maven3.agent.Maven3Main.launch(Maven3Main.java:181)
	at sun.reflect.NativeMethodAccessorImpl.invoke0(Native Method)
	at sun.reflect.NativeMethodAccessorImpl.invoke(NativeMethodAccessorImpl.java:57)
	at sun.reflect.DelegatingMethodAccessorImpl.invoke(DelegatingMethodAccessorImpl.java:43)
	at java.lang.reflect.Method.invoke(Method.java:606)
	at hudson.maven.Maven3Builder.call(Maven3Builder.java:139)
	at hudson.maven.Maven3Builder.call(Maven3Builder.java:70)
	at hudson.remoting.UserRequest.perform(UserRequest.java:153)
	at hudson.remoting.UserRequest.perform(UserRequest.java:50)
	at hudson.remoting.Request$2.run(Request.java:336)
	at hudson.remoting.InterceptingExecutorService$1.call(InterceptingExecutorService.java:68)
	at java.util.concurrent.FutureTask.run(FutureTask.java:262)
	at java.util.concurrent.ThreadPoolExecutor.runWorker(ThreadPoolExecutor.java:1145)
	at java.util.concurrent.ThreadPoolExecutor$Worker.run(ThreadPoolExecutor.java:615)
	at java.lang.Thread.run(Thread.java:745)
Caused by: org.apache.maven.plugin.MojoExecutionException: Error populating repository
	at org.apache.karaf.tooling.features.AddFeaturesToRepoMojo.execute(AddFeaturesToRepoMojo.java:226)
	at org.apache.maven.plugin.DefaultBuildPluginManager.executeMojo(DefaultBuildPluginManager.java:101)
	at org.apache.maven.lifecycle.internal.MojoExecutor.execute(MojoExecutor.java:209)
	... 30 more
Caused by: java.lang.IllegalArgumentException: Unable to find the feature 'shell-compat'
	at org.apache.karaf.tooling.features.AddFeaturesToRepoMojo.addFeatures(AddFeaturesToRepoMojo.java:328)
	at org.apache.karaf.tooling.features.AddFeaturesToRepoMojo.addFeatures(AddFeaturesToRepoMojo.java:341)
	at org.apache.karaf.tooling.features.AddFeaturesToRepoMojo.execute(AddFeaturesToRepoMojo.java:165)
	... 32 more
[ERROR] 
[ERROR] Re-run Maven using the -X switch to enable full debug logging.
[ERROR] 
[ERROR] For more information about the errors and possible solutions, please read the following articles:
[ERROR] [Help 1] http://cwiki.apache.org/confluence/display/MAVEN/MojoExecutionException
[ERROR] 
[ERROR] After correcting the problems, you can resume the build with the command
[ERROR]   mvn <goals> -rf :jclouds-cli-assembly
[JENKINS] Archiving <https://jclouds.ci.cloudbees.com/job/jclouds-cli/ws/branding/pom.xml> to org.apache.jclouds.cli/jclouds-cli-branding/2.1.0-SNAPSHOT/jclouds-cli-branding-2.1.0-SNAPSHOT.pom
[JENKINS] Archiving <https://jclouds.ci.cloudbees.com/job/jclouds-cli/ws/branding/target/jclouds-cli-branding-2.1.0-SNAPSHOT.jar> to org.apache.jclouds.cli/jclouds-cli-branding/2.1.0-20170511.120855-101/jclouds-cli-branding-2.1.0-20170511.120855-101.jar
[JENKINS] Archiving <https://jclouds.ci.cloudbees.com/job/jclouds-cli/ws/branding/target/jclouds-cli-branding-2.1.0-SNAPSHOT-tests.jar> to org.apache.jclouds.cli/jclouds-cli-branding/2.1.0-20170511.120855-101/jclouds-cli-branding-2.1.0-20170511.120855-101-tests.jar
[JENKINS] Archiving <https://jclouds.ci.cloudbees.com/job/jclouds-cli/ws/branding/target/jclouds-cli-branding-2.1.0-SNAPSHOT-sources.jar> to org.apache.jclouds.cli/jclouds-cli-branding/2.1.0-20170511.120855-101/jclouds-cli-branding-2.1.0-20170511.120855-101-sources.jar
[JENKINS] Archiving <https://jclouds.ci.cloudbees.com/job/jclouds-cli/ws/branding/target/jclouds-cli-branding-2.1.0-SNAPSHOT-test-sources.jar> to org.apache.jclouds.cli/jclouds-cli-branding/2.1.0-20170511.120855-101/jclouds-cli-branding-2.1.0-20170511.120855-101-test-sources.jar
[JENKINS] Archiving <https://jclouds.ci.cloudbees.com/job/jclouds-cli/ws/assembly/pom.xml> to org.apache.jclouds.cli/jclouds-cli-assembly/2.1.0-SNAPSHOT/jclouds-cli-assembly-2.1.0-SNAPSHOT.pom
[JENKINS] Archiving <https://jclouds.ci.cloudbees.com/job/jclouds-cli/ws/pom.xml> to org.apache.jclouds.cli/jclouds-cli/2.1.0-SNAPSHOT/jclouds-cli-2.1.0-SNAPSHOT.pom
[JENKINS] Archiving <https://jclouds.ci.cloudbees.com/job/jclouds-cli/ws/runner/pom.xml> to org.apache.jclouds.cli/jclouds-cli-runner/2.1.0-SNAPSHOT/jclouds-cli-runner-2.1.0-SNAPSHOT.pom
[JENKINS] Archiving <https://jclouds.ci.cloudbees.com/job/jclouds-cli/ws/runner/target/jclouds-cli-runner-2.1.0-SNAPSHOT.jar> to org.apache.jclouds.cli/jclouds-cli-runner/2.1.0-20170511.120924-99/jclouds-cli-runner-2.1.0-20170511.120924-99.jar
[JENKINS] Archiving <https://jclouds.ci.cloudbees.com/job/jclouds-cli/ws/runner/target/jclouds-cli-runner-2.1.0-SNAPSHOT-tests.jar> to org.apache.jclouds.cli/jclouds-cli-runner/2.1.0-20170511.120924-99/jclouds-cli-runner-2.1.0-20170511.120924-99-tests.jar
[JENKINS] Archiving <https://jclouds.ci.cloudbees.com/job/jclouds-cli/ws/runner/target/jclouds-cli-runner-2.1.0-SNAPSHOT-javadoc.jar> to org.apache.jclouds.cli/jclouds-cli-runner/2.1.0-20170511.120924-99/jclouds-cli-runner-2.1.0-20170511.120924-99-javadoc.jar
[JENKINS] Archiving <https://jclouds.ci.cloudbees.com/job/jclouds-cli/ws/runner/target/jclouds-cli-runner-2.1.0-SNAPSHOT-sources.jar> to org.apache.jclouds.cli/jclouds-cli-runner/2.1.0-20170511.120924-99/jclouds-cli-runner-2.1.0-20170511.120924-99-sources.jar
[JENKINS] Archiving <https://jclouds.ci.cloudbees.com/job/jclouds-cli/ws/runner/target/jclouds-cli-runner-2.1.0-SNAPSHOT-test-sources.jar> to org.apache.jclouds.cli/jclouds-cli-runner/2.1.0-20170511.120924-99/jclouds-cli-runner-2.1.0-20170511.120924-99-test-sources.jar
[JENKINS] Archiving <https://jclouds.ci.cloudbees.com/job/jclouds-cli/ws/project/pom.xml> to org.apache.jclouds.cli/jclouds-cli-project/2.1.0-SNAPSHOT/jclouds-cli-project-2.1.0-SNAPSHOT.pom
[JENKINS] Archiving <https://jclouds.ci.cloudbees.com/job/jclouds-cli/ws/project/target/jclouds-cli-project-2.1.0-SNAPSHOT-tests.jar> to org.apache.jclouds.cli/jclouds-cli-project/2.1.0-20170511.120850-101/jclouds-cli-project-2.1.0-20170511.120850-101-tests.jar
channel stopped
Started calculate disk usage of build
Finished Calculation of disk usage of build in 0 seconds
Started calculate disk usage of workspace
Finished Calculation of disk usage of workspace in 0 seconds

Build failed in Jenkins: jclouds-cli #1346

Posted by je...@cloudbees.com.
See <https://jclouds.ci.cloudbees.com/job/jclouds-cli/1346/display/redirect>

------------------------------------------
[...truncated 60.62 KB...]
[INFO] 2 resources included (use -debug for more details)
Warning:  org.apache.xerces.jaxp.SAXParserImpl$JAXPSAXParser: Property 'http://www.oracle.com/xml/jaxp/properties/entityExpansionLimit' is not recognized.
Compiler warnings:
  WARNING:  'org.apache.xerces.jaxp.SAXParserImpl: Property 'http://javax.xml.XMLConstants/property/accessExternalDTD' is not recognized.'
Warning:  org.apache.xerces.parsers.SAXParser: Feature 'http://javax.xml.XMLConstants/feature/secure-processing' is not recognized.
Warning:  org.apache.xerces.parsers.SAXParser: Property 'http://javax.xml.XMLConstants/property/accessExternalDTD' is not recognized.
Warning:  org.apache.xerces.parsers.SAXParser: Property 'http://www.oracle.com/xml/jaxp/properties/entityExpansionLimit' is not recognized.
[INFO] Rat check: Summary of files. Unapproved: 0 unknown: 0 generated: 0 approved: 2 licence.
[INFO] 
[INFO] --- maven-jar-plugin:2.4:test-jar (default) @ jclouds-cli-runner ---
[INFO] Building jar: <https://jclouds.ci.cloudbees.com/job/jclouds-cli/ws/runner/target/jclouds-cli-runner-2.1.0-SNAPSHOT-tests.jar>
[INFO] 
[INFO] --- maven-javadoc-plugin:2.9:jar (javadoc) @ jclouds-cli-runner ---
[INFO] 
2 warnings
[WARNING] Javadoc Warnings
[WARNING] <https://jclouds.ci.cloudbees.com/job/jclouds-cli/ws/runner/src/main/java/org/jclouds/cli/runner/Main.java>:317: warning - @return tag has no arguments.
[WARNING] <https://jclouds.ci.cloudbees.com/job/jclouds-cli/ws/runner/src/main/java/org/jclouds/cli/runner/Main.java>:327: warning - @return tag has no arguments.
[INFO] Building jar: <https://jclouds.ci.cloudbees.com/job/jclouds-cli/ws/runner/target/jclouds-cli-runner-2.1.0-SNAPSHOT-javadoc.jar>
[INFO] 
[INFO] --- maven-source-plugin:2.2:jar-no-fork (attach-sources) @ jclouds-cli-runner ---
[INFO] Building jar: <https://jclouds.ci.cloudbees.com/job/jclouds-cli/ws/runner/target/jclouds-cli-runner-2.1.0-SNAPSHOT-sources.jar>
[INFO] 
[INFO] --- maven-source-plugin:2.2:test-jar-no-fork (attach-sources) @ jclouds-cli-runner ---
[INFO] Building jar: <https://jclouds.ci.cloudbees.com/job/jclouds-cli/ws/runner/target/jclouds-cli-runner-2.1.0-SNAPSHOT-test-sources.jar>
[INFO] 
[INFO] --- maven-surefire-plugin:2.17:test (integration) @ jclouds-cli-runner ---
[JENKINS] Recording test results[INFO] 
[INFO] --- duplicate-finder-maven-plugin:1.1.1:check (default) @ jclouds-cli-runner ---

[INFO] Skipping duplicate-finder execution!
[INFO] 
[INFO] --- maven-checkstyle-plugin:2.15:check (default) @ jclouds-cli-runner ---
[INFO] 
[INFO] --- modernizer-maven-plugin:1.4.0:modernizer (modernizer) @ jclouds-cli-runner ---
[INFO] 
[INFO] --- maven-install-plugin:2.4:install (default-install) @ jclouds-cli-runner ---
[INFO] Installing <https://jclouds.ci.cloudbees.com/job/jclouds-cli/ws/runner/target/jclouds-cli-runner-2.1.0-SNAPSHOT.jar> to /home/jenkins/.m2/repository/org/apache/jclouds/cli/jclouds-cli-runner/2.1.0-SNAPSHOT/jclouds-cli-runner-2.1.0-SNAPSHOT.jar
[INFO] Installing <https://jclouds.ci.cloudbees.com/job/jclouds-cli/ws/runner/pom.xml> to /home/jenkins/.m2/repository/org/apache/jclouds/cli/jclouds-cli-runner/2.1.0-SNAPSHOT/jclouds-cli-runner-2.1.0-SNAPSHOT.pom
[INFO] Installing <https://jclouds.ci.cloudbees.com/job/jclouds-cli/ws/runner/target/jclouds-cli-runner-2.1.0-SNAPSHOT-tests.jar> to /home/jenkins/.m2/repository/org/apache/jclouds/cli/jclouds-cli-runner/2.1.0-SNAPSHOT/jclouds-cli-runner-2.1.0-SNAPSHOT-tests.jar
[INFO] Installing <https://jclouds.ci.cloudbees.com/job/jclouds-cli/ws/runner/target/jclouds-cli-runner-2.1.0-SNAPSHOT-javadoc.jar> to /home/jenkins/.m2/repository/org/apache/jclouds/cli/jclouds-cli-runner/2.1.0-SNAPSHOT/jclouds-cli-runner-2.1.0-SNAPSHOT-javadoc.jar
[INFO] Installing <https://jclouds.ci.cloudbees.com/job/jclouds-cli/ws/runner/target/jclouds-cli-runner-2.1.0-SNAPSHOT-sources.jar> to /home/jenkins/.m2/repository/org/apache/jclouds/cli/jclouds-cli-runner/2.1.0-SNAPSHOT/jclouds-cli-runner-2.1.0-SNAPSHOT-sources.jar
[INFO] Installing <https://jclouds.ci.cloudbees.com/job/jclouds-cli/ws/runner/target/jclouds-cli-runner-2.1.0-SNAPSHOT-test-sources.jar> to /home/jenkins/.m2/repository/org/apache/jclouds/cli/jclouds-cli-runner/2.1.0-SNAPSHOT/jclouds-cli-runner-2.1.0-SNAPSHOT-test-sources.jar
[INFO] 
[INFO] --- maven-deploy-plugin:2.7:deploy (default-deploy) @ jclouds-cli-runner ---
Downloading: https://repository.apache.org/content/repositories/snapshots/org/apache/jclouds/cli/jclouds-cli-runner/2.1.0-SNAPSHOT/maven-metadata.xml
Downloaded: https://repository.apache.org/content/repositories/snapshots/org/apache/jclouds/cli/jclouds-cli-runner/2.1.0-SNAPSHOT/maven-metadata.xml (2 KB at 11.6 KB/sec)
Uploading: https://repository.apache.org/content/repositories/snapshots/org/apache/jclouds/cli/jclouds-cli-runner/2.1.0-SNAPSHOT/jclouds-cli-runner-2.1.0-20170511.000902-98.jar
Uploaded: https://repository.apache.org/content/repositories/snapshots/org/apache/jclouds/cli/jclouds-cli-runner/2.1.0-SNAPSHOT/jclouds-cli-runner-2.1.0-20170511.000902-98.jar (20 KB at 185.9 KB/sec)
Uploading: https://repository.apache.org/content/repositories/snapshots/org/apache/jclouds/cli/jclouds-cli-runner/2.1.0-SNAPSHOT/jclouds-cli-runner-2.1.0-20170511.000902-98.pom
Uploaded: https://repository.apache.org/content/repositories/snapshots/org/apache/jclouds/cli/jclouds-cli-runner/2.1.0-SNAPSHOT/jclouds-cli-runner-2.1.0-20170511.000902-98.pom (3 KB at 24.6 KB/sec)
Downloading: https://repository.apache.org/content/repositories/snapshots/org/apache/jclouds/cli/jclouds-cli-runner/maven-metadata.xml
Downloaded: https://repository.apache.org/content/repositories/snapshots/org/apache/jclouds/cli/jclouds-cli-runner/maven-metadata.xml (440 B at 10.5 KB/sec)
Uploading: https://repository.apache.org/content/repositories/snapshots/org/apache/jclouds/cli/jclouds-cli-runner/2.1.0-SNAPSHOT/maven-metadata.xml
Uploaded: https://repository.apache.org/content/repositories/snapshots/org/apache/jclouds/cli/jclouds-cli-runner/2.1.0-SNAPSHOT/maven-metadata.xml (2 KB at 21.0 KB/sec)
Uploading: https://repository.apache.org/content/repositories/snapshots/org/apache/jclouds/cli/jclouds-cli-runner/maven-metadata.xml
Uploaded: https://repository.apache.org/content/repositories/snapshots/org/apache/jclouds/cli/jclouds-cli-runner/maven-metadata.xml (440 B at 5.6 KB/sec)
Uploading: https://repository.apache.org/content/repositories/snapshots/org/apache/jclouds/cli/jclouds-cli-runner/2.1.0-SNAPSHOT/jclouds-cli-runner-2.1.0-20170511.000902-98-tests.jar
Uploaded: https://repository.apache.org/content/repositories/snapshots/org/apache/jclouds/cli/jclouds-cli-runner/2.1.0-SNAPSHOT/jclouds-cli-runner-2.1.0-20170511.000902-98-tests.jar (9 KB at 102.8 KB/sec)
Uploading: https://repository.apache.org/content/repositories/snapshots/org/apache/jclouds/cli/jclouds-cli-runner/2.1.0-SNAPSHOT/maven-metadata.xml
Uploaded: https://repository.apache.org/content/repositories/snapshots/org/apache/jclouds/cli/jclouds-cli-runner/2.1.0-SNAPSHOT/maven-metadata.xml (2 KB at 22.2 KB/sec)
Uploading: https://repository.apache.org/content/repositories/snapshots/org/apache/jclouds/cli/jclouds-cli-runner/2.1.0-SNAPSHOT/jclouds-cli-runner-2.1.0-20170511.000902-98-javadoc.jar
Uploaded: https://repository.apache.org/content/repositories/snapshots/org/apache/jclouds/cli/jclouds-cli-runner/2.1.0-SNAPSHOT/jclouds-cli-runner-2.1.0-20170511.000902-98-javadoc.jar (47 KB at 537.1 KB/sec)
Uploading: https://repository.apache.org/content/repositories/snapshots/org/apache/jclouds/cli/jclouds-cli-runner/2.1.0-SNAPSHOT/maven-metadata.xml
Uploaded: https://repository.apache.org/content/repositories/snapshots/org/apache/jclouds/cli/jclouds-cli-runner/2.1.0-SNAPSHOT/maven-metadata.xml (2 KB at 14.2 KB/sec)
Uploading: https://repository.apache.org/content/repositories/snapshots/org/apache/jclouds/cli/jclouds-cli-runner/2.1.0-SNAPSHOT/jclouds-cli-runner-2.1.0-20170511.000902-98-sources.jar
Uploaded: https://repository.apache.org/content/repositories/snapshots/org/apache/jclouds/cli/jclouds-cli-runner/2.1.0-SNAPSHOT/jclouds-cli-runner-2.1.0-20170511.000902-98-sources.jar (13 KB at 114.5 KB/sec)
Uploading: https://repository.apache.org/content/repositories/snapshots/org/apache/jclouds/cli/jclouds-cli-runner/2.1.0-SNAPSHOT/maven-metadata.xml
Uploaded: https://repository.apache.org/content/repositories/snapshots/org/apache/jclouds/cli/jclouds-cli-runner/2.1.0-SNAPSHOT/maven-metadata.xml (2 KB at 21.9 KB/sec)
Uploading: https://repository.apache.org/content/repositories/snapshots/org/apache/jclouds/cli/jclouds-cli-runner/2.1.0-SNAPSHOT/jclouds-cli-runner-2.1.0-20170511.000902-98-test-sources.jar
Uploaded: https://repository.apache.org/content/repositories/snapshots/org/apache/jclouds/cli/jclouds-cli-runner/2.1.0-SNAPSHOT/jclouds-cli-runner-2.1.0-20170511.000902-98-test-sources.jar (7 KB at 86.7 KB/sec)
Uploading: https://repository.apache.org/content/repositories/snapshots/org/apache/jclouds/cli/jclouds-cli-runner/2.1.0-SNAPSHOT/maven-metadata.xml
Uploaded: https://repository.apache.org/content/repositories/snapshots/org/apache/jclouds/cli/jclouds-cli-runner/2.1.0-SNAPSHOT/maven-metadata.xml (2 KB at 22.2 KB/sec)
Started calculate disk usage of build
Finished Calculation of disk usage of build in 0 seconds
Started calculate disk usage of workspace
Finished Calculation of disk usage of workspace in 0 seconds
[INFO]                                                                         
[INFO] ------------------------------------------------------------------------
[INFO] Building jclouds :: cli :: assembly 2.1.0-SNAPSHOT
[INFO] ------------------------------------------------------------------------
[INFO] 
[INFO] --- maven-clean-plugin:2.5:clean (default-clean) @ jclouds-cli-assembly ---
[INFO] 
[INFO] --- maven-enforcer-plugin:1.1.1:enforce (enforce-banned-dependencies) @ jclouds-cli-assembly ---
[INFO] 
[INFO] --- maven-enforcer-plugin:1.1.1:enforce (enforce-java) @ jclouds-cli-assembly ---
[INFO] 
[INFO] --- maven-remote-resources-plugin:1.5:process (default) @ jclouds-cli-assembly ---
[INFO] 
[INFO] --- maven-resources-plugin:2.4.2:resources (filter) @ jclouds-cli-assembly ---
[INFO] Using 'UTF-8' encoding to copy filtered resources.
[INFO] skip non existing resourceDirectory <https://jclouds.ci.cloudbees.com/job/jclouds-cli/ws/assembly/src/main/resources>
[INFO] Copying 13 resources
[INFO] Copying 3 resources
[INFO] 
[INFO] --- maven-dependency-plugin:2.8:unpack (unpack-unix) @ jclouds-cli-assembly ---
[INFO] Configured Artifact: org.apache.karaf:apache-karaf:minimal:2.3.11:tar.gz
[INFO] Unpacking /home/jenkins/.m2/repository/org/apache/karaf/apache-karaf/2.3.11/apache-karaf-2.3.11-minimal.tar.gz to <https://jclouds.ci.cloudbees.com/job/jclouds-cli/ws/assembly/target/dependencies/unix> with includes "" and excludes ""
[INFO] Expanding: /home/jenkins/.m2/repository/org/apache/karaf/apache-karaf/2.3.11/apache-karaf-2.3.11-minimal.tar.gz into <https://jclouds.ci.cloudbees.com/job/jclouds-cli/ws/assembly/target/dependencies/unix>
[INFO] 
[INFO] --- maven-dependency-plugin:2.8:unpack (unpack-win) @ jclouds-cli-assembly ---
[INFO] Configured Artifact: org.apache.karaf:apache-karaf:minimal:2.3.11:zip
[INFO] Unpacking /home/jenkins/.m2/repository/org/apache/karaf/apache-karaf/2.3.11/apache-karaf-2.3.11-minimal.zip to <https://jclouds.ci.cloudbees.com/job/jclouds-cli/ws/assembly/target/dependencies/win> with includes "" and excludes ""
[INFO] 
[INFO] --- maven-resources-plugin:2.4.2:resources (default-resources) @ jclouds-cli-assembly ---
[INFO] Using 'UTF-8' encoding to copy filtered resources.
[INFO] skip non existing resourceDirectory <https://jclouds.ci.cloudbees.com/job/jclouds-cli/ws/assembly/src/main/resources>
[INFO] Copying 13 resources
[INFO] Copying 3 resources
[INFO] 
[INFO] --- maven-compiler-plugin:3.1:compile (default-compile) @ jclouds-cli-assembly ---
[INFO] No sources to compile
[INFO] 
[INFO] --- maven-enforcer-plugin:1.1.1:enforce (enforce-banned-dependencies) @ jclouds-cli-assembly ---
[INFO] 
[INFO] --- maven-enforcer-plugin:1.1.1:enforce (enforce-java) @ jclouds-cli-assembly ---
[INFO] 
[INFO] --- maven-remote-resources-plugin:1.5:process (default) @ jclouds-cli-assembly ---
[INFO] 
[INFO] --- maven-resources-plugin:2.4.2:resources (filter) @ jclouds-cli-assembly ---
[INFO] Using 'UTF-8' encoding to copy filtered resources.
[INFO] skip non existing resourceDirectory <https://jclouds.ci.cloudbees.com/job/jclouds-cli/ws/assembly/src/main/resources>
[INFO] Copying 13 resources
[INFO] Copying 3 resources
[INFO] Copying 3 resources
[INFO] 
[INFO] --- maven-dependency-plugin:2.8:unpack (unpack-unix) @ jclouds-cli-assembly ---
[INFO] Configured Artifact: org.apache.karaf:apache-karaf:minimal:2.3.11:tar.gz
[INFO] apache-karaf-2.3.11-minimal.tar.gz already unpacked.
[INFO] 
[INFO] --- maven-dependency-plugin:2.8:unpack (unpack-win) @ jclouds-cli-assembly ---
[INFO] Configured Artifact: org.apache.karaf:apache-karaf:minimal:2.3.11:zip
[INFO] apache-karaf-2.3.11-minimal.zip already unpacked.
[INFO] 
[INFO] --- maven-resources-plugin:2.4.2:resources (default-resources) @ jclouds-cli-assembly ---
[INFO] Using 'UTF-8' encoding to copy filtered resources.
[INFO] skip non existing resourceDirectory <https://jclouds.ci.cloudbees.com/job/jclouds-cli/ws/assembly/src/main/resources>
[INFO] Copying 13 resources
[INFO] Copying 3 resources
[INFO] Copying 3 resources
[INFO] 
[INFO] --- maven-compiler-plugin:3.1:compile (default-compile) @ jclouds-cli-assembly ---
[INFO] No sources to compile
[WARNING] Failed to getClass for org.apache.karaf.tooling.features.AddFeaturesToRepoMojo
[INFO] 
[INFO] --- features-maven-plugin:2.3.11:add-features-to-repo (add-features-to-repo) @ jclouds-cli-assembly ---
[INFO] Copying bundle: org.apache.karaf.assemblies.features:standard:xml:features:2.3.11
[INFO] Copying bundle: org.apache.karaf.assemblies.features:enterprise:xml:features:2.3.11
[INFO] Copying bundle: org.apache.karaf.assemblies.features:enterprise:xml:features:2.3.11
[INFO] Copying bundle: org.ops4j.pax.cdi:pax-cdi-features:xml:features:0.8.0
[INFO] Copying bundle: org.apache.karaf.assemblies.features:standard:xml:features:2.3.11
[INFO] Copying bundle: org.apache.karaf.assemblies.features:standard:xml:features:2.3.11
[INFO] Copying bundle: org.apache.jclouds.karaf:jclouds-karaf:xml:features:2.1.0-SNAPSHOT
Downloading: https://repository-jclouds.forge.cloudbees.com/snapshot/org/apache/jclouds/karaf/jclouds-karaf/2.1.0-SNAPSHOT/maven-metadata.xml
Downloading: http://repository.apache.org/snapshots/org/apache/jclouds/karaf/jclouds-karaf/2.1.0-SNAPSHOT/maven-metadata.xml
Downloading: https://repository.apache.org/content/repositories/snapshots/org/apache/jclouds/karaf/jclouds-karaf/2.1.0-SNAPSHOT/maven-metadata.xml
Downloaded: http://repository.apache.org/snapshots/org/apache/jclouds/karaf/jclouds-karaf/2.1.0-SNAPSHOT/maven-metadata.xml (2 KB at 33.5 KB/sec)
Downloaded: https://repository.apache.org/content/repositories/snapshots/org/apache/jclouds/karaf/jclouds-karaf/2.1.0-SNAPSHOT/maven-metadata.xml (2 KB at 32.6 KB/sec)
Started calculate disk usage of build
Finished Calculation of disk usage of build in 0 seconds
Started calculate disk usage of workspace
Finished Calculation of disk usage of workspace in 0 seconds
[INFO] ------------------------------------------------------------------------
[INFO] Reactor Summary:
[INFO] 
[INFO] Apache jclouds :: cli ............................. SUCCESS [9.890s]
[INFO] jclouds :: cli :: branding ........................ SUCCESS [3.672s]
[INFO] jclouds :: cli :: runner .......................... SUCCESS [24.989s]
[INFO] jclouds :: cli :: assembly ........................ FAILURE [7.822s]
[INFO] Apache jclouds :: cli ............................. SKIPPED
[INFO] ------------------------------------------------------------------------
[INFO] BUILD FAILURE
[INFO] ------------------------------------------------------------------------
[INFO] Total time: 49.430s
[INFO] Finished at: Wed May 10 20:09:11 EDT 2017
[INFO] Final Memory: 50M/254M
[INFO] ------------------------------------------------------------------------
Waiting for Jenkins to finish collecting data
[ERROR] Failed to execute goal org.apache.karaf.tooling:features-maven-plugin:2.3.11:add-features-to-repo (add-features-to-repo) on project jclouds-cli-assembly: Error populating repository: Unable to find the feature 'jclouds-api-cloudsigma2' -> [Help 1]
org.apache.maven.lifecycle.LifecycleExecutionException: Failed to execute goal org.apache.karaf.tooling:features-maven-plugin:2.3.11:add-features-to-repo (add-features-to-repo) on project jclouds-cli-assembly: Error populating repository
	at org.apache.maven.lifecycle.internal.MojoExecutor.execute(MojoExecutor.java:217)
	at org.apache.maven.lifecycle.internal.MojoExecutor.execute(MojoExecutor.java:153)
	at org.apache.maven.lifecycle.internal.MojoExecutor.execute(MojoExecutor.java:145)
	at org.apache.maven.lifecycle.internal.LifecycleModuleBuilder.buildProject(LifecycleModuleBuilder.java:84)
	at org.apache.maven.lifecycle.internal.LifecycleModuleBuilder.buildProject(LifecycleModuleBuilder.java:59)
	at org.apache.maven.lifecycle.internal.LifecycleStarter.singleThreadedBuild(LifecycleStarter.java:183)
	at org.apache.maven.lifecycle.internal.LifecycleStarter.execute(LifecycleStarter.java:161)
	at org.apache.maven.DefaultMaven.doExecute(DefaultMaven.java:320)
	at org.apache.maven.DefaultMaven.execute(DefaultMaven.java:156)
	at org.jvnet.hudson.maven3.launcher.Maven3Launcher.main(Maven3Launcher.java:117)
	at sun.reflect.NativeMethodAccessorImpl.invoke0(Native Method)
	at sun.reflect.NativeMethodAccessorImpl.invoke(NativeMethodAccessorImpl.java:57)
	at sun.reflect.DelegatingMethodAccessorImpl.invoke(DelegatingMethodAccessorImpl.java:43)
	at java.lang.reflect.Method.invoke(Method.java:606)
	at org.codehaus.plexus.classworlds.launcher.Launcher.launchStandard(Launcher.java:329)
	at org.codehaus.plexus.classworlds.launcher.Launcher.launch(Launcher.java:239)
	at org.jvnet.hudson.maven3.agent.Maven3Main.launch(Maven3Main.java:181)
	at sun.reflect.NativeMethodAccessorImpl.invoke0(Native Method)
	at sun.reflect.NativeMethodAccessorImpl.invoke(NativeMethodAccessorImpl.java:57)
	at sun.reflect.DelegatingMethodAccessorImpl.invoke(DelegatingMethodAccessorImpl.java:43)
	at java.lang.reflect.Method.invoke(Method.java:606)
	at hudson.maven.Maven3Builder.call(Maven3Builder.java:139)
	at hudson.maven.Maven3Builder.call(Maven3Builder.java:70)
	at hudson.remoting.UserRequest.perform(UserRequest.java:153)
	at hudson.remoting.UserRequest.perform(UserRequest.java:50)
	at hudson.remoting.Request$2.run(Request.java:336)
	at hudson.remoting.InterceptingExecutorService$1.call(InterceptingExecutorService.java:68)
	at java.util.concurrent.FutureTask.run(FutureTask.java:262)
	at java.util.concurrent.ThreadPoolExecutor.runWorker(ThreadPoolExecutor.java:1145)
	at java.util.concurrent.ThreadPoolExecutor$Worker.run(ThreadPoolExecutor.java:615)
	at java.lang.Thread.run(Thread.java:745)
Caused by: org.apache.maven.plugin.MojoExecutionException: Error populating repository
	at org.apache.karaf.tooling.features.AddFeaturesToRepoMojo.execute(AddFeaturesToRepoMojo.java:226)
	at org.apache.maven.plugin.DefaultBuildPluginManager.executeMojo(DefaultBuildPluginManager.java:101)
	at org.apache.maven.lifecycle.internal.MojoExecutor.execute(MojoExecutor.java:209)
	... 30 more
Caused by: java.lang.IllegalArgumentException: Unable to find the feature 'jclouds-api-cloudsigma2'
	at org.apache.karaf.tooling.features.AddFeaturesToRepoMojo.addFeatures(AddFeaturesToRepoMojo.java:328)
	at org.apache.karaf.tooling.features.AddFeaturesToRepoMojo.execute(AddFeaturesToRepoMojo.java:165)
	... 32 more
[ERROR] 
[ERROR] Re-run Maven using the -X switch to enable full debug logging.
[ERROR] 
[ERROR] For more information about the errors and possible solutions, please read the following articles:
[ERROR] [Help 1] http://cwiki.apache.org/confluence/display/MAVEN/MojoExecutionException
[ERROR] 
[ERROR] After correcting the problems, you can resume the build with the command
[ERROR]   mvn <goals> -rf :jclouds-cli-assembly
[JENKINS] Archiving <https://jclouds.ci.cloudbees.com/job/jclouds-cli/ws/branding/pom.xml> to org.apache.jclouds.cli/jclouds-cli-branding/2.1.0-SNAPSHOT/jclouds-cli-branding-2.1.0-SNAPSHOT.pom
[JENKINS] Archiving <https://jclouds.ci.cloudbees.com/job/jclouds-cli/ws/branding/target/jclouds-cli-branding-2.1.0-SNAPSHOT.jar> to org.apache.jclouds.cli/jclouds-cli-branding/2.1.0-20170511.000837-100/jclouds-cli-branding-2.1.0-20170511.000837-100.jar
[JENKINS] Archiving <https://jclouds.ci.cloudbees.com/job/jclouds-cli/ws/branding/target/jclouds-cli-branding-2.1.0-SNAPSHOT-tests.jar> to org.apache.jclouds.cli/jclouds-cli-branding/2.1.0-20170511.000837-100/jclouds-cli-branding-2.1.0-20170511.000837-100-tests.jar
[JENKINS] Archiving <https://jclouds.ci.cloudbees.com/job/jclouds-cli/ws/branding/target/jclouds-cli-branding-2.1.0-SNAPSHOT-sources.jar> to org.apache.jclouds.cli/jclouds-cli-branding/2.1.0-20170511.000837-100/jclouds-cli-branding-2.1.0-20170511.000837-100-sources.jar
[JENKINS] Archiving <https://jclouds.ci.cloudbees.com/job/jclouds-cli/ws/branding/target/jclouds-cli-branding-2.1.0-SNAPSHOT-test-sources.jar> to org.apache.jclouds.cli/jclouds-cli-branding/2.1.0-20170511.000837-100/jclouds-cli-branding-2.1.0-20170511.000837-100-test-sources.jar
[JENKINS] Archiving <https://jclouds.ci.cloudbees.com/job/jclouds-cli/ws/assembly/pom.xml> to org.apache.jclouds.cli/jclouds-cli-assembly/2.1.0-SNAPSHOT/jclouds-cli-assembly-2.1.0-SNAPSHOT.pom
[JENKINS] Archiving <https://jclouds.ci.cloudbees.com/job/jclouds-cli/ws/pom.xml> to org.apache.jclouds.cli/jclouds-cli/2.1.0-SNAPSHOT/jclouds-cli-2.1.0-SNAPSHOT.pom
[JENKINS] Archiving <https://jclouds.ci.cloudbees.com/job/jclouds-cli/ws/runner/pom.xml> to org.apache.jclouds.cli/jclouds-cli-runner/2.1.0-SNAPSHOT/jclouds-cli-runner-2.1.0-SNAPSHOT.pom
[JENKINS] Archiving <https://jclouds.ci.cloudbees.com/job/jclouds-cli/ws/runner/target/jclouds-cli-runner-2.1.0-SNAPSHOT.jar> to org.apache.jclouds.cli/jclouds-cli-runner/2.1.0-20170511.000902-98/jclouds-cli-runner-2.1.0-20170511.000902-98.jar
[JENKINS] Archiving <https://jclouds.ci.cloudbees.com/job/jclouds-cli/ws/runner/target/jclouds-cli-runner-2.1.0-SNAPSHOT-tests.jar> to org.apache.jclouds.cli/jclouds-cli-runner/2.1.0-20170511.000902-98/jclouds-cli-runner-2.1.0-20170511.000902-98-tests.jar
[JENKINS] Archiving <https://jclouds.ci.cloudbees.com/job/jclouds-cli/ws/runner/target/jclouds-cli-runner-2.1.0-SNAPSHOT-javadoc.jar> to org.apache.jclouds.cli/jclouds-cli-runner/2.1.0-20170511.000902-98/jclouds-cli-runner-2.1.0-20170511.000902-98-javadoc.jar
[JENKINS] Archiving <https://jclouds.ci.cloudbees.com/job/jclouds-cli/ws/runner/target/jclouds-cli-runner-2.1.0-SNAPSHOT-sources.jar> to org.apache.jclouds.cli/jclouds-cli-runner/2.1.0-20170511.000902-98/jclouds-cli-runner-2.1.0-20170511.000902-98-sources.jar
[JENKINS] Archiving <https://jclouds.ci.cloudbees.com/job/jclouds-cli/ws/runner/target/jclouds-cli-runner-2.1.0-SNAPSHOT-test-sources.jar> to org.apache.jclouds.cli/jclouds-cli-runner/2.1.0-20170511.000902-98/jclouds-cli-runner-2.1.0-20170511.000902-98-test-sources.jar
[JENKINS] Archiving <https://jclouds.ci.cloudbees.com/job/jclouds-cli/ws/project/pom.xml> to org.apache.jclouds.cli/jclouds-cli-project/2.1.0-SNAPSHOT/jclouds-cli-project-2.1.0-SNAPSHOT.pom
[JENKINS] Archiving <https://jclouds.ci.cloudbees.com/job/jclouds-cli/ws/project/target/jclouds-cli-project-2.1.0-SNAPSHOT-tests.jar> to org.apache.jclouds.cli/jclouds-cli-project/2.1.0-20170511.000833-100/jclouds-cli-project-2.1.0-20170511.000833-100-tests.jar
channel stopped
Started calculate disk usage of build
Finished Calculation of disk usage of build in 0 seconds
Started calculate disk usage of workspace
Finished Calculation of disk usage of workspace in 0 seconds