You are viewing a plain text version of this content. The canonical link for it is here.
Posted to builds@cassandra.apache.org by Apache Jenkins Server <je...@builds.apache.org> on 2026/02/18 13:09:35 UTC

Build complete: Cassandra-5.0 #558 [ABORTED] 32154eebcd2e62c73f3d3a8edf62284000c742c7

-------------------------------------------------------------------------------
  Build Cassandra-5.0 #558 Aborted
  URL: https://ci-cassandra.apache.org/job/Cassandra-5.0/558/
  -------------------------------------------------------------------------------
  Changes:
  [Caleb Rackliffe] Optionally force IndexStatusManager to use the optimized index status


  -------------------------------------------------------------------------------
  Failed Tests:
  8 tests failed.
FAILED:  dtest-latest.materialized_views_test.TestMaterializedViews.Tests / dtest-latest jdk11 63/64 / test_drop_with_stopped_build
FAILED:  dtest-latest.secondary_indexes_test.TestSecondaryIndexes.Tests / dtest-latest jdk11 63/64 / test_6924_dropping_ks
FAILED:  dtest-novnode.materialized_views_test.TestMaterializedViews.Tests / dtest-novnode jdk11 52/64 / test_drop_mv
FAILED:  dtest-upgrade.upgrade_tests.paging_test.TestPagingDataNodes2RF1_Upgrade_indev_4_0_x_To_indev_5_0_x.Tests / dtest-upgrade jdk11 89/128 / test_paging_using_secondary_indexes_with_static_cols
FAILED:  dtest.bootstrap_test.TestBootstrap.Tests / dtest jdk17 13/64 / test_shutdown_wiped_node_cannot_join
FAILED:  dtest.materialized_views_test.TestMaterializedViews.Tests / dtest jdk11 17/64 / test_complex_mv_select_statements
FAILED:  org.apache.cassandra.db.commitlog.CommitLogSegmentManagerCDCTest.Tests / test-latest jdk17 2/16 / testSegmentFlaggingWithNonblockingOnCreation-latest_jdk17_x86_64
FAILED:  dtest-latest.repair_tests.repair_test.TestRepair.Tests / dtest-latest jdk17 11/64 / test_dead_sync_participant

  -------------------------------------------------------------------------------
  For complete test report and logs see https://nightlies.apache.org/cassandra/Cassandra-5.0/558/