You are viewing a plain text version of this content. The canonical link for it is here.
Posted to yarn-dev@hadoop.apache.org by Apache Jenkins Server <je...@builds.apache.org> on 2015/03/13 10:30:35 UTC
Failed: YARN-3273 PreCommit Build #6953
Jira: https://issues.apache.org/jira/browse/YARN-3273
Build: https://builds.apache.org/job/PreCommit-YARN-Build/6953/
###################################################################################
########################## LAST 60 LINES OF THE CONSOLE ###########################
[...truncated 26 lines...]
Testing patch for YARN-3273.
======================================================================
======================================================================
HEAD is now at 387f271 HADOOP-11711. Provide a default value for AES/CTR/NoPadding CryptoCodec classes.
Previous HEAD position was 387f271... HADOOP-11711. Provide a default value for AES/CTR/NoPadding CryptoCodec classes.
Switched to branch 'trunk'
Your branch is behind 'origin/trunk' by 2 commits, and can be fast-forwarded.
(use "git pull" to update your local branch)
First, rewinding head to replay your work on top of it...
Fast-forwarded trunk to 387f271c81f7b3bf53bddc5368d5f4486530c2e1.
YARN-3273 patch is being downloaded at Fri Mar 13 09:30:29 UTC 2015 from
http://issues.apache.org/jira/secure/attachment/12704390/YARN-3273-application-headroom-v2.PNG
cp: cannot stat '/home/jenkins/buildSupport/lib/*': No such file or directory
patch: **** Only garbage was found in the patch input.
patch: **** Only garbage was found in the patch input.
patch: **** Only garbage was found in the patch input.
The patch does not appear to apply with p0 to p2
PATCH APPLICATION FAILED
{color:red}-1 overall{color}. Here are the results of testing the latest attachment
http://issues.apache.org/jira/secure/attachment/12704390/YARN-3273-application-headroom-v2.PNG
against trunk revision 387f271.
{color:red}-1 patch{color}. The patch command could not apply the patch.
Console output: https://builds.apache.org/job/PreCommit-YARN-Build/6953//console
This message is automatically generated.
======================================================================
======================================================================
Adding comment to Jira.
======================================================================
======================================================================
Comment added.
58e61ca74dfde89e80494e6378a8d3a62006b359 logged out
======================================================================
======================================================================
Finished build.
======================================================================
======================================================================
Build step 'Execute shell' marked build as failure
Archiving artifacts
[description-setter] Could not determine description.
Recording test results
Email was triggered for: Failure
Sending email for trigger: Failure
###################################################################################
############################## FAILED TESTS (if any) ##############################
No tests ran.
Success: YARN-3291 PreCommit Build #6957
Posted by Apache Jenkins Server <je...@builds.apache.org>.
Jira: https://issues.apache.org/jira/browse/YARN-3291
Build: https://builds.apache.org/job/PreCommit-YARN-Build/6957/
###################################################################################
########################## LAST 60 LINES OF THE CONSOLE ###########################
[...truncated 3545 lines...]
{color:green}+1 overall{color}. Here are the results of testing the latest attachment
http://issues.apache.org/jira/secure/attachment/12704462/YARN-3291.patch
against trunk revision f446669.
{color:green}+1 @author{color}. The patch does not contain any @author tags.
{color:green}+1 tests included{color}. The patch appears to include 4 new or modified test files.
{color:green}+1 javac{color}. The applied patch does not increase the total number of javac compiler warnings.
{color:green}+1 javadoc{color}. There were no new javadoc warning messages.
{color:green}+1 eclipse:eclipse{color}. The patch built with eclipse:eclipse.
{color:green}+1 findbugs{color}. The patch does not introduce any new Findbugs (version 2.0.3) warnings.
{color:green}+1 release audit{color}. The applied patch does not increase the total number of release audit warnings.
{color:green}+1 core tests{color}. The patch passed unit tests in hadoop-yarn-project/hadoop-yarn/hadoop-yarn-api hadoop-yarn-project/hadoop-yarn/hadoop-yarn-server/hadoop-yarn-server-nodemanager.
Test results: https://builds.apache.org/job/PreCommit-YARN-Build/6957//testReport/
Console output: https://builds.apache.org/job/PreCommit-YARN-Build/6957//console
This message is automatically generated.
======================================================================
======================================================================
Adding comment to Jira.
======================================================================
======================================================================
Comment added.
3c4adc92904560ba9a2636b5bc08bf2cf6cec786 logged out
======================================================================
======================================================================
Finished build.
======================================================================
======================================================================
Archiving artifacts
Sending artifact delta relative to PreCommit-YARN-Build #6947
Archived 20 artifacts
Archive block size is 32768
Received 58 blocks and 7425616 bytes
Compression is 20.4%
Took 1.6 sec
Description set: YARN-3291
Recording test results
Email was triggered for: Success
Sending email for trigger: Success
###################################################################################
############################## FAILED TESTS (if any) ##############################
All tests passed
Failed: YARN-2854 PreCommit Build #6956
Posted by Apache Jenkins Server <je...@builds.apache.org>.
Jira: https://issues.apache.org/jira/browse/YARN-2854
Build: https://builds.apache.org/job/PreCommit-YARN-Build/6956/
###################################################################################
########################## LAST 60 LINES OF THE CONSOLE ###########################
[...truncated 3127 lines...]
{color:red}-1 overall{color}. Here are the results of testing the latest attachment
http://issues.apache.org/jira/secure/attachment/12704461/YARN-2854.20150313-1.patch
against trunk revision 8180e67.
{color:green}+1 @author{color}. The patch does not contain any @author tags.
{color:red}-1 tests included{color}. The patch doesn't appear to include any new or modified tests.
Please justify why no new tests are needed for this patch.
Also please list what manual steps were performed to verify this patch.
{color:green}+1 javac{color}. The applied patch does not increase the total number of javac compiler warnings.
{color:green}+1 javadoc{color}. There were no new javadoc warning messages.
{color:green}+1 eclipse:eclipse{color}. The patch built with eclipse:eclipse.
{color:green}+1 findbugs{color}. The patch does not introduce any new Findbugs (version 2.0.3) warnings.
{color:green}+1 release audit{color}. The applied patch does not increase the total number of release audit warnings.
{color:green}+1 core tests{color}. The patch passed unit tests in .
Test results: https://builds.apache.org/job/PreCommit-YARN-Build/6956//testReport/
Console output: https://builds.apache.org/job/PreCommit-YARN-Build/6956//console
This message is automatically generated.
======================================================================
======================================================================
Adding comment to Jira.
======================================================================
======================================================================
Comment added.
0a6c484df0c1effea09af62c7e17bbf97c2eefb3 logged out
======================================================================
======================================================================
Finished build.
======================================================================
======================================================================
Build step 'Execute shell' marked build as failure
Archiving artifacts
Sending artifact delta relative to PreCommit-YARN-Build #6947
Archived 10 artifacts
Archive block size is 32768
Received 50 blocks and 7097666 bytes
Compression is 18.8%
Took 1.9 sec
[description-setter] Could not determine description.
Recording test results
Email was triggered for: Failure
Sending email for trigger: Failure
###################################################################################
############################## FAILED TESTS (if any) ##############################
No tests ran.
Failed: YARN-3305 PreCommit Build #6955
Posted by Apache Jenkins Server <je...@builds.apache.org>.
Jira: https://issues.apache.org/jira/browse/YARN-3305
Build: https://builds.apache.org/job/PreCommit-YARN-Build/6955/
###################################################################################
########################## LAST 60 LINES OF THE CONSOLE ###########################
[...truncated 3725 lines...]
{color:green}+1 javadoc{color}. There were no new javadoc warning messages.
{color:green}+1 eclipse:eclipse{color}. The patch built with eclipse:eclipse.
{color:red}-1 findbugs{color}. The patch appears to introduce 5 new Findbugs (version 2.0.3) warnings.
{color:green}+1 release audit{color}. The applied patch does not increase the total number of release audit warnings.
{color:red}-1 core tests{color}. The patch failed these unit tests in hadoop-yarn-project/hadoop-yarn/hadoop-yarn-server/hadoop-yarn-server-resourcemanager:
org.apache.hadoop.yarn.server.resourcemanager.TestRM
Test results: https://builds.apache.org/job/PreCommit-YARN-Build/6955//testReport/
Findbugs warnings: https://builds.apache.org/job/PreCommit-YARN-Build/6955//artifact/patchprocess/newPatchFindbugsWarningshadoop-yarn-server-resourcemanager.html
Console output: https://builds.apache.org/job/PreCommit-YARN-Build/6955//console
This message is automatically generated.
======================================================================
======================================================================
Adding comment to Jira.
======================================================================
======================================================================
Comment added.
8d98bead556e46d274aad005f1a0f84164eba65b logged out
======================================================================
======================================================================
Finished build.
======================================================================
======================================================================
Build step 'Execute shell' marked build as failure
Archiving artifacts
Sending artifact delta relative to PreCommit-YARN-Build #6947
ERROR: Failed to archive {patchprocess/patchJavacWarnings.txt=patchprocess/patchJavacWarnings.txt, patchprocess/patchJavadocWarnings.txt=patchprocess/patchJavadocWarnings.txt, patchprocess/newPatchFindbugsWarningshadoop-yarn-server-resourcemanager.xml=patchprocess/newPatchFindbugsWarningshadoop-yarn-server-resourcemanager.xml, patchprocess/trunkJavadocWarnings.txt=patchprocess/trunkJavadocWarnings.txt, patchprocess/patchFindBugsOutputhadoop-common.txt=patchprocess/patchFindBugsOutputhadoop-common.txt, patchprocess/patchFindbugsWarningshadoop-hdfs.xml=patchprocess/patchFindbugsWarningshadoop-hdfs.xml, patchprocess/newPatchFindbugsWarningshadoop-hdfs.html=patchprocess/newPatchFindbugsWarningshadoop-hdfs.html, patchprocess/testrun_hadoop-common.txt=patchprocess/testrun_hadoop-common.txt, patchprocess/diffJavadocWarnings.txt=patchprocess/diffJavadocWarnings.txt, patchprocess/newPatchFindbugsWarningshadoop-hdfs.xml=patchprocess/newPatchFindbugsWarningshadoop-hdfs.xml, patchprocess/patchFindBugsOutputhadoop-yarn-server-resourcemanager.txt=patchprocess/patchFindBugsOutputhadoop-yarn-server-resourcemanager.txt, patchprocess/patchFindBugsOutputhadoop-hdfs.txt=patchprocess/patchFindBugsOutputhadoop-hdfs.txt, patchprocess/trunkJavacWarnings.txt=patchprocess/trunkJavacWarnings.txt, patchprocess/testrun_hadoop-hdfs.txt=patchprocess/testrun_hadoop-hdfs.txt, patchprocess/newPatchFindbugsWarningshadoop-common.xml=patchprocess/newPatchFindbugsWarningshadoop-common.xml, patchprocess/newPatchFindbugsWarningshadoop-common.html=patchprocess/newPatchFindbugsWarningshadoop-common.html, patchprocess/newPatchFindbugsWarningshadoop-yarn-server-resourcemanager.html=patchprocess/newPatchFindbugsWarningshadoop-yarn-server-resourcemanager.html, patchprocess/testrun_hadoop-yarn-server-resourcemanager.txt=patchprocess/testrun_hadoop-yarn-server-resourcemanager.txt, patchprocess/patchReleaseAuditOutput.txt=patchprocess/patchReleaseAuditOutput.txt, patchprocess/patchReleaseAuditWarnings.txt=patchprocess/patchReleaseAuditWarnings.txt, patchprocess/patchFindbugsWarningshadoop-common.xml=patchprocess/patchFindbugsWarningshadoop-common.xml, patchprocess/filteredPatchJavacWarnings.txt=patchprocess/filteredPatchJavacWarnings.txt, patchprocess/patchFindbugsWarningshadoop-yarn-server-resourcemanager.xml=patchprocess/patchFindbugsWarningshadoop-yarn-server-resourcemanager.xml, patchprocess/patchEclipseOutput.txt=patchprocess/patchEclipseOutput.txt, patchprocess/filteredTrunkJavacWarnings.txt=patchprocess/filteredTrunkJavacWarnings.txt} due to internal error; falling back to full archiving
java.lang.IllegalStateException: checksum mismatch after transfer (6081393815818629749 vs. 1831658440); /x1/jenkins/jenkins-home/jobs/PreCommit-YARN-Build/builds/2015-03-13_11-30-14/archive/patchprocess/testrun_hadoop-hdfs.txt may be corrupted
at jsync.protocol.FileSequenceReader.read(FileSequenceReader.java:45)
at com.cloudbees.jenkins.plugins.jsync.archiver.JSyncArtifactManager.remoteSync(JSyncArtifactManager.java:145)
at com.cloudbees.jenkins.plugins.jsync.archiver.JSyncArtifactManager.archive(JSyncArtifactManager.java:68)
at hudson.tasks.ArtifactArchiver.perform(ArtifactArchiver.java:140)
at hudson.tasks.BuildStepMonitor$1.perform(BuildStepMonitor.java:20)
at hudson.model.AbstractBuild$AbstractBuildExecution.perform(AbstractBuild.java:756)
at hudson.model.AbstractBuild$AbstractBuildExecution.performAllBuildSteps(AbstractBuild.java:720)
at hudson.model.Build$BuildExecution.post2(Build.java:182)
at hudson.model.AbstractBuild$AbstractBuildExecution.post(AbstractBuild.java:669)
at hudson.model.Run.execute(Run.java:1731)
at hudson.model.FreeStyleBuild.run(FreeStyleBuild.java:43)
at hudson.model.ResourceController.execute(ResourceController.java:88)
at hudson.model.Executor.run(Executor.java:232)
[description-setter] Could not determine description.
Recording test results
Email was triggered for: Failure
Sending email for trigger: Failure
###################################################################################
############################## FAILED TESTS (if any) ##############################
1 tests failed.
REGRESSION: org.apache.hadoop.yarn.server.resourcemanager.TestRM.testAppOnMultiNode[0]
Error Message:
test timed out after 30000 milliseconds
Stack Trace:
java.lang.Exception: test timed out after 30000 milliseconds
at java.lang.Thread.sleep(Native Method)
at org.apache.hadoop.yarn.server.resourcemanager.MockAM.waitForState(MockAM.java:83)
at org.apache.hadoop.yarn.server.resourcemanager.TestRM.testAppOnMultiNode(TestRM.java:198)
Failed: YARN-3261 PreCommit Build #6954
Posted by Apache Jenkins Server <je...@builds.apache.org>.
Jira: https://issues.apache.org/jira/browse/YARN-3261
Build: https://builds.apache.org/job/PreCommit-YARN-Build/6954/
###################################################################################
########################## LAST 60 LINES OF THE CONSOLE ###########################
[...truncated 3120 lines...]
{color:red}-1 overall{color}. Here are the results of testing the latest attachment
http://issues.apache.org/jira/secure/attachment/12704385/YARN-3261.01.patch
against trunk revision 387f271.
{color:green}+1 @author{color}. The patch does not contain any @author tags.
{color:red}-1 tests included{color}. The patch doesn't appear to include any new or modified tests.
Please justify why no new tests are needed for this patch.
Also please list what manual steps were performed to verify this patch.
{color:green}+1 javac{color}. The applied patch does not increase the total number of javac compiler warnings.
{color:green}+1 javadoc{color}. There were no new javadoc warning messages.
{color:green}+1 eclipse:eclipse{color}. The patch built with eclipse:eclipse.
{color:green}+1 findbugs{color}. The patch does not introduce any new Findbugs (version 2.0.3) warnings.
{color:green}+1 release audit{color}. The applied patch does not increase the total number of release audit warnings.
{color:green}+1 core tests{color}. The patch passed unit tests in .
Test results: https://builds.apache.org/job/PreCommit-YARN-Build/6954//testReport/
Console output: https://builds.apache.org/job/PreCommit-YARN-Build/6954//console
This message is automatically generated.
======================================================================
======================================================================
Adding comment to Jira.
======================================================================
======================================================================
Comment added.
0785f69493fbd3fd880d89ed916621598e31acc1 logged out
======================================================================
======================================================================
Finished build.
======================================================================
======================================================================
Build step 'Execute shell' marked build as failure
Archiving artifacts
Sending artifact delta relative to PreCommit-YARN-Build #6947
Archived 10 artifacts
Archive block size is 32768
Received 45 blocks and 7260521 bytes
Compression is 16.9%
Took 2 sec
[description-setter] Could not determine description.
Recording test results
Email was triggered for: Failure
Sending email for trigger: Failure
###################################################################################
############################## FAILED TESTS (if any) ##############################
No tests ran.