You are viewing a plain text version of this content. The canonical link for it is here.
Posted to dev@lucene.apache.org by Policeman Jenkins Server <je...@thetaphi.de> on 2017/09/05 15:08:36 UTC

[JENKINS] Lucene-Solr-7.x-MacOSX (64bit/jdk1.8.0) - Build # 159 - Still Unstable!

Build: https://jenkins.thetaphi.de/job/Lucene-Solr-7.x-MacOSX/159/
Java: 64bit/jdk1.8.0 -XX:-UseCompressedOops -XX:+UseG1GC

1 tests failed.
FAILED:  org.apache.solr.cloud.TestCloudRecovery.corruptedLogTest

Error Message:
Timeout waiting for all live and active

Stack Trace:
java.lang.AssertionError: Timeout waiting for all live and active
	at __randomizedtesting.SeedInfo.seed([99B2BAB6F8F0DDD8:1AC4E5442E89D379]:0)
	at org.junit.Assert.fail(Assert.java:93)
	at org.junit.Assert.assertTrue(Assert.java:43)
	at org.apache.solr.cloud.TestCloudRecovery.corruptedLogTest(TestCloudRecovery.java:184)
	at sun.reflect.NativeMethodAccessorImpl.invoke0(Native Method)
	at sun.reflect.NativeMethodAccessorImpl.invoke(NativeMethodAccessorImpl.java:62)
	at sun.reflect.DelegatingMethodAccessorImpl.invoke(DelegatingMethodAccessorImpl.java:43)
	at java.lang.reflect.Method.invoke(Method.java:498)
	at com.carrotsearch.randomizedtesting.RandomizedRunner.invoke(RandomizedRunner.java:1737)
	at com.carrotsearch.randomizedtesting.RandomizedRunner$8.evaluate(RandomizedRunner.java:934)
	at com.carrotsearch.randomizedtesting.RandomizedRunner$9.evaluate(RandomizedRunner.java:970)
	at com.carrotsearch.randomizedtesting.RandomizedRunner$10.evaluate(RandomizedRunner.java:984)
	at com.carrotsearch.randomizedtesting.rules.SystemPropertiesRestoreRule$1.evaluate(SystemPropertiesRestoreRule.java:57)
	at org.apache.lucene.util.TestRuleSetupTeardownChained$1.evaluate(TestRuleSetupTeardownChained.java:49)
	at org.apache.lucene.util.AbstractBeforeAfterRule$1.evaluate(AbstractBeforeAfterRule.java:45)
	at org.apache.lucene.util.TestRuleThreadAndTestName$1.evaluate(TestRuleThreadAndTestName.java:48)
	at org.apache.lucene.util.TestRuleIgnoreAfterMaxFailures$1.evaluate(TestRuleIgnoreAfterMaxFailures.java:64)
	at org.apache.lucene.util.TestRuleMarkFailure$1.evaluate(TestRuleMarkFailure.java:47)
	at com.carrotsearch.randomizedtesting.rules.StatementAdapter.evaluate(StatementAdapter.java:36)
	at com.carrotsearch.randomizedtesting.ThreadLeakControl$StatementRunner.run(ThreadLeakControl.java:368)
	at com.carrotsearch.randomizedtesting.ThreadLeakControl.forkTimeoutingTask(ThreadLeakControl.java:817)
	at com.carrotsearch.randomizedtesting.ThreadLeakControl$3.evaluate(ThreadLeakControl.java:468)
	at com.carrotsearch.randomizedtesting.RandomizedRunner.runSingleTest(RandomizedRunner.java:943)
	at com.carrotsearch.randomizedtesting.RandomizedRunner$5.evaluate(RandomizedRunner.java:829)
	at com.carrotsearch.randomizedtesting.RandomizedRunner$6.evaluate(RandomizedRunner.java:879)
	at com.carrotsearch.randomizedtesting.RandomizedRunner$7.evaluate(RandomizedRunner.java:890)
	at com.carrotsearch.randomizedtesting.rules.StatementAdapter.evaluate(StatementAdapter.java:36)
	at com.carrotsearch.randomizedtesting.rules.SystemPropertiesRestoreRule$1.evaluate(SystemPropertiesRestoreRule.java:57)
	at org.apache.lucene.util.AbstractBeforeAfterRule$1.evaluate(AbstractBeforeAfterRule.java:45)
	at com.carrotsearch.randomizedtesting.rules.StatementAdapter.evaluate(StatementAdapter.java:36)
	at org.apache.lucene.util.TestRuleStoreClassName$1.evaluate(TestRuleStoreClassName.java:41)
	at com.carrotsearch.randomizedtesting.rules.NoShadowingOrOverridesOnMethodsRule$1.evaluate(NoShadowingOrOverridesOnMethodsRule.java:40)
	at com.carrotsearch.randomizedtesting.rules.NoShadowingOrOverridesOnMethodsRule$1.evaluate(NoShadowingOrOverridesOnMethodsRule.java:40)
	at com.carrotsearch.randomizedtesting.rules.StatementAdapter.evaluate(StatementAdapter.java:36)
	at com.carrotsearch.randomizedtesting.rules.StatementAdapter.evaluate(StatementAdapter.java:36)
	at com.carrotsearch.randomizedtesting.rules.StatementAdapter.evaluate(StatementAdapter.java:36)
	at org.apache.lucene.util.TestRuleAssertionsRequired$1.evaluate(TestRuleAssertionsRequired.java:53)
	at org.apache.lucene.util.TestRuleMarkFailure$1.evaluate(TestRuleMarkFailure.java:47)
	at org.apache.lucene.util.TestRuleIgnoreAfterMaxFailures$1.evaluate(TestRuleIgnoreAfterMaxFailures.java:64)
	at org.apache.lucene.util.TestRuleIgnoreTestSuites$1.evaluate(TestRuleIgnoreTestSuites.java:54)
	at com.carrotsearch.randomizedtesting.rules.StatementAdapter.evaluate(StatementAdapter.java:36)
	at com.carrotsearch.randomizedtesting.ThreadLeakControl$StatementRunner.run(ThreadLeakControl.java:368)
	at java.lang.Thread.run(Thread.java:748)




Build Log:
[...truncated 11733 lines...]
   [junit4] Suite: org.apache.solr.cloud.TestCloudRecovery
   [junit4]   2> 908049 INFO  (SUITE-TestCloudRecovery-seed#[99B2BAB6F8F0DDD8]-worker) [    ] o.a.s.SolrTestCaseJ4 SecureRandom sanity checks: test.solr.allowed.securerandom=null & java.security.egd=file:/dev/./urandom
   [junit4]   2> Creating dataDir: /Users/jenkins/workspace/Lucene-Solr-7.x-MacOSX/solr/build/solr-core/test/J1/temp/solr.cloud.TestCloudRecovery_99B2BAB6F8F0DDD8-001/init-core-data-001
   [junit4]   2> 908050 WARN  (SUITE-TestCloudRecovery-seed#[99B2BAB6F8F0DDD8]-worker) [    ] o.a.s.SolrTestCaseJ4 startTrackingSearchers: numOpens=16 numCloses=16
   [junit4]   2> 908050 INFO  (SUITE-TestCloudRecovery-seed#[99B2BAB6F8F0DDD8]-worker) [    ] o.a.s.SolrTestCaseJ4 Using PointFields (NUMERIC_POINTS_SYSPROP=true) w/NUMERIC_DOCVALUES_SYSPROP=false
   [junit4]   2> 908053 INFO  (SUITE-TestCloudRecovery-seed#[99B2BAB6F8F0DDD8]-worker) [    ] o.a.s.SolrTestCaseJ4 Randomized ssl (false) and clientAuth (false) via: @org.apache.solr.util.RandomizeSSL(reason=, value=NaN, ssl=NaN, clientAuth=NaN) w/ MAC_OS_X supressed clientAuth
   [junit4]   2> 908054 INFO  (SUITE-TestCloudRecovery-seed#[99B2BAB6F8F0DDD8]-worker) [    ] o.a.s.c.MiniSolrCloudCluster Starting cluster of 2 servers in /Users/jenkins/workspace/Lucene-Solr-7.x-MacOSX/solr/build/solr-core/test/J1/temp/solr.cloud.TestCloudRecovery_99B2BAB6F8F0DDD8-001/tempDir-001
   [junit4]   2> 908054 INFO  (SUITE-TestCloudRecovery-seed#[99B2BAB6F8F0DDD8]-worker) [    ] o.a.s.c.ZkTestServer STARTING ZK TEST SERVER
   [junit4]   2> 908054 INFO  (Thread-1696) [    ] o.a.s.c.ZkTestServer client port:0.0.0.0/0.0.0.0:0
   [junit4]   2> 908054 INFO  (Thread-1696) [    ] o.a.s.c.ZkTestServer Starting server
   [junit4]   2> 908057 ERROR (Thread-1696) [    ] o.a.z.s.ZooKeeperServer ZKShutdownHandler is not registered, so ZooKeeper server won't take any action on ERROR or SHUTDOWN server state changes
   [junit4]   2> 908164 INFO  (SUITE-TestCloudRecovery-seed#[99B2BAB6F8F0DDD8]-worker) [    ] o.a.s.c.ZkTestServer start zk server on port:55193
   [junit4]   2> 908220 INFO  (jetty-launcher-2726-thread-1) [    ] o.e.j.s.Server jetty-9.3.20.v20170531
   [junit4]   2> 908220 INFO  (jetty-launcher-2726-thread-2) [    ] o.e.j.s.Server jetty-9.3.20.v20170531
   [junit4]   2> 908221 INFO  (jetty-launcher-2726-thread-1) [    ] o.e.j.s.h.ContextHandler Started o.e.j.s.ServletContextHandler@586d4999{/solr,null,AVAILABLE}
   [junit4]   2> 908222 INFO  (jetty-launcher-2726-thread-2) [    ] o.e.j.s.h.ContextHandler Started o.e.j.s.ServletContextHandler@c4570b6{/solr,null,AVAILABLE}
   [junit4]   2> 908223 INFO  (jetty-launcher-2726-thread-1) [    ] o.e.j.s.AbstractConnector Started ServerConnector@75fd8bbd{HTTP/1.1,[http/1.1]}{127.0.0.1:55195}
   [junit4]   2> 908223 INFO  (jetty-launcher-2726-thread-1) [    ] o.e.j.s.Server Started @913945ms
   [junit4]   2> 908223 INFO  (jetty-launcher-2726-thread-1) [    ] o.a.s.c.s.e.JettySolrRunner Jetty properties: {hostContext=/solr, hostPort=55195}
   [junit4]   2> 908223 INFO  (jetty-launcher-2726-thread-2) [    ] o.e.j.s.AbstractConnector Started ServerConnector@2c8e1d25{HTTP/1.1,[http/1.1]}{127.0.0.1:55196}
   [junit4]   2> 908223 INFO  (jetty-launcher-2726-thread-2) [    ] o.e.j.s.Server Started @913945ms
   [junit4]   2> 908223 INFO  (jetty-launcher-2726-thread-2) [    ] o.a.s.c.s.e.JettySolrRunner Jetty properties: {hostContext=/solr, hostPort=55196}
   [junit4]   2> 908223 ERROR (jetty-launcher-2726-thread-1) [    ] o.a.s.u.StartupLoggingUtils Missing Java Option solr.log.dir. Logging may be missing or incomplete.
   [junit4]   2> 908223 ERROR (jetty-launcher-2726-thread-2) [    ] o.a.s.u.StartupLoggingUtils Missing Java Option solr.log.dir. Logging may be missing or incomplete.
   [junit4]   2> 908224 INFO  (jetty-launcher-2726-thread-1) [    ] o.a.s.s.SolrDispatchFilter  ___      _       Welcome to Apache Solr? version 7.1.0
   [junit4]   2> 908224 INFO  (jetty-launcher-2726-thread-2) [    ] o.a.s.s.SolrDispatchFilter  ___      _       Welcome to Apache Solr? version 7.1.0
   [junit4]   2> 908224 INFO  (jetty-launcher-2726-thread-1) [    ] o.a.s.s.SolrDispatchFilter / __| ___| |_ _   Starting in cloud mode on port null
   [junit4]   2> 908224 INFO  (jetty-launcher-2726-thread-2) [    ] o.a.s.s.SolrDispatchFilter / __| ___| |_ _   Starting in cloud mode on port null
   [junit4]   2> 908224 INFO  (jetty-launcher-2726-thread-1) [    ] o.a.s.s.SolrDispatchFilter \__ \/ _ \ | '_|  Install dir: null, Default config dir: null
   [junit4]   2> 908224 INFO  (jetty-launcher-2726-thread-2) [    ] o.a.s.s.SolrDispatchFilter \__ \/ _ \ | '_|  Install dir: null, Default config dir: null
   [junit4]   2> 908224 INFO  (jetty-launcher-2726-thread-1) [    ] o.a.s.s.SolrDispatchFilter |___/\___/_|_|    Start time: 2017-09-05T14:08:45.419Z
   [junit4]   2> 908224 INFO  (jetty-launcher-2726-thread-2) [    ] o.a.s.s.SolrDispatchFilter |___/\___/_|_|    Start time: 2017-09-05T14:08:45.419Z
   [junit4]   2> 908227 INFO  (jetty-launcher-2726-thread-1) [    ] o.a.s.s.SolrDispatchFilter solr.xml found in ZooKeeper. Loading...
   [junit4]   2> 908227 INFO  (jetty-launcher-2726-thread-2) [    ] o.a.s.s.SolrDispatchFilter solr.xml found in ZooKeeper. Loading...
   [junit4]   2> 908237 INFO  (jetty-launcher-2726-thread-1) [    ] o.a.s.c.ZkContainer Zookeeper client=127.0.0.1:55193/solr
   [junit4]   2> 908237 INFO  (jetty-launcher-2726-thread-2) [    ] o.a.s.c.ZkContainer Zookeeper client=127.0.0.1:55193/solr
   [junit4]   2> 908368 INFO  (jetty-launcher-2726-thread-1) [n:127.0.0.1:55195_solr    ] o.a.s.c.Overseer Overseer (id=null) closing
   [junit4]   2> 908368 INFO  (jetty-launcher-2726-thread-2) [n:127.0.0.1:55196_solr    ] o.a.s.c.Overseer Overseer (id=null) closing
   [junit4]   2> 908369 INFO  (jetty-launcher-2726-thread-1) [n:127.0.0.1:55195_solr    ] o.a.s.c.OverseerElectionContext I am going to be the leader 127.0.0.1:55195_solr
   [junit4]   2> 908370 INFO  (jetty-launcher-2726-thread-2) [n:127.0.0.1:55196_solr    ] o.a.s.c.ZkController Register node as live in ZooKeeper:/live_nodes/127.0.0.1:55196_solr
   [junit4]   2> 908370 INFO  (jetty-launcher-2726-thread-1) [n:127.0.0.1:55195_solr    ] o.a.s.c.Overseer Overseer (id=98606810742849541-127.0.0.1:55195_solr-n_0000000000) starting
   [junit4]   2> 908372 INFO  (zkCallback-2737-thread-1-processing-n:127.0.0.1:55195_solr) [n:127.0.0.1:55195_solr    ] o.a.s.c.c.ZkStateReader Updated live nodes from ZooKeeper... (0) -> (1)
   [junit4]   2> 908373 INFO  (zkCallback-2738-thread-1-processing-n:127.0.0.1:55196_solr) [n:127.0.0.1:55196_solr    ] o.a.s.c.c.ZkStateReader Updated live nodes from ZooKeeper... (0) -> (1)
   [junit4]   2> 908382 INFO  (jetty-launcher-2726-thread-1) [n:127.0.0.1:55195_solr    ] o.a.s.c.ZkController Register node as live in ZooKeeper:/live_nodes/127.0.0.1:55195_solr
   [junit4]   2> 908384 INFO  (zkCallback-2738-thread-1-processing-n:127.0.0.1:55196_solr) [n:127.0.0.1:55196_solr    ] o.a.s.c.c.ZkStateReader Updated live nodes from ZooKeeper... (1) -> (2)
   [junit4]   2> 908384 INFO  (zkCallback-2737-thread-1-processing-n:127.0.0.1:55195_solr) [n:127.0.0.1:55195_solr    ] o.a.s.c.c.ZkStateReader Updated live nodes from ZooKeeper... (1) -> (2)
   [junit4]   2> 908465 INFO  (jetty-launcher-2726-thread-2) [n:127.0.0.1:55196_solr    ] o.a.s.m.r.SolrJmxReporter JMX monitoring for 'solr_55196.solr.node' (registry 'solr.node') enabled at server: com.sun.jmx.mbeanserver.JmxMBeanServer@6217a7b5
   [junit4]   2> 908470 INFO  (jetty-launcher-2726-thread-2) [n:127.0.0.1:55196_solr    ] o.a.s.m.r.SolrJmxReporter JMX monitoring for 'solr_55196.solr.jvm' (registry 'solr.jvm') enabled at server: com.sun.jmx.mbeanserver.JmxMBeanServer@6217a7b5
   [junit4]   2> 908470 INFO  (jetty-launcher-2726-thread-2) [n:127.0.0.1:55196_solr    ] o.a.s.m.r.SolrJmxReporter JMX monitoring for 'solr_55196.solr.jetty' (registry 'solr.jetty') enabled at server: com.sun.jmx.mbeanserver.JmxMBeanServer@6217a7b5
   [junit4]   2> 908471 INFO  (jetty-launcher-2726-thread-2) [n:127.0.0.1:55196_solr    ] o.a.s.c.CorePropertiesLocator Found 0 core definitions underneath /Users/jenkins/workspace/Lucene-Solr-7.x-MacOSX/solr/build/solr-core/test/J1/temp/solr.cloud.TestCloudRecovery_99B2BAB6F8F0DDD8-001/tempDir-001/node2/.
   [junit4]   2> 908484 INFO  (jetty-launcher-2726-thread-1) [n:127.0.0.1:55195_solr    ] o.a.s.m.r.SolrJmxReporter JMX monitoring for 'solr_55195.solr.node' (registry 'solr.node') enabled at server: com.sun.jmx.mbeanserver.JmxMBeanServer@6217a7b5
   [junit4]   2> 908491 INFO  (jetty-launcher-2726-thread-1) [n:127.0.0.1:55195_solr    ] o.a.s.m.r.SolrJmxReporter JMX monitoring for 'solr_55195.solr.jvm' (registry 'solr.jvm') enabled at server: com.sun.jmx.mbeanserver.JmxMBeanServer@6217a7b5
   [junit4]   2> 908491 INFO  (jetty-launcher-2726-thread-1) [n:127.0.0.1:55195_solr    ] o.a.s.m.r.SolrJmxReporter JMX monitoring for 'solr_55195.solr.jetty' (registry 'solr.jetty') enabled at server: com.sun.jmx.mbeanserver.JmxMBeanServer@6217a7b5
   [junit4]   2> 908491 INFO  (jetty-launcher-2726-thread-1) [n:127.0.0.1:55195_solr    ] o.a.s.c.CorePropertiesLocator Found 0 core definitions underneath /Users/jenkins/workspace/Lucene-Solr-7.x-MacOSX/solr/build/solr-core/test/J1/temp/solr.cloud.TestCloudRecovery_99B2BAB6F8F0DDD8-001/tempDir-001/node1/.
   [junit4]   2> 908511 INFO  (SUITE-TestCloudRecovery-seed#[99B2BAB6F8F0DDD8]-worker) [    ] o.a.s.c.c.ZkStateReader Updated live nodes from ZooKeeper... (0) -> (2)
   [junit4]   2> 908512 INFO  (SUITE-TestCloudRecovery-seed#[99B2BAB6F8F0DDD8]-worker) [    ] o.a.s.c.s.i.ZkClientClusterStateProvider Cluster at 127.0.0.1:55193/solr ready
   [junit4]   2> 908520 INFO  (qtp1755710223-9843) [n:127.0.0.1:55195_solr    ] o.a.s.h.a.CollectionsHandler Invoked Collection Action :create with params pullReplicas=0&replicationFactor=0&collection.configName=config&maxShardsPerNode=2&name=collection1&nrtReplicas=0&action=CREATE&numShards=2&tlogReplicas=2&wt=javabin&version=2 and sendToOCPQueue=true
   [junit4]   2> 908523 INFO  (OverseerThreadFactory-3279-thread-1-processing-n:127.0.0.1:55195_solr) [n:127.0.0.1:55195_solr    ] o.a.s.c.CreateCollectionCmd Create collection collection1
   [junit4]   2> 908641 INFO  (OverseerStateUpdate-98606810742849541-127.0.0.1:55195_solr-n_0000000000) [n:127.0.0.1:55195_solr    ] o.a.s.c.o.SliceMutator createReplica() {
   [junit4]   2>   "operation":"ADDREPLICA",
   [junit4]   2>   "collection":"collection1",
   [junit4]   2>   "shard":"shard1",
   [junit4]   2>   "core":"collection1_shard1_replica_t1",
   [junit4]   2>   "state":"down",
   [junit4]   2>   "base_url":"http://127.0.0.1:55195/solr",
   [junit4]   2>   "type":"TLOG"} 
   [junit4]   2> 908650 INFO  (OverseerStateUpdate-98606810742849541-127.0.0.1:55195_solr-n_0000000000) [n:127.0.0.1:55195_solr    ] o.a.s.c.o.SliceMutator createReplica() {
   [junit4]   2>   "operation":"ADDREPLICA",
   [junit4]   2>   "collection":"collection1",
   [junit4]   2>   "shard":"shard1",
   [junit4]   2>   "core":"collection1_shard1_replica_t2",
   [junit4]   2>   "state":"down",
   [junit4]   2>   "base_url":"http://127.0.0.1:55196/solr",
   [junit4]   2>   "type":"TLOG"} 
   [junit4]   2> 908658 INFO  (OverseerStateUpdate-98606810742849541-127.0.0.1:55195_solr-n_0000000000) [n:127.0.0.1:55195_solr    ] o.a.s.c.o.SliceMutator createReplica() {
   [junit4]   2>   "operation":"ADDREPLICA",
   [junit4]   2>   "collection":"collection1",
   [junit4]   2>   "shard":"shard2",
   [junit4]   2>   "core":"collection1_shard2_replica_t4",
   [junit4]   2>   "state":"down",
   [junit4]   2>   "base_url":"http://127.0.0.1:55195/solr",
   [junit4]   2>   "type":"TLOG"} 
   [junit4]   2> 908665 INFO  (OverseerStateUpdate-98606810742849541-127.0.0.1:55195_solr-n_0000000000) [n:127.0.0.1:55195_solr    ] o.a.s.c.o.SliceMutator createReplica() {
   [junit4]   2>   "operation":"ADDREPLICA",
   [junit4]   2>   "collection":"collection1",
   [junit4]   2>   "shard":"shard2",
   [junit4]   2>   "core":"collection1_shard2_replica_t6",
   [junit4]   2>   "state":"down",
   [junit4]   2>   "base_url":"http://127.0.0.1:55196/solr",
   [junit4]   2>   "type":"TLOG"} 
   [junit4]   2> 908892 INFO  (qtp1755710223-9846) [n:127.0.0.1:55195_solr    ] o.a.s.h.a.CoreAdminOperation core create command qt=/admin/cores&coreNodeName=core_node3&collection.configName=config&newCollection=true&name=collection1_shard1_replica_t1&action=CREATE&numShards=2&collection=collection1&shard=shard1&wt=javabin&version=2&replicaType=TLOG
   [junit4]   2> 908892 INFO  (qtp1755710223-9844) [n:127.0.0.1:55195_solr    ] o.a.s.h.a.CoreAdminOperation core create command qt=/admin/cores&coreNodeName=core_node7&collection.configName=config&newCollection=true&name=collection1_shard2_replica_t4&action=CREATE&numShards=2&collection=collection1&shard=shard2&wt=javabin&version=2&replicaType=TLOG
   [junit4]   2> 908892 INFO  (qtp341015423-9852) [n:127.0.0.1:55196_solr    ] o.a.s.h.a.CoreAdminOperation core create command qt=/admin/cores&coreNodeName=core_node8&collection.configName=config&newCollection=true&name=collection1_shard2_replica_t6&action=CREATE&numShards=2&collection=collection1&shard=shard2&wt=javabin&version=2&replicaType=TLOG
   [junit4]   2> 908893 INFO  (qtp1755710223-9844) [n:127.0.0.1:55195_solr    ] o.a.s.c.TransientSolrCoreCacheDefault Allocating transient cache for 2147483647 transient cores
   [junit4]   2> 908893 INFO  (qtp341015423-9854) [n:127.0.0.1:55196_solr    ] o.a.s.h.a.CoreAdminOperation core create command qt=/admin/cores&coreNodeName=core_node5&collection.configName=config&newCollection=true&name=collection1_shard1_replica_t2&action=CREATE&numShards=2&collection=collection1&shard=shard1&wt=javabin&version=2&replicaType=TLOG
   [junit4]   2> 908893 INFO  (qtp341015423-9852) [n:127.0.0.1:55196_solr    ] o.a.s.c.TransientSolrCoreCacheDefault Allocating transient cache for 2147483647 transient cores
   [junit4]   2> 909022 INFO  (zkCallback-2738-thread-1-processing-n:127.0.0.1:55196_solr) [n:127.0.0.1:55196_solr    ] o.a.s.c.c.ZkStateReader A cluster state change: [WatchedEvent state:SyncConnected type:NodeDataChanged path:/collections/collection1/state.json] for collection [collection1] has occurred - updating... (live nodes size: [2])
   [junit4]   2> 909022 INFO  (zkCallback-2737-thread-1-processing-n:127.0.0.1:55195_solr) [n:127.0.0.1:55195_solr    ] o.a.s.c.c.ZkStateReader A cluster state change: [WatchedEvent state:SyncConnected type:NodeDataChanged path:/collections/collection1/state.json] for collection [collection1] has occurred - updating... (live nodes size: [2])
   [junit4]   2> 909023 INFO  (zkCallback-2738-thread-2-processing-n:127.0.0.1:55196_solr) [n:127.0.0.1:55196_solr    ] o.a.s.c.c.ZkStateReader A cluster state change: [WatchedEvent state:SyncConnected type:NodeDataChanged path:/collections/collection1/state.json] for collection [collection1] has occurred - updating... (live nodes size: [2])
   [junit4]   2> 909024 INFO  (zkCallback-2737-thread-2-processing-n:127.0.0.1:55195_solr) [n:127.0.0.1:55195_solr    ] o.a.s.c.c.ZkStateReader A cluster state change: [WatchedEvent state:SyncConnected type:NodeDataChanged path:/collections/collection1/state.json] for collection [collection1] has occurred - updating... (live nodes size: [2])
   [junit4]   2> 909928 INFO  (qtp341015423-9854) [n:127.0.0.1:55196_solr c:collection1 s:shard1 r:core_node5 x:collection1_shard1_replica_t2] o.a.s.c.SolrConfig Using Lucene MatchVersion: 7.1.0
   [junit4]   2> 909933 INFO  (qtp341015423-9852) [n:127.0.0.1:55196_solr c:collection1 s:shard2 r:core_node8 x:collection1_shard2_replica_t6] o.a.s.c.SolrConfig Using Lucene MatchVersion: 7.1.0
   [junit4]   2> 909933 INFO  (qtp1755710223-9846) [n:127.0.0.1:55195_solr c:collection1 s:shard1 r:core_node3 x:collection1_shard1_replica_t1] o.a.s.c.SolrConfig Using Lucene MatchVersion: 7.1.0
   [junit4]   2> 909954 INFO  (qtp341015423-9854) [n:127.0.0.1:55196_solr c:collection1 s:shard1 r:core_node5 x:collection1_shard1_replica_t2] o.a.s.s.IndexSchema [collection1_shard1_replica_t2] Schema name=minimal
   [junit4]   2> 909957 INFO  (qtp1755710223-9844) [n:127.0.0.1:55195_solr c:collection1 s:shard2 r:core_node7 x:collection1_shard2_replica_t4] o.a.s.c.SolrConfig Using Lucene MatchVersion: 7.1.0
   [junit4]   2> 909958 INFO  (qtp341015423-9854) [n:127.0.0.1:55196_solr c:collection1 s:shard1 r:core_node5 x:collection1_shard1_replica_t2] o.a.s.s.IndexSchema Loaded schema minimal/1.1 with uniqueid field id
   [junit4]   2> 909958 INFO  (qtp341015423-9854) [n:127.0.0.1:55196_solr c:collection1 s:shard1 r:core_node5 x:collection1_shard1_replica_t2] o.a.s.c.CoreContainer Creating SolrCore 'collection1_shard1_replica_t2' using configuration from collection collection1, trusted=true
   [junit4]   2> 909959 INFO  (qtp341015423-9854) [n:127.0.0.1:55196_solr c:collection1 s:shard1 r:core_node5 x:collection1_shard1_replica_t2] o.a.s.m.r.SolrJmxReporter JMX monitoring for 'solr_55196.solr.core.collection1.shard1.replica_t2' (registry 'solr.core.collection1.shard1.replica_t2') enabled at server: com.sun.jmx.mbeanserver.JmxMBeanServer@6217a7b5
   [junit4]   2> 909959 INFO  (qtp341015423-9854) [n:127.0.0.1:55196_solr c:collection1 s:shard1 r:core_node5 x:collection1_shard1_replica_t2] o.a.s.c.SolrCore solr.RecoveryStrategy.Builder
   [junit4]   2> 909959 INFO  (qtp341015423-9854) [n:127.0.0.1:55196_solr c:collection1 s:shard1 r:core_node5 x:collection1_shard1_replica_t2] o.a.s.c.SolrCore [[collection1_shard1_replica_t2] ] Opening new SolrCore at [/Users/jenkins/workspace/Lucene-Solr-7.x-MacOSX/solr/build/solr-core/test/J1/temp/solr.cloud.TestCloudRecovery_99B2BAB6F8F0DDD8-001/tempDir-001/node2/collection1_shard1_replica_t2], dataDir=[/Users/jenkins/workspace/Lucene-Solr-7.x-MacOSX/solr/build/solr-core/test/J1/temp/solr.cloud.TestCloudRecovery_99B2BAB6F8F0DDD8-001/tempDir-001/node2/./collection1_shard1_replica_t2/data/]
   [junit4]   2> 909961 INFO  (qtp341015423-9852) [n:127.0.0.1:55196_solr c:collection1 s:shard2 r:core_node8 x:collection1_shard2_replica_t6] o.a.s.s.IndexSchema [collection1_shard2_replica_t6] Schema name=minimal
   [junit4]   2> 909963 INFO  (qtp341015423-9852) [n:127.0.0.1:55196_solr c:collection1 s:shard2 r:core_node8 x:collection1_shard2_replica_t6] o.a.s.s.IndexSchema Loaded schema minimal/1.1 with uniqueid field id
   [junit4]   2> 909963 INFO  (qtp341015423-9852) [n:127.0.0.1:55196_solr c:collection1 s:shard2 r:core_node8 x:collection1_shard2_replica_t6] o.a.s.c.CoreContainer Creating SolrCore 'collection1_shard2_replica_t6' using configuration from collection collection1, trusted=true
   [junit4]   2> 909963 INFO  (qtp1755710223-9846) [n:127.0.0.1:55195_solr c:collection1 s:shard1 r:core_node3 x:collection1_shard1_replica_t1] o.a.s.s.IndexSchema [collection1_shard1_replica_t1] Schema name=minimal
   [junit4]   2> 909963 INFO  (qtp341015423-9852) [n:127.0.0.1:55196_solr c:collection1 s:shard2 r:core_node8 x:collection1_shard2_replica_t6] o.a.s.m.r.SolrJmxReporter JMX monitoring for 'solr_55196.solr.core.collection1.shard2.replica_t6' (registry 'solr.core.collection1.shard2.replica_t6') enabled at server: com.sun.jmx.mbeanserver.JmxMBeanServer@6217a7b5
   [junit4]   2> 909963 INFO  (qtp341015423-9852) [n:127.0.0.1:55196_solr c:collection1 s:shard2 r:core_node8 x:collection1_shard2_replica_t6] o.a.s.c.SolrCore solr.RecoveryStrategy.Builder
   [junit4]   2> 909963 INFO  (qtp341015423-9852) [n:127.0.0.1:55196_solr c:collection1 s:shard2 r:core_node8 x:collection1_shard2_replica_t6] o.a.s.c.SolrCore [[collection1_shard2_replica_t6] ] Opening new SolrCore at [/Users/jenkins/workspace/Lucene-Solr-7.x-MacOSX/solr/build/solr-core/test/J1/temp/solr.cloud.TestCloudRecovery_99B2BAB6F8F0DDD8-001/tempDir-001/node2/collection1_shard2_replica_t6], dataDir=[/Users/jenkins/workspace/Lucene-Solr-7.x-MacOSX/solr/build/solr-core/test/J1/temp/solr.cloud.TestCloudRecovery_99B2BAB6F8F0DDD8-001/tempDir-001/node2/./collection1_shard2_replica_t6/data/]
   [junit4]   2> 909964 INFO  (qtp1755710223-9846) [n:127.0.0.1:55195_solr c:collection1 s:shard1 r:core_node3 x:collection1_shard1_replica_t1] o.a.s.s.IndexSchema Loaded schema minimal/1.1 with uniqueid field id
   [junit4]   2> 909964 INFO  (qtp1755710223-9846) [n:127.0.0.1:55195_solr c:collection1 s:shard1 r:core_node3 x:collection1_shard1_replica_t1] o.a.s.c.CoreContainer Creating SolrCore 'collection1_shard1_replica_t1' using configuration from collection collection1, trusted=true
   [junit4]   2> 909965 INFO  (qtp1755710223-9846) [n:127.0.0.1:55195_solr c:collection1 s:shard1 r:core_node3 x:collection1_shard1_replica_t1] o.a.s.m.r.SolrJmxReporter JMX monitoring for 'solr_55195.solr.core.collection1.shard1.replica_t1' (registry 'solr.core.collection1.shard1.replica_t1') enabled at server: com.sun.jmx.mbeanserver.JmxMBeanServer@6217a7b5
   [junit4]   2> 909965 INFO  (qtp1755710223-9846) [n:127.0.0.1:55195_solr c:collection1 s:shard1 r:core_node3 x:collection1_shard1_replica_t1] o.a.s.c.SolrCore solr.RecoveryStrategy.Builder
   [junit4]   2> 909965 INFO  (qtp1755710223-9846) [n:127.0.0.1:55195_solr c:collection1 s:shard1 r:core_node3 x:collection1_shard1_replica_t1] o.a.s.c.SolrCore [[collection1_shard1_replica_t1] ] Opening new SolrCore at [/Users/jenkins/workspace/Lucene-Solr-7.x-MacOSX/solr/build/solr-core/test/J1/temp/solr.cloud.TestCloudRecovery_99B2BAB6F8F0DDD8-001/tempDir-001/node1/collection1_shard1_replica_t1], dataDir=[/Users/jenkins/workspace/Lucene-Solr-7.x-MacOSX/solr/build/solr-core/test/J1/temp/solr.cloud.TestCloudRecovery_99B2BAB6F8F0DDD8-001/tempDir-001/node1/./collection1_shard1_replica_t1/data/]
   [junit4]   2> 909968 INFO  (qtp1755710223-9844) [n:127.0.0.1:55195_solr c:collection1 s:shard2 r:core_node7 x:collection1_shard2_replica_t4] o.a.s.s.IndexSchema [collection1_shard2_replica_t4] Schema name=minimal
   [junit4]   2> 909970 INFO  (qtp1755710223-9844) [n:127.0.0.1:55195_solr c:collection1 s:shard2 r:core_node7 x:collection1_shard2_replica_t4] o.a.s.s.IndexSchema Loaded schema minimal/1.1 with uniqueid field id
   [junit4]   2> 909970 INFO  (qtp1755710223-9844) [n:127.0.0.1:55195_solr c:collection1 s:shard2 r:core_node7 x:collection1_shard2_replica_t4] o.a.s.c.CoreContainer Creating SolrCore 'collection1_shard2_replica_t4' using configuration from collection collection1, trusted=true
   [junit4]   2> 909970 INFO  (qtp1755710223-9844) [n:127.0.0.1:55195_solr c:collection1 s:shard2 r:core_node7 x:collection1_shard2_replica_t4] o.a.s.m.r.SolrJmxReporter JMX monitoring for 'solr_55195.solr.core.collection1.shard2.replica_t4' (registry 'solr.core.collection1.shard2.replica_t4') enabled at server: com.sun.jmx.mbeanserver.JmxMBeanServer@6217a7b5
   [junit4]   2> 909970 INFO  (qtp1755710223-9844) [n:127.0.0.1:55195_solr c:collection1 s:shard2 r:core_node7 x:collection1_shard2_replica_t4] o.a.s.c.SolrCore solr.RecoveryStrategy.Builder
   [junit4]   2> 909970 INFO  (qtp1755710223-9844) [n:127.0.0.1:55195_solr c:collection1 s:shard2 r:core_node7 x:collection1_shard2_replica_t4] o.a.s.c.SolrCore [[collection1_shard2_replica_t4] ] Opening new SolrCore at [/Users/jenkins/workspace/Lucene-Solr-7.x-MacOSX/solr/build/solr-core/test/J1/temp/solr.cloud.TestCloudRecovery_99B2BAB6F8F0DDD8-001/tempDir-001/node1/collection1_shard2_replica_t4], dataDir=[/Users/jenkins/workspace/Lucene-Solr-7.x-MacOSX/solr/build/solr-core/test/J1/temp/solr.cloud.TestCloudRecovery_99B2BAB6F8F0DDD8-001/tempDir-001/node1/./collection1_shard2_replica_t4/data/]
   [junit4]   2> 910042 INFO  (qtp1755710223-9844) [n:127.0.0.1:55195_solr c:collection1 s:shard2 r:core_node7 x:collection1_shard2_replica_t4] o.a.s.u.UpdateHandler Using UpdateLog implementation: org.apache.solr.update.UpdateLog
   [junit4]   2> 910042 INFO  (qtp1755710223-9844) [n:127.0.0.1:55195_solr c:collection1 s:shard2 r:core_node7 x:collection1_shard2_replica_t4] o.a.s.u.UpdateLog Initializing UpdateLog: dataDir=null defaultSyncLevel=FLUSH numRecordsToKeep=100 maxNumLogsToKeep=10 numVersionBuckets=65536
   [junit4]   2> 910044 INFO  (qtp1755710223-9844) [n:127.0.0.1:55195_solr c:collection1 s:shard2 r:core_node7 x:collection1_shard2_replica_t4] o.a.s.u.CommitTracker Hard AutoCommit: disabled
   [junit4]   2> 910044 INFO  (qtp1755710223-9844) [n:127.0.0.1:55195_solr c:collection1 s:shard2 r:core_node7 x:collection1_shard2_replica_t4] o.a.s.u.CommitTracker Soft AutoCommit: disabled
   [junit4]   2> 910047 INFO  (qtp341015423-9852) [n:127.0.0.1:55196_solr c:collection1 s:shard2 r:core_node8 x:collection1_shard2_replica_t6] o.a.s.u.UpdateHandler Using UpdateLog implementation: org.apache.solr.update.UpdateLog
   [junit4]   2> 910047 INFO  (qtp341015423-9852) [n:127.0.0.1:55196_solr c:collection1 s:shard2 r:core_node8 x:collection1_shard2_replica_t6] o.a.s.u.UpdateLog Initializing UpdateLog: dataDir=null defaultSyncLevel=FLUSH numRecordsToKeep=100 maxNumLogsToKeep=10 numVersionBuckets=65536
   [junit4]   2> 910049 INFO  (qtp341015423-9852) [n:127.0.0.1:55196_solr c:collection1 s:shard2 r:core_node8 x:collection1_shard2_replica_t6] o.a.s.u.CommitTracker Hard AutoCommit: disabled
   [junit4]   2> 910049 INFO  (qtp341015423-9852) [n:127.0.0.1:55196_solr c:collection1 s:shard2 r:core_node8 x:collection1_shard2_replica_t6] o.a.s.u.CommitTracker Soft AutoCommit: disabled
   [junit4]   2> 910049 INFO  (qtp1755710223-9846) [n:127.0.0.1:55195_solr c:collection1 s:shard1 r:core_node3 x:collection1_shard1_replica_t1] o.a.s.u.UpdateHandler Using UpdateLog implementation: org.apache.solr.update.UpdateLog
   [junit4]   2> 910049 INFO  (qtp1755710223-9846) [n:127.0.0.1:55195_solr c:collection1 s:shard1 r:core_node3 x:collection1_shard1_replica_t1] o.a.s.u.UpdateLog Initializing UpdateLog: dataDir=null defaultSyncLevel=FLUSH numRecordsToKeep=100 maxNumLogsToKeep=10 numVersionBuckets=65536
   [junit4]   2> 910051 INFO  (qtp1755710223-9846) [n:127.0.0.1:55195_solr c:collection1 s:shard1 r:core_node3 x:collection1_shard1_replica_t1] o.a.s.u.CommitTracker Hard AutoCommit: disabled
   [junit4]   2> 910051 INFO  (qtp1755710223-9846) [n:127.0.0.1:55195_solr c:collection1 s:shard1 r:core_node3 x:collection1_shard1_replica_t1] o.a.s.u.CommitTracker Soft AutoCommit: disabled
   [junit4]   2> 910051 INFO  (qtp341015423-9852) [n:127.0.0.1:55196_solr c:collection1 s:shard2 r:core_node8 x:collection1_shard2_replica_t6] o.a.s.s.SolrIndexSearcher Opening [Searcher@625a6687[collection1_shard2_replica_t6] main]
   [junit4]   2> 910053 INFO  (qtp1755710223-9844) [n:127.0.0.1:55195_solr c:collection1 s:shard2 r:core_node7 x:collection1_shard2_replica_t4] o.a.s.s.SolrIndexSearcher Opening [Searcher@64fdd33c[collection1_shard2_replica_t4] main]
   [junit4]   2> 910053 INFO  (qtp341015423-9852) [n:127.0.0.1:55196_solr c:collection1 s:shard2 r:core_node8 x:collection1_shard2_replica_t6] o.a.s.r.ManagedResourceStorage Configured ZooKeeperStorageIO with znodeBase: /configs/config
   [junit4]   2> 910053 INFO  (qtp341015423-9852) [n:127.0.0.1:55196_solr c:collection1 s:shard2 r:core_node8 x:collection1_shard2_replica_t6] o.a.s.r.ManagedResourceStorage Loaded null at path _rest_managed.json using ZooKeeperStorageIO:path=/configs/config
   [junit4]   2> 910054 INFO  (qtp341015423-9852) [n:127.0.0.1:55196_solr c:collection1 s:shard2 r:core_node8 x:collection1_shard2_replica_t6] o.a.s.h.ReplicationHandler Commits will be reserved for  10000
   [junit4]   2> 910054 INFO  (qtp341015423-9852) [n:127.0.0.1:55196_solr c:collection1 s:shard2 r:core_node8 x:collection1_shard2_replica_t6] o.a.s.u.UpdateLog Could not find max version in index or recent updates, using new clock 1577708973980647424
   [junit4]   2> 910054 INFO  (searcherExecutor-3285-thread-1-processing-n:127.0.0.1:55196_solr x:collection1_shard2_replica_t6 s:shard2 c:collection1 r:core_node8) [n:127.0.0.1:55196_solr c:collection1 s:shard2 r:core_node8 x:collection1_shard2_replica_t6] o.a.s.c.SolrCore [collection1_shard2_replica_t6] Registered new searcher Searcher@625a6687[collection1_shard2_replica_t6] main{ExitableDirectoryReader(UninvertingDirectoryReader())}
   [junit4]   2> 910055 INFO  (qtp1755710223-9844) [n:127.0.0.1:55195_solr c:collection1 s:shard2 r:core_node7 x:collection1_shard2_replica_t4] o.a.s.r.ManagedResourceStorage Configured ZooKeeperStorageIO with znodeBase: /configs/config
   [junit4]   2> 910056 INFO  (qtp1755710223-9844) [n:127.0.0.1:55195_solr c:collection1 s:shard2 r:core_node7 x:collection1_shard2_replica_t4] o.a.s.r.ManagedResourceStorage Loaded null at path _rest_managed.json using ZooKeeperStorageIO:path=/configs/config
   [junit4]   2> 910056 INFO  (qtp341015423-9854) [n:127.0.0.1:55196_solr c:collection1 s:shard1 r:core_node5 x:collection1_shard1_replica_t2] o.a.s.u.UpdateHandler Using UpdateLog implementation: org.apache.solr.update.UpdateLog
   [junit4]   2> 910056 INFO  (qtp341015423-9854) [n:127.0.0.1:55196_solr c:collection1 s:shard1 r:core_node5 x:collection1_shard1_replica_t2] o.a.s.u.UpdateLog Initializing UpdateLog: dataDir=null defaultSyncLevel=FLUSH numRecordsToKeep=100 maxNumLogsToKeep=10 numVersionBuckets=65536
   [junit4]   2> 910056 INFO  (qtp1755710223-9844) [n:127.0.0.1:55195_solr c:collection1 s:shard2 r:core_node7 x:collection1_shard2_replica_t4] o.a.s.h.ReplicationHandler Commits will be reserved for  10000
   [junit4]   2> 910057 INFO  (searcherExecutor-3287-thread-1-processing-n:127.0.0.1:55195_solr x:collection1_shard2_replica_t4 s:shard2 c:collection1 r:core_node7) [n:127.0.0.1:55195_solr c:collection1 s:shard2 r:core_node7 x:collection1_shard2_replica_t4] o.a.s.c.SolrCore [collection1_shard2_replica_t4] Registered new searcher Searcher@64fdd33c[collection1_shard2_replica_t4] main{ExitableDirectoryReader(UninvertingDirectoryReader())}
   [junit4]   2> 910057 INFO  (qtp1755710223-9844) [n:127.0.0.1:55195_solr c:collection1 s:shard2 r:core_node7 x:collection1_shard2_replica_t4] o.a.s.u.UpdateLog Could not find max version in index or recent updates, using new clock 1577708973983793152
   [junit4]   2> 910058 INFO  (qtp341015423-9854) [n:127.0.0.1:55196_solr c:collection1 s:shard1 r:core_node5 x:collection1_shard1_replica_t2] o.a.s.u.CommitTracker Hard AutoCommit: disabled
   [junit4]   2> 910058 INFO  (qtp341015423-9854) [n:127.0.0.1:55196_solr c:collection1 s:shard1 r:core_node5 x:collection1_shard1_replica_t2] o.a.s.u.CommitTracker Soft AutoCommit: disabled
   [junit4]   2> 910059 INFO  (qtp1755710223-9846) [n:127.0.0.1:55195_solr c:collection1 s:shard1 r:core_node3 x:collection1_shard1_replica_t1] o.a.s.s.SolrIndexSearcher Opening [Searcher@3677a40[collection1_shard1_replica_t1] main]
   [junit4]   2> 910060 INFO  (qtp341015423-9852) [n:127.0.0.1:55196_solr c:collection1 s:shard2 r:core_node8 x:collection1_shard2_replica_t6] o.a.s.c.ShardLeaderElectionContext Waiting until we see more replicas up for shard shard2: total=2 found=1 timeoutin=9999ms
   [junit4]   2> 910061 INFO  (qtp341015423-9854) [n:127.0.0.1:55196_solr c:collection1 s:shard1 r:core_node5 x:collection1_shard1_replica_t2] o.a.s.s.SolrIndexSearcher Opening [Searcher@6fb283ab[collection1_shard1_replica_t2] main]
   [junit4]   2> 910061 INFO  (qtp1755710223-9846) [n:127.0.0.1:55195_solr c:collection1 s:shard1 r:core_node3 x:collection1_shard1_replica_t1] o.a.s.r.ManagedResourceStorage Configured ZooKeeperStorageIO with znodeBase: /configs/config
   [junit4]   2> 910062 INFO  (qtp1755710223-9846) [n:127.0.0.1:55195_solr c:collection1 s:shard1 r:core_node3 x:collection1_shard1_replica_t1] o.a.s.r.ManagedResourceStorage Loaded null at path _rest_managed.json using ZooKeeperStorageIO:path=/configs/config
   [junit4]   2> 910063 INFO  (qtp341015423-9854) [n:127.0.0.1:55196_solr c:collection1 s:shard1 r:core_node5 x:collection1_shard1_replica_t2] o.a.s.r.ManagedResourceStorage Configured ZooKeeperStorageIO with znodeBase: /configs/config
   [junit4]   2> 910063 INFO  (qtp1755710223-9846) [n:127.0.0.1:55195_solr c:collection1 s:shard1 r:core_node3 x:collection1_shard1_replica_t1] o.a.s.h.ReplicationHandler Commits will be reserved for  10000
   [junit4]   2> 910063 INFO  (qtp1755710223-9846) [n:127.0.0.1:55195_solr c:collection1 s:shard1 r:core_node3 x:collection1_shard1_replica_t1] o.a.s.u.UpdateLog Could not find max version in index or recent updates, using new clock 1577708973990084608
   [junit4]   2> 910063 INFO  (qtp341015423-9854) [n:127.0.0.1:55196_solr c:collection1 s:shard1 r:core_node5 x:collection1_shard1_replica_t2] o.a.s.r.ManagedResourceStorage Loaded null at path _rest_managed.json using ZooKeeperStorageIO:path=/configs/config
   [junit4]   2> 910063 INFO  (searcherExecutor-3286-thread-1-processing-n:127.0.0.1:55195_solr x:collection1_shard1_replica_t1 s:shard1 c:collection1 r:core_node3) [n:127.0.0.1:55195_solr c:collection1 s:shard1 r:core_node3 x:collection1_shard1_replica_t1] o.a.s.c.SolrCore [collection1_shard1_replica_t1] Registered new searcher Searcher@3677a40[collection1_shard1_replica_t1] main{ExitableDirectoryReader(UninvertingDirectoryReader())}
   [junit4]   2> 910064 INFO  (qtp341015423-9854) [n:127.0.0.1:55196_solr c:collection1 s:shard1 r:core_node5 x:collection1_shard1_replica_t2] o.a.s.h.ReplicationHandler Commits will be reserved for  10000
   [junit4]   2> 910064 INFO  (searcherExecutor-3284-thread-1-processing-n:127.0.0.1:55196_solr x:collection1_shard1_replica_t2 s:shard1 c:collection1 r:core_node5) [n:127.0.0.1:55196_solr c:collection1 s:shard1 r:core_node5 x:collection1_shard1_replica_t2] o.a.s.c.SolrCore [collection1_shard1_replica_t2] Registered new searcher Searcher@6fb283ab[collection1_shard1_replica_t2] main{ExitableDirectoryReader(UninvertingDirectoryReader())}
   [junit4]   2> 910064 INFO  (qtp341015423-9854) [n:127.0.0.1:55196_solr c:collection1 s:shard1 r:core_node5 x:collection1_shard1_replica_t2] o.a.s.u.UpdateLog Could not find max version in index or recent updates, using new clock 1577708973991133184
   [junit4]   2> 910070 INFO  (qtp1755710223-9846) [n:127.0.0.1:55195_solr c:collection1 s:shard1 r:core_node3 x:collection1_shard1_replica_t1] o.a.s.c.ShardLeaderElectionContext Enough replicas found to continue.
   [junit4]   2> 910070 INFO  (qtp1755710223-9846) [n:127.0.0.1:55195_solr c:collection1 s:shard1 r:core_node3 x:collection1_shard1_replica_t1] o.a.s.c.ShardLeaderElectionContext I may be the new leader - try and sync
   [junit4]   2> 910070 INFO  (qtp1755710223-9846) [n:127.0.0.1:55195_solr c:collection1 s:shard1 r:core_node3 x:collection1_shard1_replica_t1] o.a.s.c.SyncStrategy Sync replicas to http://127.0.0.1:55195/solr/collection1_shard1_replica_t1/
   [junit4]   2> 910070 INFO  (qtp1755710223-9846) [n:127.0.0.1:55195_solr c:collection1 s:shard1 r:core_node3 x:collection1_shard1_replica_t1] o.a.s.u.PeerSync PeerSync: core=collection1_shard1_replica_t1 url=http://127.0.0.1:55195/solr START replicas=[http://127.0.0.1:55196/solr/collection1_shard1_replica_t2/] nUpdates=100
   [junit4]   2> 910072 INFO  (qtp341015423-9856) [n:127.0.0.1:55196_solr c:collection1 s:shard1 r:core_node5 x:collection1_shard1_replica_t2] o.a.s.c.S.Request [collection1_shard1_replica_t2]  webapp=/solr path=/get params={distrib=false&qt=/get&fingerprint=false&getVersions=100&wt=javabin&version=2} status=0 QTime=0
   [junit4]   2> 910174 INFO  (zkCallback-2737-thread-2-processing-n:127.0.0.1:55195_solr) [n:127.0.0.1:55195_solr    ] o.a.s.c.c.ZkStateReader A cluster state change: [WatchedEvent state:SyncConnected type:NodeDataChanged path:/collections/collection1/state.json] for collection [collection1] has occurred - updating... (live nodes size: [2])
   [junit4]   2> 910174 INFO  (zkCallback-2737-thread-1-processing-n:127.0.0.1:55195_solr) [n:127.0.0.1:55195_solr    ] o.a.s.c.c.ZkStateReader A cluster state change: [WatchedEvent state:SyncConnected type:NodeDataChanged path:/collections/collection1/state.json] for collection [collection1] has occurred - updating... (live nodes size: [2])
   [junit4]   2> 910174 INFO  (zkCallback-2738-thread-2-processing-n:127.0.0.1:55196_solr) [n:127.0.0.1:55196_solr    ] o.a.s.c.c.ZkStateReader A cluster state change: [WatchedEvent state:SyncConnected type:NodeDataChanged path:/collections/collection1/state.json] for collection [collection1] has occurred - updating... (live nodes size: [2])
   [junit4]   2> 910174 INFO  (zkCallback-2738-thread-1-processing-n:127.0.0.1:55196_solr) [n:127.0.0.1:55196_solr    ] o.a.s.c.c.ZkStateReader A cluster state change: [WatchedEvent state:SyncConnected type:NodeDataChanged path:/collections/collection1/state.json] for collection [collection1] has occurred - updating... (live nodes size: [2])
   [junit4]   2> 910375 INFO  (qtp1755710223-9846) [n:127.0.0.1:55195_solr c:collection1 s:shard1 r:core_node3 x:collection1_shard1_replica_t1] o.a.s.u.PeerSync PeerSync: core=collection1_shard1_replica_t1 url=http://127.0.0.1:55195/solr DONE.  We have no versions.  sync failed.
   [junit4]   2> 910376 INFO  (qtp1755710223-9846) [n:127.0.0.1:55195_solr c:collection1 s:shard1 r:core_node3 x:collection1_shard1_replica_t1] o.a.s.c.SyncStrategy Leader's attempt to sync with shard failed, moving to the next candidate
   [junit4]   2> 910376 INFO  (qtp1755710223-9846) [n:127.0.0.1:55195_solr c:collection1 s:shard1 r:core_node3 x:collection1_shard1_replica_t1] o.a.s.c.ShardLeaderElectionContext We failed sync, but we have no versions - we can't sync in that case - we were active before, so become leader anyway
   [junit4]   2> 910376 INFO  (qtp1755710223-9846) [n:127.0.0.1:55195_solr c:collection1 s:shard1 r:core_node3 x:collection1_shard1_replica_t1] o.a.s.c.ShardLeaderElectionContext Found all replicas participating in election, clear LIR
   [junit4]   2> 910377 INFO  (qtp1755710223-9846) [n:127.0.0.1:55195_solr c:collection1 s:shard1 r:core_node3 x:collection1_shard1_replica_t1] o.a.s.c.ZkController collection1_shard1_replica_t1 stopping background replication from leader
   [junit4]   2> 910387 INFO  (qtp1755710223-9846) [n:127.0.0.1:55195_solr c:collection1 s:shard1 r:core_node3 x:collection1_shard1_replica_t1] o.a.s.c.ShardLeaderElectionContext I am the new leader: http://127.0.0.1:55195/solr/collection1_shard1_replica_t1/ shard1
   [junit4]   2> 910499 INFO  (zkCallback-2738-thread-1-processing-n:127.0.0.1:55196_solr) [n:127.0.0.1:55196_solr    ] o.a.s.c.c.ZkStateReader A cluster state change: [WatchedEvent state:SyncConnected type:NodeDataChanged path:/collections/collection1/state.json] for collection [collection1] has occurred - updating... (live nodes size: [2])
   [junit4]   2> 910499 INFO  (zkCallback-2737-thread-1-processing-n:127.0.0.1:55195_solr) [n:127.0.0.1:55195_solr    ] o.a.s.c.c.ZkStateReader A cluster state change: [WatchedEvent state:SyncConnected type:NodeDataChanged path:/collections/collection1/state.json] for collection [collection1] has occurred - updating... (live nodes size: [2])
   [junit4]   2> 910499 INFO  (zkCallback-2737-thread-2-processing-n:127.0.0.1:55195_solr) [n:127.0.0.1:55195_solr    ] o.a.s.c.c.ZkStateReader A cluster state change: [WatchedEvent state:SyncConnected type:NodeDataChanged path:/collections/collection1/state.json] for collection [collection1] has occurred - updating... (live nodes size: [2])
   [junit4]   2> 910499 INFO  (zkCallback-2738-thread-2-processing-n:127.0.0.1:55196_solr) [n:127.0.0.1:55196_solr    ] o.a.s.c.c.ZkStateReader A cluster state change: [WatchedEvent state:SyncConnected type:NodeDataChanged path:/collections/collection1/state.json] for collection [collection1] has occurred - updating... (live nodes size: [2])
   [junit4]   2> 910550 INFO  (qtp1755710223-9846) [n:127.0.0.1:55195_solr c:collection1 s:shard1 r:core_node3 x:collection1_shard1_replica_t1] o.a.s.c.ZkController I am the leader, no recovery necessary
   [junit4]   2> 910555 INFO  (qtp1755710223-9846) [n:127.0.0.1:55195_solr c:collection1 s:shard1 r:core_node3 x:collection1_shard1_replica_t1] o.a.s.s.HttpSolrCall [admin] webapp=null path=/admin/cores params={qt=/admin/cores&coreNodeName=core_node3&collection.configName=config&newCollection=true&name=collection1_shard1_replica_t1&action=CREATE&numShards=2&collection=collection1&shard=shard1&wt=javabin&version=2&replicaType=TLOG} status=0 QTime=1663
   [junit4]   2> 910562 INFO  (qtp341015423-9852) [n:127.0.0.1:55196_solr c:collection1 s:shard2 r:core_node8 x:collection1_shard2_replica_t6] o.a.s.c.ShardLeaderElectionContext Enough replicas found to continue.
   [junit4]   2> 910562 INFO  (qtp341015423-9852) [n:127.0.0.1:55196_solr c:collection1 s:shard2 r:core_node8 x:collection1_shard2_replica_t6] o.a.s.c.ShardLeaderElectionContext I may be the new leader - try and sync
   [junit4]   2> 910562 INFO  (qtp341015423-9852) [n:127.0.0.1:55196_solr c:collection1 s:shard2 r:core_node8 x:collection1_shard2_replica_t6] o.a.s.c.SyncStrategy Sync replicas to http://127.0.0.1:55196/solr/collection1_shard2_replica_t6/
   [junit4]   2> 910562 INFO  (qtp341015423-9852) [n:127.0.0.1:55196_solr c:collection1 s:shard2 r:core_node8 x:collection1_shard2_replica_t6] o.a.s.u.PeerSync PeerSync: core=collection1_shard2_replica_t6 url=http://127.0.0.1:55196/solr START replicas=[http://127.0.0.1:55195/solr/collection1_shard2_replica_t4/] nUpdates=100
   [junit4]   2> 910565 INFO  (qtp1755710223-9848) [n:127.0.0.1:55195_solr c:collection1 s:shard2 r:core_node7 x:collection1_shard2_replica_t4] o.a.s.c.S.Request [collection1_shard2_replica_t4]  webapp=/solr path=/get params={distrib=false&qt=/get&fingerprint=false&getVersions=100&wt=javabin&version=2} status=0 QTime=0
   [junit4]   2> 910668 INFO  (zkCallback-2737-thread-2-processing-n:127.0.0.1:55195_solr) [n:127.0.0.1:55195_solr    ] o.a.s.c.c.ZkStateReader A cluster state change: [WatchedEvent state:SyncConnected type:NodeDataChanged path:/collections/collection1/state.json] for collection [collection1] has occurred - updating... (live nodes size: [2])
   [junit4]   2> 910668 INFO  (zkCallback-2737-thread-1-processing-n:127.0.0.1:55195_solr) [n:127.0.0.1:55195_solr    ] o.a.s.c.c.ZkStateReader A cluster state change: [WatchedEvent state:SyncConnected type:NodeDataChanged path:/collections/collection1/state.json] for collection [collection1] has occurred - updating... (live nodes size: [2])
   [junit4]   2> 910668 INFO  (zkCallback-2738-thread-1-processing-n:127.0.0.1:55196_solr) [n:127.0.0.1:55196_solr    ] o.a.s.c.c.ZkStateReader A cluster state change: [WatchedEvent state:SyncConnected type:NodeDataChanged path:/collections/collection1/state.json] for collection [collection1] has occurred - updating... (live nodes size: [2])
   [junit4]   2> 910668 INFO  (zkCallback-2738-thread-2-processing-n:127.0.0.1:55196_solr) [n:127.0.0.1:55196_solr    ] o.a.s.c.c.ZkStateReader A cluster state change: [WatchedEvent state:SyncConnected type:NodeDataChanged path:/collections/collection1/state.json] for collection [collection1] has occurred - updating... (live nodes size: [2])
   [junit4]   2> 910863 INFO  (qtp341015423-9852) [n:127.0.0.1:55196_solr c:collection1 s:shard2 r:core_node8 x:collection1_shard2_replica_t6] o.a.s.u.PeerSync PeerSync: core=collection1_shard2_replica_t6 url=http://127.0.0.1:55196/solr DONE.  We have no versions.  sync failed.
   [junit4]   2> 910863 INFO  (qtp341015423-9852) [n:127.0.0.1:55196_solr c:collection1 s:shard2 r:core_node8 x:collection1_shard2_replica_t6] o.a.s.c.SyncStrategy Leader's attempt to sync with shard failed, moving to the next candidate
   [junit4]   2> 910863 INFO  (qtp341015423-9852) [n:127.0.0.1:55196_solr c:collection1 s:shard2 r:core_node8 x:collection1_shard2_replica_t6] o.a.s.c.ShardLeaderElectionContext We failed sync, but we have no versions - we can't sync in that case - we were active before, so become leader anyway
   [junit4]   2> 910863 INFO  (qtp341015423-9852) [n:127.0.0.1:55196_solr c:collection1 s:shard2 r:core_node8 x:collection1_shard2_replica_t6] o.a.s.c.ShardLeaderElectionContext Found all replicas participating in election, clear LIR
   [junit4]   2> 910864 INFO  (qtp341015423-9852) [n:127.0.0.1:55196_solr c:collection1 s:shard2 r:core_node8 x:collection1_shard2_replica_t6] o.a.s.c.ZkController collection1_shard2_replica_t6 stopping background replication from leader
   [junit4]   2> 910872 INFO  (qtp341015423-9852) [n:127.0.0.1:55196_solr c:collection1 s:shard2 r:core_node8 x:collection1_shard2_replica_t6] o.a.s.c.ShardLeaderElectionContext I am the new leader: http://127.0.0.1:55196/solr/collection1_shard2_replica_t6/ shard2
   [junit4]   2> 910978 INFO  (zkCallback-2738-thread-2-processing-n:127.0.0.1:55196_solr) [n:127.0.0.1:55196_solr    ] o.a.s.c.c.ZkStateReader A cluster state change: [WatchedEvent state:SyncConnected type:NodeDataChanged path:/collections/collection1/state.json] for collection [collection1] has occurred - updating... (live nodes size: [2])
   [junit4]   2> 910979 INFO  (zkCallback-2737-thread-2-processing-n:127.0.0.1:55195_solr) [n:127.0.0.1:55195_solr    ] o.a.s.c.c.ZkStateReader A cluster state change: [WatchedEvent state:SyncConnected type:NodeDataChanged path:/collections/collection1/state.json] for collection [collection1] has occurred - updating... (live nodes size: [2])
   [junit4]   2> 910979 INFO  (zkCallback-2738-thread-1-processing-n:127.0.0.1:55196_solr) [n:127.0.0.1:55196_solr    ] o.a.s.c.c.ZkStateReader A cluster state change: [WatchedEvent state:SyncConnected type:NodeDataChanged path:/collections/collection1/state.json] for collection [collection1] has occurred - updating... (live nodes size: [2])
   [junit4]   2> 910978 INFO  (zkCallback-2737-thread-1-processing-n:127.0.0.1:55195_solr) [n:127.0.0.1:55195_solr    ] o.a.s.c.c.ZkStateReader A cluster state change: [WatchedEvent state:SyncConnected type:NodeDataChanged path:/collections/collection1/state.json] for collection [collection1] has occurred - updating... (live nodes size: [2])
   [junit4]   2> 910982 INFO  (qtp341015423-9852) [n:127.0.0.1:55196_solr c:collection1 s:shard2 r:core_node8 x:collection1_shard2_replica_t6] o.a.s.c.ZkController I am the leader, no recovery necessary
   [junit4]   2> 910984 INFO  (qtp341015423-9852) [n:127.0.0.1:55196_solr c:collection1 s:shard2 r:core_node8 x:collection1_shard2_replica_t6] o.a.s.s.HttpSolrCall [admin] webapp=null path=/admin/cores params={qt=/admin/cores&coreNodeName=core_node8&collection.configName=config&newCollection=true&name=collection1_shard2_replica_t6&action=CREATE&numShards=2&collection=collection1&shard=shard2&wt=javabin&version=2&replicaType=TLOG} status=0 QTime=2091
   [junit4]   2> 911080 INFO  (qtp1755710223-9844) [n:127.0.0.1:55195_solr c:collection1 s:shard2 r:core_node7 x:collection1_shard2_replica_t4] o.a.s.c.ZkController collection1_shard2_replica_t4 starting background replication from leader
   [junit4]   2> 911080 INFO  (qtp341015423-9854) [n:127.0.0.1:55196_solr c:collection1 s:shard1 r:core_node5 x:collection1_shard1_replica_t2] o.a.s.c.ZkController collection1_shard1_replica_t2 starting background replication from leader
   [junit4]   2> 911080 INFO  (qtp1755710223-9844) [n:127.0.0.1:55195_solr c:collection1 s:shard2 r:core_node7 x:collection1_shard2_replica_t4] o.a.s.c.ReplicateFromLeader Will start replication from leader with poll interval: 00:00:03
   [junit4]   2> 911080 INFO  (qtp341015423-9854) [n:127.0.0.1:55196_solr c:collection1 s:shard1 r:core_node5 x:collection1_shard1_replica_t2] o.a.s.c.ReplicateFromLeader Will start replication from leader with poll interval: 00:00:03
   [junit4]   2> 911089 INFO  (qtp341015423-9854) [n:127.0.0.1:55196_solr c:collection1 s:shard1 r:core_node5 x:collection1_shard1_replica_t2] o.a.s.h.ReplicationHandler Poll scheduled at an interval of 3000ms
   [junit4]   2> 911089 INFO  (qtp1755710223-9844) [n:127.0.0.1:55195_solr c:collection1 s:shard2 r:core_node7 x:collection1_shard2_replica_t4] o.a.s.h.ReplicationHandler Poll scheduled at an interval of 3000ms
   [junit4]   2> 911089 INFO  (indexFetcher-3307-thread-1) [n:127.0.0.1:55195_solr c:collection1 s:shard2 r:core_node7 x:collection1_shard2_replica_t4] o.a.s.h.IndexFetcher Replica core_node8 is leader but it's state is down, skipping replication
   [junit4]   2> 911091 INFO  (zkCallback-2737-thread-1-processing-n:127.0.0.1:55195_solr) [n:127.0.0.1:55195_solr    ] o.a.s.c.c.ZkStateReader A cluster state change: [WatchedEvent state:SyncConnected type:NodeDataChanged path:/collections/collection1/state.json] for collection [collection1] has occurred - updating... (live nodes size: [2])
   [junit4]   2> 911091 INFO  (zkCallback-2737-thread-2-processing-n:127.0.0.1:55195_solr) [n:127.0.0.1:55195_solr    ] o.a.s.c.c.ZkStateReader A cluster state change: [WatchedEvent state:SyncConnected type:NodeDataChanged path:/collections/collection1/state.json] for collection [collection1] has occurred - updating... (live nodes size: [2])
   [junit4]   2> 911092 INFO  (zkCallback-2738-thread-1-processing-n:127.0.0.1:55196_solr) [n:127.0.0.1:55196_solr    ] o.a.s.c.c.ZkStateReader A cluster state change: [WatchedEvent state:SyncConnected type:NodeDataChanged path:/collections/collection1/state.json] for collection [collection1] has occurred - updating... (live nodes size: [2])
   [junit4]   2> 911092 INFO  (zkCallback-2738-thread-2-processing-n:127.0.0.1:55196_solr) [n:127.0.0.1:55196_solr    ] o.a.s.c.c.ZkStateReader A cluster state change: [WatchedEvent state:SyncConnected type:NodeDataChanged path:/collections/collection1/state.json] for collection [collection1] has occurred - updating... (live nodes size: [2])
   [junit4]   2> 911093 INFO  (qtp341015423-9854) [n:127.0.0.1:55196_solr c:collection1 s:shard1 r:core_node5 x:collection1_shard1_replica_t2] o.a.s.s.HttpSolrCall [admin] webapp=null path=/admin/cores params={qt=/admin/cores&coreNodeName=core_node5&collection.configName=config&newCollection=true&name=collection1_shard1_replica_t2&action=CREATE&numShards=2&collection=collection1&shard=shard1&wt=javabin&version=2&replicaType=TLOG} status=0 QTime=2199
   [junit4]   2> 911093 INFO  (qtp1755710223-9844) [n:127.0.0.1:55195_solr c:collection1 s:shard2 r:core_node7 x:collection1_shard2_replica_t4] o.a.s.s.HttpSolrCall [admin] webapp=null path=/admin/cores params={qt=/admin/cores&coreNodeName=core_node7&collection.configName=config&newCollection=true&name=collection1_shard2_replica_t4&action=CREATE&numShards=2&collection=collection1&shard=shard2&wt=javabin&version=2&replicaType=TLOG} status=0 QTime=2201
   [junit4]   2> 911098 INFO  (qtp1755710223-9843) [n:127.0.0.1:55195_solr    ] o.a.s.h.a.CollectionsHandler Wait for new collection to be active for at most 30 seconds. Check all shard replicas
   [junit4]   2> 911215 INFO  (zkCallback-2737-thread-1-processing-n:127.0.0.1:55195_solr) [n:127.0.0.1:55195_solr    ] o.a.s.c.c.ZkStateReader A cluster state change: [WatchedEvent state:SyncConnected type:NodeDataChanged path:/collections/collection1/state.json] for collection [collection1] has occurred - updating... (live nodes size: [2])
   [junit4]   2> 911215 INFO  (zkCallback-2738-thread-1-processing-n:127.0.0.1:55196_solr) [n:127.0.0.1:55196_solr    ] o.a.s.c.c.ZkStateReader A cluster state change: [WatchedEvent state:SyncConnected type:NodeDataChanged path:/collections/collection1/state.json] for collection [collection1] has occurred - updating... (live nodes size: [2])
   [junit4]   2> 911215 INFO  (zkCallback-2737-thread-2-processing-n:127.0.0.1:55195_solr) [n:127.0.0.1:55195_solr    ] o.a.s.c.c.ZkStateReader A cluster state change: [WatchedEvent state:SyncConnected type:NodeDataChanged path:/collections/collection1/state.json] for collection [collection1] has occurred - updating... (live nodes size: [2])
   [junit4]   2> 911215 INFO  (zkCallback-2738-thread-2-processing-n:127.0.0.1:55196_solr) [n:127.0.0.1:55196_solr    ] o.a.s.c.c.ZkStateReader A cluster state change: [WatchedEvent state:SyncConnected type:NodeDataChanged path:/collections/collection1/state.json] for collection [collection1] has occurred - updating... (live nodes size: [2])
   [junit4]   2> 912105 INFO  (qtp1755710223-9843) [n:127.0.0.1:55195_solr    ] o.a.s.s.HttpSolrCall [admin] webapp=null path=/admin/collections params={pullReplicas=0&replicationFactor=0&collection.configName=config&maxShardsPerNode=2&name=collection1&nrtReplicas=0&action=CREATE&numShards=2&tlogReplicas=2&wt=javabin&version=2} status=0 QTime=3584
   [junit4]   2> 912106 INFO  (SUITE-TestCloudRecovery-seed#[99B2BAB6F8F0DDD8]-worker) [    ] o.a.s.c.AbstractDistribZkTestBase Wait for recoveries to finish - collection: collection1 failOnTimeout:true timeout (sec):30
   [junit4]   2> 912107 INFO  (SUITE-TestCloudRecovery-seed#[99B2BAB6F8F0DDD8]-worker) [    ] o.a.s.c.AbstractDistribZkTestBase Recoveries finished - collection: collection1
   [junit4]   2> 912129 INFO  (TEST-TestCloudRecovery.leaderRecoverFromLogOnStartupTest-seed#[99B2BAB6F8F0DDD8]) [    ] o.a.s.SolrTestCaseJ4 ###Starting leaderRecoverFromLogOnStartupTest
   [junit4]   2> 912138 INFO  (qtp1755710223-9845) [n:127.0.0.1:55195_solr c:collection1 s:shard2 r:core_node7 x:collection1_shard2_replica_t4] o.a.s.u.p.LogUpdateProcessorFactory [collection1_shard2_replica_t4]  webapp=/solr path=/update params={update.distrib=FROMLEADER&_version_=-1577708976159588352&distrib.from=http://127.0.0.1:55196/solr/collection1_shard2_replica_t6/&wt=javabin&version=2}{deleteByQuery=*:* (-1577708976159588352)} 0 1
   [junit4]   2> 912139 INFO  (qtp341015423-9849) [n:127.0.0.1:55196_solr c:collection1 s:shard1 r:core_node5 x:collection1_shard1_replica_t2] o.a.s.u.p.LogUpdateProcessorFactory [collection1_shard1_replica_t2]  webapp=/solr path=/update params={update.distrib=FROMLEADER&_version_=-1577708976161685504&distrib.from=http://127.0.0.1:55195/solr/collection1_shard1_replica_t1/&wt=javabin&version=2}{deleteByQuery=*:* (-1577708976161685504)} 0 0
   [junit4]   2> 912140 INFO  (qtp1755710223-9841) [n:127.0.0.1:55195_solr c:collection1 s:shard1 r:core_node3 x:collection1_shard1_replica_t1] o.a.s.u.p.LogUpdateProcessorFactory [collection1_shard1_replica_t1]  webapp=/solr path=/update params={update.distrib=TOLEADER&distrib.from=http://127.0.0.1:55196/solr/collection1_shard2_replica_t6/&wt=javabin&version=2}{deleteByQuery=*:* (-1577708976161685504)} 0 6
   [junit4]   2> 912141 INFO  (qtp341015423-9857) [n:127.0.0.1:55196_solr c:collection1 s:shard2 r:core_node8 x:collection1_shard2_replica_t6] o.a.s.u.p.LogUpdateProcessorFactory [collection1_shard2_replica_t6]  webapp=/solr path=/update params={wt=javabin&version=2}{deleteByQuery=*:* (-1577708976159588352)} 0 9
   [junit4]   2> 912144 INFO  (qtp1755710223-9846) [n:127.0.0.1:55195_solr c:collection1 s:shard1 r:core_node3 x:collection1_shard1_replica_t1] o.a.s.u.DirectUpdateHandler2 start commit{_version_=1577708976172171264,optimize=false,openSearcher=true,waitSearcher=true,expungeDeletes=false,softCommit=false,prepareCommit=false}
   [junit4]   2> 912144 INFO  (qtp1755710223-9846) [n:127.0.0.1:55195_solr c:collection1 s:shard1 r:core_node3 x:collection1_shard1_replica_t1] o.a.s.u.DirectUpdateHandler2 No uncommitted changes. Skipping IW.commit.
   [junit4]   2> 912145 INFO  (qtp1755710223-9846) [n:127.0.0.1:55195_solr c:collection1 s:shard1 r:core_node3 x:collection1_shard1_replica_t1] o.a.s.u.DirectUpdateHandler2 end_commit_flush
   [junit4]   2> 912145 INFO  (qtp1755710223-9846) [n:127.0.0.1:55195_solr c:collection1 s:shard1 r:core_node3 x:collection1_shard1_replica_t1] o.a.s.u.p.LogUpdateProcessorFactory [collection1_shard1_replica_t1]  webapp=/solr path=/update params={update.distrib=FROMLEADER&waitSearcher=true&openSearcher=true&commit=true&softCommit=false&distrib.from=http://127.0.0.1:55196/solr/collection1_shard2_replica_t6/&commit_end_point=true&wt=javabin&version=2&expungeDeletes=false}{commit=} 0 1
   [junit4]   2> 912146 INFO  (qtp341015423-9856) [n:127.0.0.1:55196_solr c:collection1 s:shard1 r:core_node5 x:collection1_shard1_replica_t2] o.a.s.u.TestInjection Start waiting for replica in sync with leader
   [junit4]   2> 912147 INFO  (qtp1755710223-9847) [n:127.0.0.1:55195_solr c:collection1 s:shard2 r:core_node7 x:collection1_shard2_replica_t4] o.a.s.u.TestInjection Start waiting for replica in sync with leader
   [junit4]   2> 912149 INFO  (qtp341015423-9852) [n:127.0.0.1:55196_solr c:collection1 s:shard2 r:core_node8 x:collection1_shard2_replica_t6] o.a.s.u.DirectUpdateHandler2 start commit{_version_=1577708976177414144,optimize=false,openSearcher=true,waitSearcher=true,expungeDeletes=false,softCommit=false,prepareCommit=false}
   [junit4]   2> 912149 INFO  (qtp341015423-9852) [n:127.0.0.1:55196_solr c:collection1 s:shard2 r:core_node8 x:collection1_shard2_replica_t6] o.a.s.u.DirectUpdateHandler2 No uncommitted changes. Skipping IW.commit.
   [junit4]   2> 912149 INFO  (qtp341015423-9852) [n:127.0.0.1:55196_solr c:collection1 s:shard2 r:core_node8 x:collection1_shard2_replica_t6] o.a.s.u.DirectUpdateHandler2 end_commit_flush
   [junit4]   2> 912150 INFO  (qtp341015423-9852) [n:127.0.0.1:55196_solr c:collection1 s:shard2 r:core_node8 x:collection1_shard2_replica_t6] o.a.s.u.p.LogUpdateProcessorFactory [collection1_shard2_replica_t6]  webapp=/solr path=/update params={update.distrib=FROMLEADER&waitSearcher=true&openSearcher=true&commit=true&softCommit=false&distrib.from=http://127.0.0.1:55196/solr/collection1_shard2_replica_t6/&commit_end_point=true&wt=javabin&version=2&expungeDeletes=false}{commit=} 0 2
   [junit4]   2> 912154 INFO  (qtp1755710223-9848) [n:127.0.0.1:55195_solr c:collection1 s:shard1 r:core_node3 x:collection1_shard1_replica_t1] o.a.s.c.S.Request [collection1_shard1_replica_t1]  webapp=/solr path=/replication params={qt=/replication&wt=javabin&version=2&command=details} status=0 QTime=4
   [junit4]   2> 912154 INFO  (qtp341015423-9854) [n:127.0.0.1:55196_solr c:collection1 s:shard2 r:core_node8 x:collection1_shard2_replica_t6] o.a.s.c.S.Request [collection1_shard2_replica_t6]  webapp=/solr path=/replication params={qt=/replication&wt=javabin&version=2&command=details} status=0 QTime=2
   [junit4]   2> 912539 INFO  (OverseerCollectionConfigSetProcessor-98606810742849541-127.0.0.1:55195_solr-n_0000000000) [n:127.0.0.1:55195_solr    ] o.a.s.c.OverseerTaskQueue Response ZK path: /overseer/collection-queue-work/qnr-0000000000 doesn't exist.  Requestor may have disconnected from ZooKeeper
   [junit4]   2> 912661 INFO  (qtp1755710223-9841) [n:127.0.0.1:55195_solr c:collection1 s:shard1 r:core_node3 x:collection1_shard1_replica_t1] o.a.s.c.S.Request [collection1_shard1_replica_t1]  webapp=/solr path=/replication params={qt=/replication&wt=javabin&version=2&command=details} status=0 QTime=0
   [junit4]   2> 912661 INFO  (qtp341015423-9857) [n:127.0.0.1:55196_solr c:collection1 s:shard2 r:core_node8 x:collection1_shard2_replica_t6] o.a.s.c.S.Request [collection1_shard2_replica_t6]  webapp=/solr path=/replication params={qt=/replication&wt=javabin&version=2&command=details} status=0 QTime=0
   [junit4]   2> 913172 INFO  (qtp1755710223-9844) [n:127.0.0.1:55195_solr c:collection1 s:shard1 r:core_node3 x:collection1_shard1_replica_t1] o.a.s.c.S.Request [collection1_shard1_replica_t1]  webapp=/solr path=/replication params={qt=/replication&wt=javabin&version=2&command=details} status=0 QTime=0
   [junit4]   2> 913172 INFO  (qtp341015423-9849) [n:127.0.0.1:55196_solr c:collection1 s:shard2 r:core_node8 x:collection1_shard2_replica_t6] o.a.s.c.S.Request [collection1_shard2_replica_t6]  webapp=/solr path=/replication params={qt=/replication&wt=javabin&version=2&command=details} status=0 QTime=0
   [junit4]   2> 913681 INFO  (qtp341015423-9854) [n:127.0.0.1:55196_solr c:collection1 s:shard2 r:core_node8 x:collection1_shard2_replica_t6] o.a.s.c.S.Request [collection1_shard2_replica_t6]  webapp=/solr path=/replication params={qt=/replication&wt=javabin&version=2&command=details} status=0 QTime=0
   [junit4]   2> 913681 INFO  (qtp1755710223-9848) [n:127.0.0.1:55195_solr c:collection1 s:shard1 r:core_node3 x:collection1_shard1_replica_t1] o.a.s.c.S.Request [collection1_shard1_replica_t1]  webapp=/solr path=/replication params={qt=/replication&wt=javabin&version=2&command=details} status=0 QTime=0
   [junit4]   2> 913707 INFO  (indexFetcher-3306-thread-1) [n:127.0.0.1:55196_solr c:collection1 s:shard1 r:core_node5 x:collection1_shard1_replica_t2] o.a.s.h.IndexFetcher Updated masterUrl to http://127.0.0.1:55195/solr/collection1_shard1_replica_t1/
   [junit4]   2> 913708 INFO  (qtp1755710223-9846) [n:127.0.0.1:55195_solr c:collection1 s:shard1 r:core_node3 x:collection1_shard1_replica_t1] o.a.s.c.S.Request [collection1_shard1_replica_t1]  webapp=/solr path=/replication params={qt=/replication&wt=javabin&version=2&command=indexversion} status=0 QTime=0
   [junit4]   2> 913709 INFO  (indexFetcher-3306-thread-1) [n:127.0.0.1:55196_solr c:collection1 s:shard1 r:core_node5 x:collection1_shard1_replica_t2] o.a.s.h.IndexFetcher Master's generation: 1
   [junit4]   2> 913709 INFO  (indexFetcher-3306-thread-1) [n:127.0.0.1:55196_solr c:collection1 s:shard1 r:core_node5 x:collection1_shard1_replica_t2] o.a.s.h.IndexFetcher Master's version: 0
   [junit4]   2> 913709 INFO  (indexFetcher-3306-thread-1) [n:127.0.0.1:55196_solr c:collection1 s:shard1 r:core_node5 x:collection1_shard1_replica_t2] o.a.s.h.IndexFetcher Slave's generation: 1
   [junit4]   2> 913709 INFO  (indexFetcher-3306-thread-1) [n:127.0.0.1:55196_solr c:collection1 s:shard1 r:core_node5 x:collection1_shard1_replica_t2] o.a.s.h.IndexFetcher Slave's version: 0
   [junit4]   2> 914099 INFO  (indexFetcher-3307-thread-1) [n:127.0.0.1:55195_solr c:collection1 s:shard2 r:core_node7 x:collection1_shard2_replica_t4] o.a.s.h.IndexFetcher Last replication failed, so I'll force replication
   [junit4]   2> 914099 INFO  (indexFetcher-3307-thread-1) [n:127.0.0.1:55195_solr c:collection1 s:shard2 r:core_node7 x:collection1_shard2_replica_t4] o.a.s.h.IndexFetcher Updated masterUrl to http://127.0.0.1:55196/solr/collection1_shard2_replica_t6/
   [junit4]   2> 914100 INFO  (qtp341015423-9852) [n:127.0.0.1:55196_solr c:collection1 s:shard2 r:core_node8 x:collection1_shard2_replica_t6] o.a.s.c.S.Request [collection1_shard2_replica_t6]  webapp=/solr path=/replication params={qt=/replication&wt=javabin&version=2&command=indexversion} status=0 QTime=0
   [junit4]   2> 914100 INFO  (indexFetcher-3307-thread-1) [n:127.0.0.1:55195_solr c:collection1 s:shard2 r:core_node7 x:collection1_shard2_replica_t4] o.a.s.h.IndexFetcher Master's generation: 1
   [junit4]   2> 914100 INFO  (indexFetcher-3307-thread-1) [n:127.0.0.1:55195_solr c:collection1 s:shard2 r:core_node7 x:collection1_shard2_replica_t4] o.a.s.h.IndexFetcher Master's version: 0
   [junit4]   2> 914100 INFO  (indexFetcher-3307-thread-1) [n:127.0.0.1:55195_solr c:collection1 s:shard2 r:core_node7 x:collection1_shard2_replica_t4] o.a.s.h.IndexFetcher Slave's generation: 1
   [junit4]   2> 914100 INFO  (indexFetcher-3307-thread-1) [n:127.0.0.1:55195_solr c:collection1 s:shard2 r:core_node7 x:collection1_shard2_replica_t4] o.a.s.h.IndexFetcher Slave's version: 0
   [junit4]   2> 914100 INFO  (indexFetcher-3307-thread-1) [n:127.0.0.1:55195_solr c:collection1 s:shard2 r:core_node7 x:collection1_shard2_replica_t4] o.a.s.h.IndexFetcher New index in Master. Deleting mine...
   [junit4]   2> 914101 INFO  (indexFetcher-3307-thread-1) [n:127.0.0.1:55195_solr c:collection1 s:shard2 r:core_node7 x:collection1_shard2_replica_t4] o.a.s.u.DirectUpdateHandler2 start commit{,optimize=false,openSearcher=true,waitSearcher=true,expungeDeletes=false,softCommit=false,prepareCommit=false}
   [junit4]   2> 914101 INFO  (indexFetcher-3307-thread-1) [n:127.0.0.1:55195_solr c:collection1 s:shard2 r:core_node7 x:collection1_shard2_replica_t4] o.a.s.u.SolrIndexWriter Calling setCommitData with IW:org.apache.solr.update.SolrIndexWriter@ae25734 commitCommandVersion:0
   [junit4]   2> 914112 INFO  (indexFetcher-3307-thread-1) [n:127.0.0.1:55195_solr c:collection1 s:shard2 r:core_node7 x:collection1_shard2_replica_t4] o.a.s.s.SolrIndexSearcher Opening [Searcher@1a3c44[collection1_shard2_replica_t4] main]
   [junit4]   2> 914112 INFO  (indexFetcher-3307-thread-1) [n:127.0.0.1:55195_solr c:collection1 s:shard2 r:core_node7 x:collection1_shard2_replica_t4] o.a.s.u.DirectUpdateHandler2 end_commit_flush
   [junit4]   2> 914116 INFO  (searcherExecutor-3287-thread-1-processing-n:127.0.0.1:55195_solr x:collection1_shard2_replica_t4 s:shard2 c:collection1 r:core_node7) [n:127.0.0.1:55195_solr c:collection1 s:shard2 r:core_node7 x:collection1_shard2_replica_t4] o.a.s.c.SolrCore [collection1_shard2_replica_t4] Registered new searcher Searcher@1a3c44[collection1_shard2_replica_t4] main{ExitableDirectoryReader(UninvertingDirectoryReader())}
   [junit4]   2> 914193 INFO  (qtp341015423-9853) [n:127.0.0.1:55196_solr c:collection1 s:shard2 r:core_node8 x:collection1_shard2_replica_t6] o.a.s.c.S.Request [collection1_shard2_replica_t6]  webapp=/solr path=/replication params={qt=/replication&wt=javabin&version=2&command=details} status=0 QTime=0
   [junit4]   2> 914193 INFO  (qtp1755710223-9841) [n:127.0.0.1:55195_solr c:collection1 s:shard1 r:core_node3 x:collection1_shard1_replica_t1] o.a.s.c.S.Request [collection1_shard1_replica_t1]  webapp=/solr path=/replication params={qt=/replication&wt=javabin&version=2&command=details} status=0 QTime=0
   [junit4]   2> 914701 INFO  (qtp341015423-9854) [n:127.0.0.1:55196_solr c:collection1 s:shard2 r:core_node8 x:collection1_shard2_replica_t6] o.a.s.c.S.Request [collection1_shard2_replica_t6]  webapp=/solr path=/replication params={qt=/replication&wt=javabin&version=2&command=details} status=0 QTime=0
   [junit4]   2> 914701 INFO  (qtp1755710223-9846) [n:127.0.0.1:55195_solr c:collection1 s:shard1 r:core_node3 x:collection1_shard1_replica_t1] o.a.s.c.S.Request [collection1_shard1_replica_t1]  webapp=/solr path=/replication params={qt=/replication&wt=javabin&version=2&command=details} status=0 QTime=0
   [junit4]   2> 915216 INFO  (qtp341015423-9857) [n:127.0.0.1:55196_solr c:collection1 s:shard2 r:core_node8 x:collection1_shard2_replica_t6] o.a.s.c.S.Request [collection1_shard2_replica_t6]  webapp=/solr path=/replication params={qt=/replication&wt=javabin&version=2&command=details} status=0 QTime=0
   [junit4]   2> 915216 INFO  (qtp1755710223-9845) [n:127.0.0.1:55195_solr c:collection1 s:shard1 r:core_node3 x:collection1_shard1_replica_t1] o.a.s.c.S.Request [collection1_shard1_replica_t1]  webapp=/solr path=/replication params={qt=/replication&wt=javabin&version=2&command=details} status=0 QTime=0
   [junit4]   2> 915725 INFO  (qtp1755710223-9845) [n:127.0.0.1:55195_solr c:collection1 s:shard1 r:core_node3 x:collection1_shard1_replica_t1] o.a.s.c.S.Request [collection1_shard1_replica_t1]  webapp=/solr path=/replication params={qt=/replication&wt=javabin&version=2&command=details} status=0 QTime=0
   [junit4]   2> 915725 INFO  (qtp341015423-9854) [n:127.0.0.1:55196_solr c:collection1 s:shard2 r:core_node8 x:collection1_shard2_replica_t6] o.a.s.c.S.Request [collection1_shard2_replica_t6]  webapp=/solr path=/replication params={qt=/replication&wt=javabin&version=2&command=details} status=0 QTime=0
   [junit4]   2> 916239 INFO  (qtp341015423-9852) [n:127.0.0.1:55196_solr c:collection1 s:shard2 r:core_node8 x:collection1_shard2_replica_t6] o.a.s.c.S.Request [collection1_shard2_replica_t6]  webapp=/solr path=/replication params={qt=/replication&wt=javabin&version=2&command=details} status=0 QTime=0
   [junit4]   2> 916239 INFO  (qtp1755710223-9844) [n:127.0.0.1:55195_solr c:collection1 s:shard1 r:core_node3 x:collection1_shard1_replica_t1] o.a.s.c.S.Request [collection1_shard1_replica_t1]  webapp=/solr path=/replication params={qt=/replication&wt=javabin&version=2&command=details} status=0 QTime=0
   [junit4]   2> 916716 INFO  (qtp1755710223-9841) [n:127.0.0.1:55195_solr c:collection1 s:shard1 r:core_node3 x:collection1_shard1_replica_t1] o.a.s.c.S.Request [collection1_shard1_replica_t1]  webapp=/solr path=/replication params={qt=/replication&wt=javabin&version=2&command=indexversion} status=0 QTime=0
   [junit4]   2> 916717 INFO  (indexFetcher-3306-thread-1) [n:127.0.0.1:55196_solr c:collection1 s:shard1 r:core_node5 x:collection1_shard1_replica_t2] o.a.s.h.IndexFetcher Master's generation: 1
   [junit4]   2> 916717 INFO  (indexFetcher-3306-thread-1) [n:127.0.0.1:55196_solr c:collection1 s:shard1 r:core_node5 x:collection1_shard1_replica_t2] o.a.s.h.IndexFetcher Master's version: 0
   [junit4]   2> 916717 INFO  (indexFetcher-3306-thread-1) [n:127.0.0.1:55196_solr c:collection1 s:shard1 r:core_node5 x:collection1_shard1_replica_t2] o.a.s.h.IndexFetcher Slave's generation: 1
   [junit4]   2> 916717 INFO  (indexFetcher-3306-thread-1) [n:127.0.0.1:55196_solr c:collection1 s:shard1 r:core_node5 x:collection1_shard1_replica_t2] o.a.s.h.IndexFetcher Slave's version: 0
   [junit4]   2> 916750 INFO  (qtp341015423-9853) [n:127.0.0.1:55196_solr c:collection1 s:shard2 r:core_node8 x:collection1_shard2_replica_t6] o.a.s.c.S.Request [collection1_shard2_replica_t6]  webapp=/solr path=/replication params={qt=/replication&wt=javabin&version=2&command=details} status=0 QTime=0
   [junit4]   2> 916750 INFO  (qtp1755710223-9846) [n:127.0.0.1:55195_solr c:collection1 s:shard1 r:core_node3 x:collection1_shard1_replica_t1] o.a.s.c.S.Request [collection1_shard1_replica_t1]  webapp=/solr path=/replication params={qt=/replication&wt=javabin&version=2&command=details} status=0 QTime=0
   [junit4]   2> 917099 INFO  (qtp341015423-9849) [n:127.0.0.1:55196_solr c:collection1 s:shard2 r:core_node8 x:collection1_shard2_replica_t6] o.a.s.c.S.Request [collection1_shard2_replica_t6]  webapp=/solr path=/replication params={qt=/replication&wt=javabin&version=2&command=indexversion} status=0 QTime=0
   [junit4]   2> 917100 INFO  (indexFetcher-3307-thread-1) [n:127.0.0.1:55195_solr c:collection1 s:shard2 r:core_node7 x:collection1_shard2_replica_t4] o.a.s.h.IndexFetcher Master's generation: 1
   [junit4]   2> 917100 INFO  (indexFetcher-3307-thread-1) [n:127.0.0.1:55195_solr c:collection1 s:shard2 r:core_node7 x:collection1_shard2_replica_t4] o.a.s.h.IndexFetcher Master's version: 0
   [junit4]   2> 917100 INFO  (indexFetcher-3307-thread-1) [n:127.0.0.1:55195_solr c:collection1 s:shard2 r:core_node7 x:collection1_shard2_replica_t4] o.a.s.h.IndexFetcher Slave's generation: 2
   [junit4]   2> 917100 INFO  (indexFetcher-3307-thread-1) [n:127.0.0.1:55195_solr c:collection1 s:shard2 r:core_node7 x:collection1_shard2_replica_t4] o.a.s.h.IndexFetcher Slave's version: 1504620531296
   [junit4]   2> 917258 INFO  (qtp1755710223-9841) [n:127.0.0.1:55195_solr c:collection1 s:shard1 r:core_node3 x:collection1_shard1_replica_t1] o.a.s.c.S.Request [collection1_shard1_replica_t1]  webapp=/solr path=/replication params={qt=/replication&wt=javabin&version=2&command=details} status=0 QTime=0
   [junit4]   2> 917258 INFO  (qtp341015423-9857) [n:127.0.0.1:55196_solr c:collection1 s:shard2 r:core_node8 x:collection1_shard2_replica_t6] o.a.s.c.S.Request [collection1_shard2_replica_t6]  webapp=/solr path=/replication params={qt=/replication&wt=javabin&version=2&command=details} status=0 QTime=0
   [junit4]   2> 917771 INFO  (qtp341015423-9853) [n:127.0.0.1:55196_solr c:collection1 s:shard2 r:core_node8 x:collection1_shard2_replica_t6] o.a.s.c.S.Request [collection1_shard2_replica_t6]  webapp=/solr path=/replication params={qt=/replication&wt=javabin&version=2&command=details} status=0 QTime=0
   [junit4]   2> 917772 INFO  (qtp1755710223-9845) [n:127.0.0.1:55195_solr c:collection1 s:shard1 r:core_node3 x:collection1_shard1_replica_t1] o.a.s.c.S.Request [collection1_shard1_replica_t1]  webapp=/solr path=/replication params={qt=/replication&wt=javabin&version=2&command=details} status=0 QTime=0
   [junit4]   2> 918278 INFO  (qtp1755710223-9843) [n:127.0.0.1:55195_solr c:collection1 s:shard1 r:core_node3 x:collection1_shard1_replica_t1] o.a.s.c.S.Request [collection1_shard1_replica_t1]  webapp=/solr path=/replication params={qt=/replication&wt=javabin&version=2&command=details} status=0 QTime=0
   [junit4]   2> 918278 INFO  (qtp341015423-9853) [n:127.0.0.1:55196_solr c:collection1 s:shard2 r:core_node8 x:collection1_shard2_replica_t6] o.a.s.c.S.Request [collection1_shard2_replica_t6]  webapp=/solr path=/replication params={qt=/replication&wt=javabin&version=2&command=details} status=0 QTime=0
   [junit4]   2> 918793 INFO  (qtp1755710223-9841) [n:127.0.0.1:55195_solr c:collection1 s:shard1 r:core_node3 x:collection1_shard1_replica_t1] o.a.s.c.S.Request [collection1_shard1_replica_t1]  webapp=/solr path=/replication params={qt=/replication&wt=javabin&version=2&command=details} status=0 QTime=0
   [junit4]   2> 918793 INFO  (qtp341015423-9852) [n:127.0.0.1:55196_solr c:collection1 s:shard2 r:core_node8 x:collection1_shard2_replica_t6] o.a.s.c.S.Request [collection1_shard2_replica_t6]  webapp=/solr path=/replication params={qt=/replication&wt=javabin&version=2&command=details} status=0 QTime=0
   [junit4]   2> 919301 INFO  (qtp1755710223-9846) [n:127.0.0.1:55195_solr c:collection1 s:shard1 r:core_node3 x:collection1_shard1_replica_t1] o.a.s.c.S.Request [collection1_shard1_replica_t1]  webapp=/solr path=/replication params={qt=/replication&wt=javabin&version=2&command=details} status=0 QTime=0
   [junit4]   2> 919301 INFO  (qtp341015423-9854) [n:127.0.0.1:55196_solr c:collection1 s:shard2 r:core_node8 x:collection1_shard2_replica_t6] o.a.s.c.S.Request [collection1_shard2_replica_t6]  webapp=/solr path=/replication params={qt=/replication&wt=javabin&version=2&command=details} status=0 QTime=0
   [junit4]   2> 919708 INFO  (qtp1755710223-9843) [n:127.0.0.1:55195_solr c:collection1 s:shard1 r:core_node3 x:collection1_shard1_replica_t1] o.a.s.c.S.Request [collection1_shard1_replica_t1]  webapp=/solr path=/replication params={qt=/replication&wt=javabin&version=2&command=indexversion} status=0 QTime=0
   [junit4]   2> 919708 INFO  (indexFetcher-3306-thread-1) [n:127.0.0.1:55196_solr c:collection1 s:shard1 r:core_node5 x:collection1_shard1_replica_t2] o.a.s.h.IndexFetcher Master's generation: 1
   [junit4]   2> 919708 INFO  (indexFetcher-3306-thread-1) [n:127.0.0.1:55196_solr c:collection1 s:shard1 r:core_node5 x:collection1_shard1_replica_t2] o.a.s.h.IndexFetcher Master's version: 0
   [junit4]   2> 919709 INFO  (indexFetcher-3306-thread-1) [n:127.0.0.1:55196_solr c:collection1 s:shard1 r:core_node5 x:collection1_shard1_replica_t2] o.a.s.h.IndexFetcher Slave's generation: 1
   [junit4]   2> 919709 INFO  (indexFetcher-3306-thread-1) [n:127.0.0.1:55196_solr c:collection1 s:shard1 r:core_node5 x:collection1_shard1_replica_t2] o.a.s.h.IndexFetcher Slave's version: 0
   [junit4]   2> 919812 INFO  (qtp341015423-9849) [n:127.0.0.1:55196_solr c:collection1 s:shard2 r:core_node8 x:collection1_shard2_replica_t6] o.a.s.c.S.Request [collection1_shard2_replica_t6]  webapp=/solr path=/replication params={qt=/replication&wt=javabin&version=2&command=details} status=0 QTime=0
   [junit4]   2> 919812 INFO  (qtp1755710223-9844) [n:127.0.0.1:55195_solr c:collection1 s:shard1 r:core_node3 x:collection1_shard1_replica_t1] o.a.s.c.S.Request [collection1_shard1_replica_t1]  webapp=/solr path=/replication params={qt=/replication&wt=javabin&version=2&command=details} status=0 QTime=0
   [junit4]   2> 920100 INFO  (qtp341015423-9857) [n:127.0.0.1:55196_solr c:collection1 s:shard2 r:core_node8 x:collection1_shard2_replica_t6] o.a.s.c.S.Request [collection1_shard2_replica_t6]  webapp=/solr path=/replication params={qt=/replication&wt=javabin&version=2&command=indexversion} status=0 QTime=0
   [junit4]   2> 920100 INFO  (indexFetcher-3307-thread-1) [n:127.0.0.1:55195_solr c:collection1 s:shard2 r:core_node7 x:collection1_shard2_replica_t4] o.a.s.h.IndexFetcher Master's generation: 1
   [junit4]   2> 920100 INFO  (indexFetcher-3307-thread-1) [n:127.0.0.1:55195_solr c:collection1 s:shard2 r:core_node7 x:collection1_shard2_replica_t4] o.a.s.h.IndexFetcher Master's version: 0
   [junit4]   2> 920100 INFO  (indexFetcher-3307-thread-1) [n:127.0.0.1:55195_solr c:collection1 s:shard2 r:core_node7 x:collection1_shard2_replica_t4] o.a.s.h.IndexFetcher Slave's generation: 2
   [junit4]   2> 920100 INFO  (indexFetcher-3307-thread-1) [n:127.0.0.1:55195_solr c:collection1 s:shard2 r:core_node7 x:collection1_shard2_replica_t4] o.a.s.h.IndexFetcher Slave's version: 1504620531296
   [junit4]   2> 920321 INFO  (qtp341015423-9854) [n:127.0.0.1:55196_solr c:collection1 s:shard2 r:core_node8 x:collection1_shard2_replica_t6] o.a.s.c.S.Request [collection1_shard2_replica_t6]  webapp=/solr path=/replication params={qt=/replication&wt=javabin&version=2&command=details} status=0 QTime=0
   [junit4]   2> 920321 INFO  (qtp1755710223-9843) [n:127.0.0.1:55195_solr c:collection1 s:shard1 r:core_node3 x:collection1_shard1_replica_t1] o.a.s.c.S.Request [collection1_shard1_replica_t1]  webapp=/solr path=/replication params={qt=/replication&wt=javabin&version=2&command=details} status=0 QTime=0
   [junit4]   2> 920829 INFO  (qtp341015423-9857) [n:127.0.0.1:55196_solr c:collection1 s:shard2 r:core_node8 x:collection1_shard2_replica_t6] o.a.s.c.S.Request [collection1_shard2_replica_t6]  webapp=/solr path=/replication params={qt=/replication&wt=javabin&version=2&command=details} status=0 QTime=0
   [junit4]   2> 920829 INFO  (qtp1755710223-9844) [n:127.0.0.1:55195_solr c:collection1 s:shard1 r:core_node3 x:collection1_shard1_replica_t1] o.a.s.c.S.Request [collection1_shard1_replica_t1]  webapp=/solr path=/replication params={qt=/replication&wt=javabin&version=2&command=details} status=0 QTime=0
   [junit4]   2> 921341 INFO  (qtp341015423-9849) [n:127.0.0.1:55196_solr c:collection1 s:shard2 r:core_node8 x:collection1_shard2_replica_t6] o.a.s.c.S.Request [collection1_shard2_replica_t6]  webapp=/solr path=/replication params={qt=/replication&wt=javabin&version=2&command=details} status=0 QTime=0
   [junit4]   2> 921341 INFO  (qtp1755710223-9846) [n:127.0.0.1:55195_solr c:collection1 s:shard1 r:core_node3 x:collection1_shard1_replica_t1] o.a.s.c.S.Request [collection1_shard1_replica_t1]  webapp=/solr path=/replication params={qt=/replication&wt=javabin&version=2&command=details} status=0 QTime=0
   [junit4]   2> 921852 INFO  (qtp1755710223-9848) [n:127.0.0.1:55195_solr c:collection1 s:shard1 r:core_node3 x:collection1_shard1_replica_t1] o.a.s.c.S.Request [collection1_shard1_replica_t1]  webapp=/solr path=/replication params={qt=/replication&wt=javabin&version=2&command=details} status=0 QTime=0
   [junit4]   2> 921852 INFO  (qtp341015423-9853) [n:127.0.0.1:55196_solr c:collection1 s:shard2 r:core_node8 x:collection1_shard2_replica_t6] o.a.s.c.S.Request [collection1_shard2_replica_t6]  webapp=/solr path=/replication params={qt=/replication&wt=javabin&version=2&command=details} status=0 QTime=0
   [junit4]   2> 922357 INFO  (qtp1755710223-9843) [n:127.0.0.1:55195_solr c:collection1 s:shard1 r:core_node3 x:collection1_shard1_replica_t1] o.a.s.c.S.Request [collection1_shard1_replica_t1]  webapp=/solr path=/replication params={qt=/replication&wt=javabin&version=2&command=details} status=0 QTime=0
   [junit4]   2> 922365 INFO  (qtp341015423-9849) [n:127.0.0.1:55196_solr c:collection1 s:shard2 r:core_node8 x:collection1_shard2_replica_t6] o.a.s.c.S.Request [collection1_shard2_replica_t6]  webapp=/solr path=/replication params={qt=/replication&wt=javabin&version=2&command=details} status=0 QTime=0
   [junit4]   2> 922715 INFO  (qtp1755710223-9846) [n:127.0.0.1:55195_solr c:collection1 s:shard1 r:core_node3 x:collection1_shard1_replica_t1] o.a.s.c.S.Request [collection1_shard1_replica_t1]  webapp=/solr path=/replication params={qt=/replication&wt=javabin&version=2&command=indexversion} status=0 QTime=0
   [junit4]   2> 922716 INFO  (indexFetcher-3306-thread-1) [n:127.0.0.1:55196_solr c:collection1 s:shard1 r:core_node5 x:collection1_shard1_replica_t2] o.a.s.h.IndexFetcher Master's generation: 1
   [junit4]   2> 922716 INFO  (indexFetcher-3306-thread-1) [n:127.0.0.1:55196_solr c:collection1 s:shard1 r:core_node5 x:collection1_shard1_replica_t2] o.a.s.h.IndexFetcher Master's version: 0
   [junit4]   2> 922716 INFO  (indexFetcher-3306-thread-1) [n:127.0.0.1:55196_solr c:collection1 s:shard1 r:core_node5 x:collection1_shard1_replica_t2] o.a.s.h.IndexFetcher Slave's generation: 1
   [junit4]   2> 922716 INFO  (indexFetcher-3306-thread-1) [n:127.0.0.1:55196_solr c:collection1 s:shard1 r:core_node5 x:collection1_shard1_replica_t2] o.a.s.h.IndexFetcher Slave's version: 0
   [junit4]   2> 922871 INFO  (qtp1755710223-9841) [n:127.0.0.1:55195_solr c:collection1 s:shard1 r:core_node3 x:collection1_shard1_replica_t1] o.a.s.c.S.Request [collection1_shard1_replica_t1]  webapp=/solr path=/replication params={qt=/replication&wt=javabin&version=2&command=details} status=0 QTime=0
   [junit4]   2> 922871 INFO  (qtp341015423-9852) [n:127.0.0.1:55196_solr c:collection1 s:shard2 r:core_node8 x:collection1_shard2_replica_t6] o.a.s.c.S.Request [collection1_shard2_replica_t6]  webapp=/solr path=/replication params={qt=/replication&wt=javabin&version=2&command=details} status=0 QTime=0
   [junit4]   2> 923095 INFO  (qtp341015423-9857) [n:127.0.0.1:55196_solr c:collection1 s:shard2 r:core_node8 x:collection1_shard2_replica_t6] o.a.s.c.S.Request [collection1_shard2_replica_t6]  webapp=/solr path=/replication params={qt=/replication&wt=javabin&version=2&command=indexversion} status=0 QTime=0
   [junit4]   2> 923096 INFO  (indexFetcher-3307-thread-1) [n:127.0.0.1:55195_solr c:collection1 s:shard2 r:core_node7 x:collection1_shard2_replica_t4] o.a.s.h.IndexFetcher Master's generation: 1
   [junit4]   2> 923096 INFO  (indexFetcher-3307-thread-1) [n:127.0.0.1:55195_solr c:collection1 s:shard2 r:core_node7 x:collection1_shard2_replica_t4] o.a.s.h.IndexFetcher Master's version: 0
   [junit4]   2> 923096 INFO  (indexFetcher-3307-thread-1) [n:127.0.0.1:55195_solr c:collection1 s:shard2 r:core_node7 x:collection1_shard2_replica_t4] o.a.s.h.IndexFetcher Slave's generation: 2
   [junit4]   2> 923096 INFO  (indexFetcher-3307-thread-1) [n:127.0.0.1:55195_solr c:collection1 s:shard2 r:core_node7 x:collection1_shard2_replica_t4] o.a.s.h.IndexFetcher Slave's version: 1504620531296
   [junit4]   2> 923380 INFO  (qtp1755710223-9843) [n:127.0.0.1:55195_solr c:collection1 s:shard1 r:core_node3 x:collection1_shard1_replica_t1] o.a.s.c.S.Request [collection1_shard1_replica_t1]  webapp=/solr path=/replication params={qt=/replication&wt=javabin&version=2&command=details} status=0 QTime=0
   [junit4]   2> 923380 INFO  (qtp341015423-9854) [n:127.0.0.1:55196_solr c:collection1 s:shard2 r:core_node8 x:collection1_shard2_replica_t6] o.a.s.c.S.Request [collection1_shard2_replica_t6]  webapp=/solr path=/replication params={qt=/replication&wt=javabin&version=2&command=details} status=0 QTime=0
   [junit4]   2> 923892 INFO  (qtp1755710223-9841) [n:127.0.0.1:55195_solr c:collection1 s:shard1 r:core_node3 x:collection1_shard1_replica_t1] o.a.s.c.S.Request [collection1_shard1_replica_t1]  webapp=/solr path=/replication params={qt=/replication&wt=javabin&version=2&command=details} status=0 QTime=0
   [junit4]   2> 923892 INFO  (qtp341015423-9853) [n:127.0.0.1:55196_solr c:collection1 s:shard2 r:core_node8 x:collection1_shard2_replica_t6] o.a.s.c.S.Request [collection1_shard2_replica_t6]  webapp=/solr path=/replication params={qt=/replication&wt=javabin&version=2&command=details} status=0 QTime=0
   [junit4]   2> 924407 INFO  (qtp341015423-9857) [n:127.0.0.1:55196_solr c:collection1 s:shard2 r:core_node8 x:collection1_shard2_replica_t6] o.a.s.c.S.Request [collection1_shard2_replica_t6]  webapp=/solr path=/replication params={qt=/replication&wt=javabin&version=2&command=details} status=0 QTime=0
   [junit4]   2> 924407 INFO  (qtp1755710223-9843) [n:127.0.0.1:55195_solr c:collection1 s:shard1 r:core_node3 x:collection1_shard1_replica_t1] o.a.s.c.S.Request [collection1_shard1_replica_t1]  webapp=/solr path=/replication params={qt=/replication&wt=javabin&version=2&command=details} status=0 QTime=0
   [junit4]   2> 924917 INFO  (qtp341015423-9854) [n:127.0.0.1:55196_solr c:collection1 s:shard2 r:core_node8 x:collection1_shard2_replica_t6] o.a.s.c.S.Request [collection1_shard2_replica_t6]  webapp=/solr path=/replication params={qt=/replication&wt=javabin&version=2&command=details} status=0 QTime=0
   [junit4]   2> 924917 INFO  (qtp1755710223-9841) [n:127.0.0.1:55195_solr c:collection1 s:shard1 r:core_node3 x:collection1_shard1_replica_t1] o.a.s.c.S.Request [collection1_shard1_replica_t1]  webapp=/solr path=/replication params={qt=/replication&wt=javabin&version=2&command=details} status=0 QTime=0
   [junit4]   2> 925432 INFO  (qtp1755710223-9843) [n:127.0.0.1:55195_solr c:collection1 s:shard1 r:core_node3 x:collection1_shard1_replica_t1] o.a.s.c.S.Request [collection1_shard1_replica_t1]  webapp=/solr path=/replication params={qt=/replication&wt=javabin&version=2&command=details} status=0 QTime=0
   [junit4]   2> 925432 INFO  (qtp341015423-9853) [n:127.0.0.1:55196_solr c:collection1 s:shard2 r:core_node8 x:collection1_shard2_replica_t6] o.a.s.c.S.Request [collection1_shard2_replica_t6]  webapp=/solr path=/replication params={qt=/replication&wt=javabin&version=2&command=details} status=0 QTime=0
   [junit4]   2> 925714 INFO  (qtp1755710223-9846) [n:127.0.0.1:55195_solr c:collection1 s:shard1 r:core_node3 x:collection1_shard1_replica_t1] o.a.s.c.S.Request [collection1_shard1_replica_t1]  webapp=/solr path=/replication params={qt=/replication&wt=javabin&version=2&command=indexversion} status=0 QTime=0
   [junit4]   2> 925714 INF

[...truncated too long message...]

ader.java:744)
   [junit4]   2> 	at org.apache.solr.cloud.RecoveryStrategy.doSyncOrReplicateRecovery(RecoveryStrategy.java:517)
   [junit4]   2> 	at org.apache.solr.cloud.RecoveryStrategy.doRecovery(RecoveryStrategy.java:302)
   [junit4]   2> 	at org.apache.solr.cloud.RecoveryStrategy.run(RecoveryStrategy.java:286)
   [junit4]   2> 	at com.codahale.metrics.InstrumentedExecutorService$InstrumentedRunnable.run(InstrumentedExecutorService.java:176)
   [junit4]   2> 	at java.util.concurrent.Executors$RunnableAdapter.call(Executors.java:511)
   [junit4]   2> 	at java.util.concurrent.FutureTask.run(FutureTask.java:266)
   [junit4]   2> 	at org.apache.solr.common.util.ExecutorUtil$MDCAwareThreadPoolExecutor.lambda$execute$0(ExecutorUtil.java:188)
   [junit4]   2> 	at java.util.concurrent.ThreadPoolExecutor.runWorker(ThreadPoolExecutor.java:1149)
   [junit4]   2> 	at java.util.concurrent.ThreadPoolExecutor$Worker.run(ThreadPoolExecutor.java:624)
   [junit4]   2> 	at java.lang.Thread.run(Thread.java:748)
   [junit4]   2> 
   [junit4]   2> 1085416 INFO  (recoveryExecutor-2761-thread-1-processing-n:127.0.0.1:55196_solr x:collection1_shard2_replica_t6 s:shard2 c:collection1 r:core_node8) [n:127.0.0.1:55196_solr c:collection1 s:shard2 r:core_node8 x:collection1_shard2_replica_t6] o.a.s.c.RecoveryStrategy Replay not started, or was not successful... still buffering updates.
   [junit4]   2> 1085416 INFO  (recoveryExecutor-2761-thread-1-processing-n:127.0.0.1:55196_solr x:collection1_shard2_replica_t6 s:shard2 c:collection1 r:core_node8) [n:127.0.0.1:55196_solr c:collection1 s:shard2 r:core_node8 x:collection1_shard2_replica_t6] o.a.s.c.RecoveryStrategy RecoveryStrategy has been closed
   [junit4]   2> 1085416 INFO  (recoveryExecutor-2761-thread-1-processing-n:127.0.0.1:55196_solr x:collection1_shard2_replica_t6 s:shard2 c:collection1 r:core_node8) [n:127.0.0.1:55196_solr c:collection1 s:shard2 r:core_node8 x:collection1_shard2_replica_t6] o.a.s.c.RecoveryStrategy Finished recovery process, successful=[false]
   [junit4]   2> 1085416 INFO  (recoveryExecutor-2761-thread-1-processing-n:127.0.0.1:55196_solr x:collection1_shard2_replica_t6 s:shard2 c:collection1 r:core_node8) [n:127.0.0.1:55196_solr c:collection1 s:shard2 r:core_node8 x:collection1_shard2_replica_t6] o.a.s.c.SolrCore [collection1_shard2_replica_t6]  CLOSING SolrCore org.apache.solr.core.SolrCore@692e3f85
   [junit4]   2> 1085416 INFO  (recoveryExecutor-2761-thread-1-processing-n:127.0.0.1:55196_solr x:collection1_shard2_replica_t6 s:shard2 c:collection1 r:core_node8) [n:127.0.0.1:55196_solr c:collection1 s:shard2 r:core_node8 x:collection1_shard2_replica_t6] o.a.s.m.SolrMetricManager Closing metric reporters for registry=solr.core.collection1.shard2.replica_t6, tag=1764638597
   [junit4]   2> 1085416 INFO  (recoveryExecutor-2761-thread-1-processing-n:127.0.0.1:55196_solr x:collection1_shard2_replica_t6 s:shard2 c:collection1 r:core_node8) [n:127.0.0.1:55196_solr c:collection1 s:shard2 r:core_node8 x:collection1_shard2_replica_t6] o.a.s.m.r.SolrJmxReporter Closing reporter [org.apache.solr.metrics.reporters.SolrJmxReporter@4237283b: rootName = solr_55196, domain = solr.core.collection1.shard2.replica_t6, service url = null, agent id = null] for registry solr.core.collection1.shard2.replica_t6 / com.codahale.metrics.MetricRegistry@194c56c2
   [junit4]   2> 1085423 INFO  (recoveryExecutor-2761-thread-1-processing-n:127.0.0.1:55196_solr x:collection1_shard2_replica_t6 s:shard2 c:collection1 r:core_node8) [n:127.0.0.1:55196_solr c:collection1 s:shard2 r:core_node8 x:collection1_shard2_replica_t6] o.a.s.m.SolrMetricManager Closing metric reporters for registry=solr.collection.collection1.shard2.leader, tag=1764638597
   [junit4]   2> 1085423 WARN  (recoveryExecutor-2761-thread-1-processing-n:127.0.0.1:55196_solr x:collection1_shard2_replica_t6 s:shard2 c:collection1 r:core_node8) [n:127.0.0.1:55196_solr c:collection1 s:shard2 r:core_node8 x:collection1_shard2_replica_t6] o.a.s.c.RecoveryStrategy Stopping recovery for core=[collection1_shard2_replica_t6] coreNodeName=[core_node8]
   [junit4]   2> 1085425 WARN  (updateExecutor-2760-thread-1-processing-n:127.0.0.1:55196_solr x:collection1_shard2_replica_t6 s:shard2 c:collection1 r:core_node8) [n:127.0.0.1:55196_solr c:collection1 s:shard2 r:core_node8 x:collection1_shard2_replica_t6] o.a.s.u.DefaultSolrCoreState Skipping recovery because Solr is shutdown
   [junit4]   2> 1085425 INFO  (jetty-closer-2727-thread-1) [    ] o.a.s.c.Overseer Overseer (id=98606810742849553-127.0.0.1:55196_solr-n_0000000004) closing
   [junit4]   2> 1085425 INFO  (OverseerStateUpdate-98606810742849553-127.0.0.1:55196_solr-n_0000000004) [n:127.0.0.1:55196_solr    ] o.a.s.c.Overseer Overseer Loop exiting : 127.0.0.1:55196_solr
   [junit4]   2> 1085427 WARN  (zkCallback-2763-thread-2-processing-n:127.0.0.1:55196_solr) [n:127.0.0.1:55196_solr    ] o.a.s.c.c.ZkStateReader ZooKeeper watch triggered, but Solr cannot talk to ZK: [KeeperErrorCode = Session expired for /live_nodes]
   [junit4]   2> 1085428 INFO  (jetty-closer-2727-thread-1) [    ] o.e.j.s.h.ContextHandler Stopped o.e.j.s.ServletContextHandler@857a233{/solr,null,UNAVAILABLE}
   [junit4]   2> 1085429 ERROR (SUITE-TestCloudRecovery-seed#[99B2BAB6F8F0DDD8]-worker) [    ] o.a.z.s.ZooKeeperServer ZKShutdownHandler is not registered, so ZooKeeper server won't take any action on ERROR or SHUTDOWN server state changes
   [junit4]   2> 1085429 INFO  (SUITE-TestCloudRecovery-seed#[99B2BAB6F8F0DDD8]-worker) [    ] o.a.s.c.ZkTestServer connecting to 127.0.0.1:55193 55193
   [junit4]   2> 1085444 INFO  (Thread-1696) [    ] o.a.s.c.ZkTestServer connecting to 127.0.0.1:55193 55193
   [junit4]   2> 1085729 WARN  (Thread-1696) [    ] o.a.s.c.ZkTestServer Watch limit violations: 
   [junit4]   2> Maximum concurrent create/delete watches above limit:
   [junit4]   2> 
   [junit4]   2> 	7	/solr/aliases.json
   [junit4]   2> 	7	/solr/clusterprops.json
   [junit4]   2> 	6	/solr/security.json
   [junit4]   2> 	6	/solr/configs/config
   [junit4]   2> 
   [junit4]   2> Maximum concurrent data watches above limit:
   [junit4]   2> 
   [junit4]   2> 	154	/solr/collections/collection1/state.json
   [junit4]   2> 	7	/solr/clusterstate.json
   [junit4]   2> 
   [junit4]   2> Maximum concurrent children watches above limit:
   [junit4]   2> 
   [junit4]   2> 	7	/solr/collections
   [junit4]   2> 	3	/solr/overseer/queue
   [junit4]   2> 	3	/solr/live_nodes
   [junit4]   2> 	3	/solr/overseer/collection-queue-work
   [junit4]   2> 	2	/solr/overseer/queue-work
   [junit4]   2> 
   [junit4]   2> NOTE: leaving temporary files on disk at: /Users/jenkins/workspace/Lucene-Solr-7.x-MacOSX/solr/build/solr-core/test/J1/temp/solr.cloud.TestCloudRecovery_99B2BAB6F8F0DDD8-001
   [junit4]   2> Sep 05, 2017 2:11:42 PM com.carrotsearch.randomizedtesting.ThreadLeakControl checkThreadLeaks
   [junit4]   2> WARNING: Will linger awaiting termination of 1 leaked thread(s).
   [junit4]   2> NOTE: test params are: codec=Asserting(Lucene70): {id=PostingsFormat(name=LuceneFixedGap)}, docValues:{}, maxPointsInLeafNode=988, maxMBSortInHeap=6.413481233168468, sim=RandomSimilarity(queryNorm=true): {}, locale=ca-ES, timezone=America/North_Dakota/Center
   [junit4]   2> NOTE: Mac OS X 10.11.6 x86_64/Oracle Corporation 1.8.0_144 (64-bit)/cpus=3,threads=1,free=261577272,total=536870912
   [junit4]   2> NOTE: All tests run in this JVM: [TestMacroExpander, TestFastLRUCache, TestSolr4Spatial, TestSolrFieldCacheBean, TestSolrCloudWithDelegationTokens, TestDistributedGrouping, UtilsToolTest, TestDelegationWithHadoopAuth, TestLRUCache, ZkSolrClientTest, TestElisionMultitermQuery, TestSortByMinMaxFunction, TestSystemCollAutoCreate, TestShardHandlerFactory, ConnectionReuseTest, BadIndexSchemaTest, EchoParamsTest, FullHLLTest, LeaderElectionIntegrationTest, PeerSyncReplicationTest, HttpPartitionTest, DistributedSuggestComponentTest, TestDistributedMissingSort, TestSQLHandler, RollingRestartTest, TestCSVLoader, TestFileDictionaryLookup, AutoCommitTest, TestDefaultStatsCache, TestFieldSortValues, DistributedIntervalFacetingTest, AtomicUpdatesTest, TestNumericTerms32, SchemaVersionSpecificBehaviorTest, TestSchemaResource, TestOnReconnectListenerSupport, ZkStateWriterTest, CollectionsAPIDistributedZkTest, QueryResultKeyTest, DistributedQueryComponentCustomSortTest, TestCloudNestedDocsSort, HdfsTlogReplayBufferedWhileIndexingTest, SolrGraphiteReporterTest, HdfsNNFailoverTest, DocumentAnalysisRequestHandlerTest, TestGraphMLResponseWriter, TestDFISimilarityFactory, OverriddenZkACLAndCredentialsProvidersTest, TestLuceneMatchVersion, PingRequestHandlerTest, TestHighFrequencyDictionaryFactory, AddSchemaFieldsUpdateProcessorFactoryTest, TermVectorComponentDistributedTest, DocValuesNotIndexedTest, SuggesterFSTTest, SolrPluginUtilsTest, TestSystemIdResolver, IndexSchemaRuntimeFieldTest, TestCollationFieldDocValues, TestEmbeddedSolrServerAdminHandler, TestTolerantUpdateProcessorRandomCloud, TestFieldCacheSortRandom, DistributedFacetPivotLongTailTest, TestAuthorizationFramework, TestComplexPhraseQParserPlugin, TestManagedSchemaThreadSafety, SuggestComponentContextFilterQueryTest, DistributedDebugComponentTest, SampleTest, HdfsWriteToMultipleCollectionsTest, FullSolrCloudDistribCmdsTest, TestApiFramework, BadComponentTest, ChaosMonkeyNothingIsSafeWithPullReplicasTest, TestClusterProperties, TestUninvertingReader, RuleEngineTest, InfoHandlerTest, TestQueryTypes, CachingDirectoryFactoryTest, CopyFieldTest, TestLeaderInitiatedRecoveryThread, HdfsDirectoryTest, TestObjectReleaseTracker, TestPartialUpdateDeduplication, LoggingHandlerTest, ZkFailoverTest, TestRawTransformer, SynonymTokenizerTest, StatsComponentTest, TestSolrDeletionPolicy1, ConjunctionSolrSpellCheckerTest, CdcrRequestHandlerTest, FileBasedSpellCheckerTest, TestReRankQParserPlugin, TestCloudRecovery]
   [junit4] Completed [201/731 (1!)] on J1 in 177.95s, 2 tests, 1 failure <<< FAILURES!

[...truncated 48022 lines...]

[JENKINS] Lucene-Solr-7.x-MacOSX (64bit/jdk1.8.0) - Build # 160 - Still Unstable!

Posted by Policeman Jenkins Server <je...@thetaphi.de>.
Build: https://jenkins.thetaphi.de/job/Lucene-Solr-7.x-MacOSX/160/
Java: 64bit/jdk1.8.0 -XX:+UseCompressedOops -XX:+UseParallelGC

25 tests failed.
FAILED:  org.apache.solr.cloud.CustomCollectionTest.testRouteFieldForImplicitRouter

Error Message:
Collection not found: withShardField

Stack Trace:
org.apache.solr.common.SolrException: Collection not found: withShardField
	at __randomizedtesting.SeedInfo.seed([393134CE924FE1A4:6C61DC5C3EB62E54]:0)
	at org.apache.solr.client.solrj.impl.CloudSolrClient.getCollectionNames(CloudSolrClient.java:1139)
	at org.apache.solr.client.solrj.impl.CloudSolrClient.requestWithRetryOnStaleState(CloudSolrClient.java:822)
	at org.apache.solr.client.solrj.impl.CloudSolrClient.request(CloudSolrClient.java:793)
	at org.apache.solr.client.solrj.SolrRequest.process(SolrRequest.java:178)
	at org.apache.solr.client.solrj.request.UpdateRequest.commit(UpdateRequest.java:233)
	at org.apache.solr.cloud.CustomCollectionTest.testRouteFieldForImplicitRouter(CustomCollectionTest.java:141)
	at sun.reflect.NativeMethodAccessorImpl.invoke0(Native Method)
	at sun.reflect.NativeMethodAccessorImpl.invoke(NativeMethodAccessorImpl.java:62)
	at sun.reflect.DelegatingMethodAccessorImpl.invoke(DelegatingMethodAccessorImpl.java:43)
	at java.lang.reflect.Method.invoke(Method.java:498)
	at com.carrotsearch.randomizedtesting.RandomizedRunner.invoke(RandomizedRunner.java:1737)
	at com.carrotsearch.randomizedtesting.RandomizedRunner$8.evaluate(RandomizedRunner.java:934)
	at com.carrotsearch.randomizedtesting.RandomizedRunner$9.evaluate(RandomizedRunner.java:970)
	at com.carrotsearch.randomizedtesting.RandomizedRunner$10.evaluate(RandomizedRunner.java:984)
	at com.carrotsearch.randomizedtesting.rules.SystemPropertiesRestoreRule$1.evaluate(SystemPropertiesRestoreRule.java:57)
	at org.apache.lucene.util.TestRuleSetupTeardownChained$1.evaluate(TestRuleSetupTeardownChained.java:49)
	at org.apache.lucene.util.AbstractBeforeAfterRule$1.evaluate(AbstractBeforeAfterRule.java:45)
	at org.apache.lucene.util.TestRuleThreadAndTestName$1.evaluate(TestRuleThreadAndTestName.java:48)
	at org.apache.lucene.util.TestRuleIgnoreAfterMaxFailures$1.evaluate(TestRuleIgnoreAfterMaxFailures.java:64)
	at org.apache.lucene.util.TestRuleMarkFailure$1.evaluate(TestRuleMarkFailure.java:47)
	at com.carrotsearch.randomizedtesting.rules.StatementAdapter.evaluate(StatementAdapter.java:36)
	at com.carrotsearch.randomizedtesting.ThreadLeakControl$StatementRunner.run(ThreadLeakControl.java:368)
	at com.carrotsearch.randomizedtesting.ThreadLeakControl.forkTimeoutingTask(ThreadLeakControl.java:817)
	at com.carrotsearch.randomizedtesting.ThreadLeakControl$3.evaluate(ThreadLeakControl.java:468)
	at com.carrotsearch.randomizedtesting.RandomizedRunner.runSingleTest(RandomizedRunner.java:943)
	at com.carrotsearch.randomizedtesting.RandomizedRunner$5.evaluate(RandomizedRunner.java:829)
	at com.carrotsearch.randomizedtesting.RandomizedRunner$6.evaluate(RandomizedRunner.java:879)
	at com.carrotsearch.randomizedtesting.RandomizedRunner$7.evaluate(RandomizedRunner.java:890)
	at com.carrotsearch.randomizedtesting.rules.StatementAdapter.evaluate(StatementAdapter.java:36)
	at com.carrotsearch.randomizedtesting.rules.SystemPropertiesRestoreRule$1.evaluate(SystemPropertiesRestoreRule.java:57)
	at org.apache.lucene.util.AbstractBeforeAfterRule$1.evaluate(AbstractBeforeAfterRule.java:45)
	at com.carrotsearch.randomizedtesting.rules.StatementAdapter.evaluate(StatementAdapter.java:36)
	at org.apache.lucene.util.TestRuleStoreClassName$1.evaluate(TestRuleStoreClassName.java:41)
	at com.carrotsearch.randomizedtesting.rules.NoShadowingOrOverridesOnMethodsRule$1.evaluate(NoShadowingOrOverridesOnMethodsRule.java:40)
	at com.carrotsearch.randomizedtesting.rules.NoShadowingOrOverridesOnMethodsRule$1.evaluate(NoShadowingOrOverridesOnMethodsRule.java:40)
	at com.carrotsearch.randomizedtesting.rules.StatementAdapter.evaluate(StatementAdapter.java:36)
	at com.carrotsearch.randomizedtesting.rules.StatementAdapter.evaluate(StatementAdapter.java:36)
	at com.carrotsearch.randomizedtesting.rules.StatementAdapter.evaluate(StatementAdapter.java:36)
	at org.apache.lucene.util.TestRuleAssertionsRequired$1.evaluate(TestRuleAssertionsRequired.java:53)
	at org.apache.lucene.util.TestRuleMarkFailure$1.evaluate(TestRuleMarkFailure.java:47)
	at org.apache.lucene.util.TestRuleIgnoreAfterMaxFailures$1.evaluate(TestRuleIgnoreAfterMaxFailures.java:64)
	at org.apache.lucene.util.TestRuleIgnoreTestSuites$1.evaluate(TestRuleIgnoreTestSuites.java:54)
	at com.carrotsearch.randomizedtesting.rules.StatementAdapter.evaluate(StatementAdapter.java:36)
	at com.carrotsearch.randomizedtesting.ThreadLeakControl$StatementRunner.run(ThreadLeakControl.java:368)
	at java.lang.Thread.run(Thread.java:748)


FAILED:  org.apache.solr.cloud.FullSolrCloudDistribCmdsTest.test

Error Message:
Could not find collection:collection2

Stack Trace:
java.lang.AssertionError: Could not find collection:collection2
	at __randomizedtesting.SeedInfo.seed([393134CE924FE1A4:B1650B143CB38C5C]:0)
	at org.junit.Assert.fail(Assert.java:93)
	at org.junit.Assert.assertTrue(Assert.java:43)
	at org.junit.Assert.assertNotNull(Assert.java:526)
	at org.apache.solr.cloud.AbstractDistribZkTestBase.waitForRecoveriesToFinish(AbstractDistribZkTestBase.java:155)
	at org.apache.solr.cloud.AbstractDistribZkTestBase.waitForRecoveriesToFinish(AbstractDistribZkTestBase.java:140)
	at org.apache.solr.cloud.AbstractDistribZkTestBase.waitForRecoveriesToFinish(AbstractDistribZkTestBase.java:135)
	at org.apache.solr.cloud.AbstractFullDistribZkTestBase.waitForRecoveriesToFinish(AbstractFullDistribZkTestBase.java:908)
	at org.apache.solr.cloud.FullSolrCloudDistribCmdsTest.testIndexingBatchPerRequestWithHttpSolrClient(FullSolrCloudDistribCmdsTest.java:612)
	at org.apache.solr.cloud.FullSolrCloudDistribCmdsTest.test(FullSolrCloudDistribCmdsTest.java:152)
	at sun.reflect.NativeMethodAccessorImpl.invoke0(Native Method)
	at sun.reflect.NativeMethodAccessorImpl.invoke(NativeMethodAccessorImpl.java:62)
	at sun.reflect.DelegatingMethodAccessorImpl.invoke(DelegatingMethodAccessorImpl.java:43)
	at java.lang.reflect.Method.invoke(Method.java:498)
	at com.carrotsearch.randomizedtesting.RandomizedRunner.invoke(RandomizedRunner.java:1737)
	at com.carrotsearch.randomizedtesting.RandomizedRunner$8.evaluate(RandomizedRunner.java:934)
	at com.carrotsearch.randomizedtesting.RandomizedRunner$9.evaluate(RandomizedRunner.java:970)
	at com.carrotsearch.randomizedtesting.RandomizedRunner$10.evaluate(RandomizedRunner.java:984)
	at org.apache.solr.BaseDistributedSearchTestCase$ShardsRepeatRule$ShardsFixedStatement.callStatement(BaseDistributedSearchTestCase.java:993)
	at org.apache.solr.BaseDistributedSearchTestCase$ShardsRepeatRule$ShardsStatement.evaluate(BaseDistributedSearchTestCase.java:968)
	at com.carrotsearch.randomizedtesting.rules.SystemPropertiesRestoreRule$1.evaluate(SystemPropertiesRestoreRule.java:57)
	at org.apache.lucene.util.TestRuleSetupTeardownChained$1.evaluate(TestRuleSetupTeardownChained.java:49)
	at org.apache.lucene.util.AbstractBeforeAfterRule$1.evaluate(AbstractBeforeAfterRule.java:45)
	at org.apache.lucene.util.TestRuleThreadAndTestName$1.evaluate(TestRuleThreadAndTestName.java:48)
	at org.apache.lucene.util.TestRuleIgnoreAfterMaxFailures$1.evaluate(TestRuleIgnoreAfterMaxFailures.java:64)
	at org.apache.lucene.util.TestRuleMarkFailure$1.evaluate(TestRuleMarkFailure.java:47)
	at com.carrotsearch.randomizedtesting.rules.StatementAdapter.evaluate(StatementAdapter.java:36)
	at com.carrotsearch.randomizedtesting.ThreadLeakControl$StatementRunner.run(ThreadLeakControl.java:368)
	at com.carrotsearch.randomizedtesting.ThreadLeakControl.forkTimeoutingTask(ThreadLeakControl.java:817)
	at com.carrotsearch.randomizedtesting.ThreadLeakControl$3.evaluate(ThreadLeakControl.java:468)
	at com.carrotsearch.randomizedtesting.RandomizedRunner.runSingleTest(RandomizedRunner.java:943)
	at com.carrotsearch.randomizedtesting.RandomizedRunner$5.evaluate(RandomizedRunner.java:829)
	at com.carrotsearch.randomizedtesting.RandomizedRunner$6.evaluate(RandomizedRunner.java:879)
	at com.carrotsearch.randomizedtesting.RandomizedRunner$7.evaluate(RandomizedRunner.java:890)
	at com.carrotsearch.randomizedtesting.rules.StatementAdapter.evaluate(StatementAdapter.java:36)
	at com.carrotsearch.randomizedtesting.rules.SystemPropertiesRestoreRule$1.evaluate(SystemPropertiesRestoreRule.java:57)
	at org.apache.lucene.util.AbstractBeforeAfterRule$1.evaluate(AbstractBeforeAfterRule.java:45)
	at com.carrotsearch.randomizedtesting.rules.StatementAdapter.evaluate(StatementAdapter.java:36)
	at org.apache.lucene.util.TestRuleStoreClassName$1.evaluate(TestRuleStoreClassName.java:41)
	at com.carrotsearch.randomizedtesting.rules.NoShadowingOrOverridesOnMethodsRule$1.evaluate(NoShadowingOrOverridesOnMethodsRule.java:40)
	at com.carrotsearch.randomizedtesting.rules.NoShadowingOrOverridesOnMethodsRule$1.evaluate(NoShadowingOrOverridesOnMethodsRule.java:40)
	at com.carrotsearch.randomizedtesting.rules.StatementAdapter.evaluate(StatementAdapter.java:36)
	at com.carrotsearch.randomizedtesting.rules.StatementAdapter.evaluate(StatementAdapter.java:36)
	at com.carrotsearch.randomizedtesting.rules.StatementAdapter.evaluate(StatementAdapter.java:36)
	at org.apache.lucene.util.TestRuleAssertionsRequired$1.evaluate(TestRuleAssertionsRequired.java:53)
	at org.apache.lucene.util.TestRuleMarkFailure$1.evaluate(TestRuleMarkFailure.java:47)
	at org.apache.lucene.util.TestRuleIgnoreAfterMaxFailures$1.evaluate(TestRuleIgnoreAfterMaxFailures.java:64)
	at org.apache.lucene.util.TestRuleIgnoreTestSuites$1.evaluate(TestRuleIgnoreTestSuites.java:54)
	at com.carrotsearch.randomizedtesting.rules.StatementAdapter.evaluate(StatementAdapter.java:36)
	at com.carrotsearch.randomizedtesting.ThreadLeakControl$StatementRunner.run(ThreadLeakControl.java:368)
	at java.lang.Thread.run(Thread.java:748)


FAILED:  org.apache.solr.core.BlobRepositoryMockingTest.testCloudOnly

Error Message:
 Mockito cannot mock this class: class org.apache.solr.core.CoreContainer.  Mockito can only mock non-private & non-final classes. If you're not sure why you're getting this error, please report to the mailing list.   Java               : 1.8 JVM vendor name    : Oracle Corporation JVM vendor version : 25.144-b01 JVM name           : Java HotSpot(TM) 64-Bit Server VM JVM version        : 1.8.0_144-b01 JVM info           : mixed mode OS name            : Mac OS X OS version         : 10.11.6   Underlying exception : java.lang.IllegalStateException: Error invoking java.lang.reflect.AnnotatedParameterizedType#getAnnotatedActualTypeArguments

Stack Trace:
org.mockito.exceptions.base.MockitoException: 
Mockito cannot mock this class: class org.apache.solr.core.CoreContainer.

Mockito can only mock non-private & non-final classes.
If you're not sure why you're getting this error, please report to the mailing list.


Java               : 1.8
JVM vendor name    : Oracle Corporation
JVM vendor version : 25.144-b01
JVM name           : Java HotSpot(TM) 64-Bit Server VM
JVM version        : 1.8.0_144-b01
JVM info           : mixed mode
OS name            : Mac OS X
OS version         : 10.11.6


Underlying exception : java.lang.IllegalStateException: Error invoking java.lang.reflect.AnnotatedParameterizedType#getAnnotatedActualTypeArguments
	at org.apache.solr.core.BlobRepositoryMockingTest.<init>(BlobRepositoryMockingTest.java:43)
	at sun.reflect.NativeConstructorAccessorImpl.newInstance0(Native Method)
	at sun.reflect.NativeConstructorAccessorImpl.newInstance(NativeConstructorAccessorImpl.java:62)
	at sun.reflect.DelegatingConstructorAccessorImpl.newInstance(DelegatingConstructorAccessorImpl.java:45)
	at java.lang.reflect.Constructor.newInstance(Constructor.java:423)
	at org.junit.runners.BlockJUnit4ClassRunner.createTest(BlockJUnit4ClassRunner.java:187)
	at org.junit.runners.BlockJUnit4ClassRunner$1.runReflectiveCall(BlockJUnit4ClassRunner.java:236)
	at org.junit.internal.runners.model.ReflectiveCallable.run(ReflectiveCallable.java:15)
	at org.junit.runners.BlockJUnit4ClassRunner.methodBlock(BlockJUnit4ClassRunner.java:233)
	at org.junit.runners.BlockJUnit4ClassRunner.runChild(BlockJUnit4ClassRunner.java:68)
	at org.junit.runners.BlockJUnit4ClassRunner.runChild(BlockJUnit4ClassRunner.java:47)
	at org.junit.runners.ParentRunner$3.run(ParentRunner.java:231)
	at org.junit.runners.ParentRunner$1.schedule(ParentRunner.java:60)
	at org.junit.runners.ParentRunner.runChildren(ParentRunner.java:229)
	at org.junit.runners.ParentRunner.access$000(ParentRunner.java:50)
	at org.junit.runners.ParentRunner$2.evaluate(ParentRunner.java:222)
	at org.junit.runners.ParentRunner.run(ParentRunner.java:300)
	at com.carrotsearch.ant.tasks.junit4.slave.SlaveMain.execute(SlaveMain.java:251)
	at com.carrotsearch.ant.tasks.junit4.slave.SlaveMain.main(SlaveMain.java:368)
	at com.carrotsearch.ant.tasks.junit4.slave.SlaveMainSafe.main(SlaveMainSafe.java:13)
Caused by: java.lang.IllegalStateException: Error invoking java.lang.reflect.AnnotatedParameterizedType#getAnnotatedActualTypeArguments
	at net.bytebuddy.description.type.TypeDescription$Generic$AnnotationReader$ForTypeArgument.resolve(TypeDescription.java:3271)
	at net.bytebuddy.description.type.TypeDescription$Generic$AnnotationReader$Delegator$Chained.resolve(TypeDescription.java:3052)
	at net.bytebuddy.description.type.TypeDescription$Generic$AnnotationReader$ForTypeArgument.resolve(TypeDescription.java:3238)
	at net.bytebuddy.description.type.TypeDescription$Generic$AnnotationReader$Delegator.asList(TypeDescription.java:3006)
	at net.bytebuddy.description.type.TypeDescription$Generic$OfNonGenericType$ForLoadedType.getDeclaredAnnotations(TypeDescription.java:3566)
	at net.bytebuddy.implementation.attribute.AnnotationAppender$ForTypeAnnotations.apply(AnnotationAppender.java:639)
	at net.bytebuddy.implementation.attribute.AnnotationAppender$ForTypeAnnotations.onNonGenericType(AnnotationAppender.java:620)
	at net.bytebuddy.implementation.attribute.AnnotationAppender$ForTypeAnnotations.onNonGenericType(AnnotationAppender.java:333)
	at net.bytebuddy.description.type.TypeDescription$Generic$OfNonGenericType.accept(TypeDescription.java:3433)
	at net.bytebuddy.implementation.attribute.AnnotationAppender$ForTypeAnnotations.onParameterizedType(AnnotationAppender.java:601)
	at net.bytebuddy.implementation.attribute.AnnotationAppender$ForTypeAnnotations.onParameterizedType(AnnotationAppender.java:333)
	at net.bytebuddy.description.type.TypeDescription$Generic$OfParameterizedType.accept(TypeDescription.java:4356)
	at net.bytebuddy.implementation.attribute.MethodAttributeAppender$ForInstrumentedMethod.apply(MethodAttributeAppender.java:171)
	at net.bytebuddy.implementation.attribute.MethodAttributeAppender$Compound.apply(MethodAttributeAppender.java:425)
	at net.bytebuddy.dynamic.scaffold.TypeWriter$MethodPool$Record$ForDefinedMethod$WithBody.applyAttributes(TypeWriter.java:609)
	at net.bytebuddy.dynamic.scaffold.TypeWriter$MethodPool$Record$ForDefinedMethod$WithBody.applyBody(TypeWriter.java:601)
	at net.bytebuddy.dynamic.scaffold.TypeWriter$MethodPool$Record$ForDefinedMethod.apply(TypeWriter.java:521)
	at net.bytebuddy.dynamic.scaffold.TypeWriter$Default$ForCreation.create(TypeWriter.java:4089)
	at net.bytebuddy.dynamic.scaffold.TypeWriter$Default.make(TypeWriter.java:1612)
	at net.bytebuddy.dynamic.scaffold.subclass.SubclassDynamicTypeBuilder.make(SubclassDynamicTypeBuilder.java:174)
	at net.bytebuddy.dynamic.scaffold.subclass.SubclassDynamicTypeBuilder.make(SubclassDynamicTypeBuilder.java:155)
	at net.bytebuddy.dynamic.DynamicType$Builder$AbstractBase.make(DynamicType.java:2536)
	at net.bytebuddy.dynamic.DynamicType$Builder$AbstractBase$Delegator.make(DynamicType.java:2638)
	at org.mockito.internal.creation.bytebuddy.SubclassBytecodeGenerator.mockClass(SubclassBytecodeGenerator.java:94)
	at org.mockito.internal.creation.bytebuddy.TypeCachingBytecodeGenerator$1.call(TypeCachingBytecodeGenerator.java:35)
	at org.mockito.internal.creation.bytebuddy.TypeCachingBytecodeGenerator$1.call(TypeCachingBytecodeGenerator.java:32)
	at net.bytebuddy.TypeCache.findOrInsert(TypeCache.java:138)
	at net.bytebuddy.TypeCache$WithInlineExpunction.findOrInsert(TypeCache.java:346)
	at net.bytebuddy.TypeCache.findOrInsert(TypeCache.java:161)
	at net.bytebuddy.TypeCache$WithInlineExpunction.findOrInsert(TypeCache.java:355)
	at org.mockito.internal.creation.bytebuddy.TypeCachingBytecodeGenerator.mockClass(TypeCachingBytecodeGenerator.java:30)
	at org.mockito.internal.creation.bytebuddy.SubclassByteBuddyMockMaker.createMockType(SubclassByteBuddyMockMaker.java:71)
	at org.mockito.internal.creation.bytebuddy.SubclassByteBuddyMockMaker.createMock(SubclassByteBuddyMockMaker.java:42)
	at org.mockito.internal.creation.bytebuddy.ByteBuddyMockMaker.createMock(ByteBuddyMockMaker.java:26)
	at org.mockito.internal.util.MockUtil.createMock(MockUtil.java:35)
	at org.mockito.internal.MockitoCore.mock(MockitoCore.java:65)
	at org.mockito.Mockito.mock(Mockito.java:1681)
	at org.mockito.Mockito.mock(Mockito.java:1594)
	... 20 more
Caused by: java.lang.NoClassDefFoundError: org/apache/solr/core/CoreContainer$CoreLoadFailure
	at java.lang.Class.getDeclaringClass0(Native Method)
	at java.lang.Class.getDeclaringClass(Class.java:1235)
	at java.lang.Class.getEnclosingClass(Class.java:1277)
	at sun.reflect.annotation.AnnotatedTypeFactory.addNesting(AnnotatedTypeFactory.java:96)
	at sun.reflect.annotation.AnnotatedTypeFactory.buildAnnotatedType(AnnotatedTypeFactory.java:65)
	at sun.reflect.annotation.AnnotatedTypeFactory$AnnotatedParameterizedTypeImpl.getAnnotatedActualTypeArguments(AnnotatedTypeFactory.java:255)
	at sun.reflect.GeneratedMethodAccessor80.invoke(Unknown Source)
	at sun.reflect.DelegatingMethodAccessorImpl.invoke(DelegatingMethodAccessorImpl.java:43)
	at java.lang.reflect.Method.invoke(Method.java:498)
	at net.bytebuddy.description.type.TypeDescription$Generic$AnnotationReader$ForTypeArgument.resolve(TypeDescription.java:3265)
	... 57 more


FAILED:  org.apache.solr.core.BlobRepositoryMockingTest.testGetBlobIncrRefString

Error Message:
 Mockito cannot mock this class: class org.apache.solr.core.CoreContainer.  Mockito can only mock non-private & non-final classes. If you're not sure why you're getting this error, please report to the mailing list.   Java               : 1.8 JVM vendor name    : Oracle Corporation JVM vendor version : 25.144-b01 JVM name           : Java HotSpot(TM) 64-Bit Server VM JVM version        : 1.8.0_144-b01 JVM info           : mixed mode OS name            : Mac OS X OS version         : 10.11.6   Underlying exception : java.lang.IllegalStateException: Error invoking java.lang.reflect.AnnotatedParameterizedType#getAnnotatedActualTypeArguments

Stack Trace:
org.mockito.exceptions.base.MockitoException: 
Mockito cannot mock this class: class org.apache.solr.core.CoreContainer.

Mockito can only mock non-private & non-final classes.
If you're not sure why you're getting this error, please report to the mailing list.


Java               : 1.8
JVM vendor name    : Oracle Corporation
JVM vendor version : 25.144-b01
JVM name           : Java HotSpot(TM) 64-Bit Server VM
JVM version        : 1.8.0_144-b01
JVM info           : mixed mode
OS name            : Mac OS X
OS version         : 10.11.6


Underlying exception : java.lang.IllegalStateException: Error invoking java.lang.reflect.AnnotatedParameterizedType#getAnnotatedActualTypeArguments
	at org.apache.solr.core.BlobRepositoryMockingTest.<init>(BlobRepositoryMockingTest.java:43)
	at sun.reflect.NativeConstructorAccessorImpl.newInstance0(Native Method)
	at sun.reflect.NativeConstructorAccessorImpl.newInstance(NativeConstructorAccessorImpl.java:62)
	at sun.reflect.DelegatingConstructorAccessorImpl.newInstance(DelegatingConstructorAccessorImpl.java:45)
	at java.lang.reflect.Constructor.newInstance(Constructor.java:423)
	at org.junit.runners.BlockJUnit4ClassRunner.createTest(BlockJUnit4ClassRunner.java:187)
	at org.junit.runners.BlockJUnit4ClassRunner$1.runReflectiveCall(BlockJUnit4ClassRunner.java:236)
	at org.junit.internal.runners.model.ReflectiveCallable.run(ReflectiveCallable.java:15)
	at org.junit.runners.BlockJUnit4ClassRunner.methodBlock(BlockJUnit4ClassRunner.java:233)
	at org.junit.runners.BlockJUnit4ClassRunner.runChild(BlockJUnit4ClassRunner.java:68)
	at org.junit.runners.BlockJUnit4ClassRunner.runChild(BlockJUnit4ClassRunner.java:47)
	at org.junit.runners.ParentRunner$3.run(ParentRunner.java:231)
	at org.junit.runners.ParentRunner$1.schedule(ParentRunner.java:60)
	at org.junit.runners.ParentRunner.runChildren(ParentRunner.java:229)
	at org.junit.runners.ParentRunner.access$000(ParentRunner.java:50)
	at org.junit.runners.ParentRunner$2.evaluate(ParentRunner.java:222)
	at org.junit.runners.ParentRunner.run(ParentRunner.java:300)
	at com.carrotsearch.ant.tasks.junit4.slave.SlaveMain.execute(SlaveMain.java:251)
	at com.carrotsearch.ant.tasks.junit4.slave.SlaveMain.main(SlaveMain.java:368)
	at com.carrotsearch.ant.tasks.junit4.slave.SlaveMainSafe.main(SlaveMainSafe.java:13)
Caused by: java.lang.IllegalStateException: Error invoking java.lang.reflect.AnnotatedParameterizedType#getAnnotatedActualTypeArguments
	at net.bytebuddy.description.type.TypeDescription$Generic$AnnotationReader$ForTypeArgument.resolve(TypeDescription.java:3271)
	at net.bytebuddy.description.type.TypeDescription$Generic$AnnotationReader$Delegator$Chained.resolve(TypeDescription.java:3052)
	at net.bytebuddy.description.type.TypeDescription$Generic$AnnotationReader$ForTypeArgument.resolve(TypeDescription.java:3238)
	at net.bytebuddy.description.type.TypeDescription$Generic$AnnotationReader$Delegator.asList(TypeDescription.java:3006)
	at net.bytebuddy.description.type.TypeDescription$Generic$OfNonGenericType$ForLoadedType.getDeclaredAnnotations(TypeDescription.java:3566)
	at net.bytebuddy.implementation.attribute.AnnotationAppender$ForTypeAnnotations.apply(AnnotationAppender.java:639)
	at net.bytebuddy.implementation.attribute.AnnotationAppender$ForTypeAnnotations.onNonGenericType(AnnotationAppender.java:620)
	at net.bytebuddy.implementation.attribute.AnnotationAppender$ForTypeAnnotations.onNonGenericType(AnnotationAppender.java:333)
	at net.bytebuddy.description.type.TypeDescription$Generic$OfNonGenericType.accept(TypeDescription.java:3433)
	at net.bytebuddy.implementation.attribute.AnnotationAppender$ForTypeAnnotations.onParameterizedType(AnnotationAppender.java:601)
	at net.bytebuddy.implementation.attribute.AnnotationAppender$ForTypeAnnotations.onParameterizedType(AnnotationAppender.java:333)
	at net.bytebuddy.description.type.TypeDescription$Generic$OfParameterizedType.accept(TypeDescription.java:4356)
	at net.bytebuddy.implementation.attribute.MethodAttributeAppender$ForInstrumentedMethod.apply(MethodAttributeAppender.java:171)
	at net.bytebuddy.implementation.attribute.MethodAttributeAppender$Compound.apply(MethodAttributeAppender.java:425)
	at net.bytebuddy.dynamic.scaffold.TypeWriter$MethodPool$Record$ForDefinedMethod$WithBody.applyAttributes(TypeWriter.java:609)
	at net.bytebuddy.dynamic.scaffold.TypeWriter$MethodPool$Record$ForDefinedMethod$WithBody.applyBody(TypeWriter.java:601)
	at net.bytebuddy.dynamic.scaffold.TypeWriter$MethodPool$Record$ForDefinedMethod.apply(TypeWriter.java:521)
	at net.bytebuddy.dynamic.scaffold.TypeWriter$Default$ForCreation.create(TypeWriter.java:4089)
	at net.bytebuddy.dynamic.scaffold.TypeWriter$Default.make(TypeWriter.java:1612)
	at net.bytebuddy.dynamic.scaffold.subclass.SubclassDynamicTypeBuilder.make(SubclassDynamicTypeBuilder.java:174)
	at net.bytebuddy.dynamic.scaffold.subclass.SubclassDynamicTypeBuilder.make(SubclassDynamicTypeBuilder.java:155)
	at net.bytebuddy.dynamic.DynamicType$Builder$AbstractBase.make(DynamicType.java:2536)
	at net.bytebuddy.dynamic.DynamicType$Builder$AbstractBase$Delegator.make(DynamicType.java:2638)
	at org.mockito.internal.creation.bytebuddy.SubclassBytecodeGenerator.mockClass(SubclassBytecodeGenerator.java:94)
	at org.mockito.internal.creation.bytebuddy.TypeCachingBytecodeGenerator$1.call(TypeCachingBytecodeGenerator.java:35)
	at org.mockito.internal.creation.bytebuddy.TypeCachingBytecodeGenerator$1.call(TypeCachingBytecodeGenerator.java:32)
	at net.bytebuddy.TypeCache.findOrInsert(TypeCache.java:138)
	at net.bytebuddy.TypeCache$WithInlineExpunction.findOrInsert(TypeCache.java:346)
	at net.bytebuddy.TypeCache.findOrInsert(TypeCache.java:161)
	at net.bytebuddy.TypeCache$WithInlineExpunction.findOrInsert(TypeCache.java:355)
	at org.mockito.internal.creation.bytebuddy.TypeCachingBytecodeGenerator.mockClass(TypeCachingBytecodeGenerator.java:30)
	at org.mockito.internal.creation.bytebuddy.SubclassByteBuddyMockMaker.createMockType(SubclassByteBuddyMockMaker.java:71)
	at org.mockito.internal.creation.bytebuddy.SubclassByteBuddyMockMaker.createMock(SubclassByteBuddyMockMaker.java:42)
	at org.mockito.internal.creation.bytebuddy.ByteBuddyMockMaker.createMock(ByteBuddyMockMaker.java:26)
	at org.mockito.internal.util.MockUtil.createMock(MockUtil.java:35)
	at org.mockito.internal.MockitoCore.mock(MockitoCore.java:65)
	at org.mockito.Mockito.mock(Mockito.java:1681)
	at org.mockito.Mockito.mock(Mockito.java:1594)
	... 20 more
Caused by: java.lang.NoClassDefFoundError: org/apache/solr/core/CoreContainer$CoreLoadFailure
	at java.lang.Class.getDeclaringClass0(Native Method)
	at java.lang.Class.getDeclaringClass(Class.java:1235)
	at java.lang.Class.getEnclosingClass(Class.java:1277)
	at sun.reflect.annotation.AnnotatedTypeFactory.addNesting(AnnotatedTypeFactory.java:96)
	at sun.reflect.annotation.AnnotatedTypeFactory.buildAnnotatedType(AnnotatedTypeFactory.java:65)
	at sun.reflect.annotation.AnnotatedTypeFactory$AnnotatedParameterizedTypeImpl.getAnnotatedActualTypeArguments(AnnotatedTypeFactory.java:255)
	at sun.reflect.GeneratedMethodAccessor80.invoke(Unknown Source)
	at sun.reflect.DelegatingMethodAccessorImpl.invoke(DelegatingMethodAccessorImpl.java:43)
	at java.lang.reflect.Method.invoke(Method.java:498)
	at net.bytebuddy.description.type.TypeDescription$Generic$AnnotationReader$ForTypeArgument.resolve(TypeDescription.java:3265)
	... 57 more


FAILED:  org.apache.solr.core.BlobRepositoryMockingTest.testCachedAlready

Error Message:
 Mockito cannot mock this class: class org.apache.solr.core.CoreContainer.  Mockito can only mock non-private & non-final classes. If you're not sure why you're getting this error, please report to the mailing list.   Java               : 1.8 JVM vendor name    : Oracle Corporation JVM vendor version : 25.144-b01 JVM name           : Java HotSpot(TM) 64-Bit Server VM JVM version        : 1.8.0_144-b01 JVM info           : mixed mode OS name            : Mac OS X OS version         : 10.11.6   Underlying exception : java.lang.IllegalStateException: Error invoking java.lang.reflect.AnnotatedParameterizedType#getAnnotatedActualTypeArguments

Stack Trace:
org.mockito.exceptions.base.MockitoException: 
Mockito cannot mock this class: class org.apache.solr.core.CoreContainer.

Mockito can only mock non-private & non-final classes.
If you're not sure why you're getting this error, please report to the mailing list.


Java               : 1.8
JVM vendor name    : Oracle Corporation
JVM vendor version : 25.144-b01
JVM name           : Java HotSpot(TM) 64-Bit Server VM
JVM version        : 1.8.0_144-b01
JVM info           : mixed mode
OS name            : Mac OS X
OS version         : 10.11.6


Underlying exception : java.lang.IllegalStateException: Error invoking java.lang.reflect.AnnotatedParameterizedType#getAnnotatedActualTypeArguments
	at org.apache.solr.core.BlobRepositoryMockingTest.<init>(BlobRepositoryMockingTest.java:43)
	at sun.reflect.NativeConstructorAccessorImpl.newInstance0(Native Method)
	at sun.reflect.NativeConstructorAccessorImpl.newInstance(NativeConstructorAccessorImpl.java:62)
	at sun.reflect.DelegatingConstructorAccessorImpl.newInstance(DelegatingConstructorAccessorImpl.java:45)
	at java.lang.reflect.Constructor.newInstance(Constructor.java:423)
	at org.junit.runners.BlockJUnit4ClassRunner.createTest(BlockJUnit4ClassRunner.java:187)
	at org.junit.runners.BlockJUnit4ClassRunner$1.runReflectiveCall(BlockJUnit4ClassRunner.java:236)
	at org.junit.internal.runners.model.ReflectiveCallable.run(ReflectiveCallable.java:15)
	at org.junit.runners.BlockJUnit4ClassRunner.methodBlock(BlockJUnit4ClassRunner.java:233)
	at org.junit.runners.BlockJUnit4ClassRunner.runChild(BlockJUnit4ClassRunner.java:68)
	at org.junit.runners.BlockJUnit4ClassRunner.runChild(BlockJUnit4ClassRunner.java:47)
	at org.junit.runners.ParentRunner$3.run(ParentRunner.java:231)
	at org.junit.runners.ParentRunner$1.schedule(ParentRunner.java:60)
	at org.junit.runners.ParentRunner.runChildren(ParentRunner.java:229)
	at org.junit.runners.ParentRunner.access$000(ParentRunner.java:50)
	at org.junit.runners.ParentRunner$2.evaluate(ParentRunner.java:222)
	at org.junit.runners.ParentRunner.run(ParentRunner.java:300)
	at com.carrotsearch.ant.tasks.junit4.slave.SlaveMain.execute(SlaveMain.java:251)
	at com.carrotsearch.ant.tasks.junit4.slave.SlaveMain.main(SlaveMain.java:368)
	at com.carrotsearch.ant.tasks.junit4.slave.SlaveMainSafe.main(SlaveMainSafe.java:13)
Caused by: java.lang.IllegalStateException: Error invoking java.lang.reflect.AnnotatedParameterizedType#getAnnotatedActualTypeArguments
	at net.bytebuddy.description.type.TypeDescription$Generic$AnnotationReader$ForTypeArgument.resolve(TypeDescription.java:3271)
	at net.bytebuddy.description.type.TypeDescription$Generic$AnnotationReader$Delegator$Chained.resolve(TypeDescription.java:3052)
	at net.bytebuddy.description.type.TypeDescription$Generic$AnnotationReader$ForTypeArgument.resolve(TypeDescription.java:3238)
	at net.bytebuddy.description.type.TypeDescription$Generic$AnnotationReader$Delegator.asList(TypeDescription.java:3006)
	at net.bytebuddy.description.type.TypeDescription$Generic$OfNonGenericType$ForLoadedType.getDeclaredAnnotations(TypeDescription.java:3566)
	at net.bytebuddy.implementation.attribute.AnnotationAppender$ForTypeAnnotations.apply(AnnotationAppender.java:639)
	at net.bytebuddy.implementation.attribute.AnnotationAppender$ForTypeAnnotations.onNonGenericType(AnnotationAppender.java:620)
	at net.bytebuddy.implementation.attribute.AnnotationAppender$ForTypeAnnotations.onNonGenericType(AnnotationAppender.java:333)
	at net.bytebuddy.description.type.TypeDescription$Generic$OfNonGenericType.accept(TypeDescription.java:3433)
	at net.bytebuddy.implementation.attribute.AnnotationAppender$ForTypeAnnotations.onParameterizedType(AnnotationAppender.java:601)
	at net.bytebuddy.implementation.attribute.AnnotationAppender$ForTypeAnnotations.onParameterizedType(AnnotationAppender.java:333)
	at net.bytebuddy.description.type.TypeDescription$Generic$OfParameterizedType.accept(TypeDescription.java:4356)
	at net.bytebuddy.implementation.attribute.MethodAttributeAppender$ForInstrumentedMethod.apply(MethodAttributeAppender.java:171)
	at net.bytebuddy.implementation.attribute.MethodAttributeAppender$Compound.apply(MethodAttributeAppender.java:425)
	at net.bytebuddy.dynamic.scaffold.TypeWriter$MethodPool$Record$ForDefinedMethod$WithBody.applyAttributes(TypeWriter.java:609)
	at net.bytebuddy.dynamic.scaffold.TypeWriter$MethodPool$Record$ForDefinedMethod$WithBody.applyBody(TypeWriter.java:601)
	at net.bytebuddy.dynamic.scaffold.TypeWriter$MethodPool$Record$ForDefinedMethod.apply(TypeWriter.java:521)
	at net.bytebuddy.dynamic.scaffold.TypeWriter$Default$ForCreation.create(TypeWriter.java:4089)
	at net.bytebuddy.dynamic.scaffold.TypeWriter$Default.make(TypeWriter.java:1612)
	at net.bytebuddy.dynamic.scaffold.subclass.SubclassDynamicTypeBuilder.make(SubclassDynamicTypeBuilder.java:174)
	at net.bytebuddy.dynamic.scaffold.subclass.SubclassDynamicTypeBuilder.make(SubclassDynamicTypeBuilder.java:155)
	at net.bytebuddy.dynamic.DynamicType$Builder$AbstractBase.make(DynamicType.java:2536)
	at net.bytebuddy.dynamic.DynamicType$Builder$AbstractBase$Delegator.make(DynamicType.java:2638)
	at org.mockito.internal.creation.bytebuddy.SubclassBytecodeGenerator.mockClass(SubclassBytecodeGenerator.java:94)
	at org.mockito.internal.creation.bytebuddy.TypeCachingBytecodeGenerator$1.call(TypeCachingBytecodeGenerator.java:35)
	at org.mockito.internal.creation.bytebuddy.TypeCachingBytecodeGenerator$1.call(TypeCachingBytecodeGenerator.java:32)
	at net.bytebuddy.TypeCache.findOrInsert(TypeCache.java:138)
	at net.bytebuddy.TypeCache$WithInlineExpunction.findOrInsert(TypeCache.java:346)
	at net.bytebuddy.TypeCache.findOrInsert(TypeCache.java:161)
	at net.bytebuddy.TypeCache$WithInlineExpunction.findOrInsert(TypeCache.java:355)
	at org.mockito.internal.creation.bytebuddy.TypeCachingBytecodeGenerator.mockClass(TypeCachingBytecodeGenerator.java:30)
	at org.mockito.internal.creation.bytebuddy.SubclassByteBuddyMockMaker.createMockType(SubclassByteBuddyMockMaker.java:71)
	at org.mockito.internal.creation.bytebuddy.SubclassByteBuddyMockMaker.createMock(SubclassByteBuddyMockMaker.java:42)
	at org.mockito.internal.creation.bytebuddy.ByteBuddyMockMaker.createMock(ByteBuddyMockMaker.java:26)
	at org.mockito.internal.util.MockUtil.createMock(MockUtil.java:35)
	at org.mockito.internal.MockitoCore.mock(MockitoCore.java:65)
	at org.mockito.Mockito.mock(Mockito.java:1681)
	at org.mockito.Mockito.mock(Mockito.java:1594)
	... 20 more
Caused by: java.lang.NoClassDefFoundError: org/apache/solr/core/CoreContainer$CoreLoadFailure
	at java.lang.Class.getDeclaringClass0(Native Method)
	at java.lang.Class.getDeclaringClass(Class.java:1235)
	at java.lang.Class.getEnclosingClass(Class.java:1277)
	at sun.reflect.annotation.AnnotatedTypeFactory.addNesting(AnnotatedTypeFactory.java:96)
	at sun.reflect.annotation.AnnotatedTypeFactory.buildAnnotatedType(AnnotatedTypeFactory.java:65)
	at sun.reflect.annotation.AnnotatedTypeFactory$AnnotatedParameterizedTypeImpl.getAnnotatedActualTypeArguments(AnnotatedTypeFactory.java:255)
	at sun.reflect.GeneratedMethodAccessor80.invoke(Unknown Source)
	at sun.reflect.DelegatingMethodAccessorImpl.invoke(DelegatingMethodAccessorImpl.java:43)
	at java.lang.reflect.Method.invoke(Method.java:498)
	at net.bytebuddy.description.type.TypeDescription$Generic$AnnotationReader$ForTypeArgument.resolve(TypeDescription.java:3265)
	... 57 more


FAILED:  org.apache.solr.core.BlobRepositoryMockingTest.testGetBlobIncrRefStringDecoder

Error Message:
 Mockito cannot mock this class: class org.apache.solr.core.CoreContainer.  Mockito can only mock non-private & non-final classes. If you're not sure why you're getting this error, please report to the mailing list.   Java               : 1.8 JVM vendor name    : Oracle Corporation JVM vendor version : 25.144-b01 JVM name           : Java HotSpot(TM) 64-Bit Server VM JVM version        : 1.8.0_144-b01 JVM info           : mixed mode OS name            : Mac OS X OS version         : 10.11.6   Underlying exception : java.lang.IllegalStateException: Error invoking java.lang.reflect.AnnotatedParameterizedType#getAnnotatedActualTypeArguments

Stack Trace:
org.mockito.exceptions.base.MockitoException: 
Mockito cannot mock this class: class org.apache.solr.core.CoreContainer.

Mockito can only mock non-private & non-final classes.
If you're not sure why you're getting this error, please report to the mailing list.


Java               : 1.8
JVM vendor name    : Oracle Corporation
JVM vendor version : 25.144-b01
JVM name           : Java HotSpot(TM) 64-Bit Server VM
JVM version        : 1.8.0_144-b01
JVM info           : mixed mode
OS name            : Mac OS X
OS version         : 10.11.6


Underlying exception : java.lang.IllegalStateException: Error invoking java.lang.reflect.AnnotatedParameterizedType#getAnnotatedActualTypeArguments
	at org.apache.solr.core.BlobRepositoryMockingTest.<init>(BlobRepositoryMockingTest.java:43)
	at sun.reflect.NativeConstructorAccessorImpl.newInstance0(Native Method)
	at sun.reflect.NativeConstructorAccessorImpl.newInstance(NativeConstructorAccessorImpl.java:62)
	at sun.reflect.DelegatingConstructorAccessorImpl.newInstance(DelegatingConstructorAccessorImpl.java:45)
	at java.lang.reflect.Constructor.newInstance(Constructor.java:423)
	at org.junit.runners.BlockJUnit4ClassRunner.createTest(BlockJUnit4ClassRunner.java:187)
	at org.junit.runners.BlockJUnit4ClassRunner$1.runReflectiveCall(BlockJUnit4ClassRunner.java:236)
	at org.junit.internal.runners.model.ReflectiveCallable.run(ReflectiveCallable.java:15)
	at org.junit.runners.BlockJUnit4ClassRunner.methodBlock(BlockJUnit4ClassRunner.java:233)
	at org.junit.runners.BlockJUnit4ClassRunner.runChild(BlockJUnit4ClassRunner.java:68)
	at org.junit.runners.BlockJUnit4ClassRunner.runChild(BlockJUnit4ClassRunner.java:47)
	at org.junit.runners.ParentRunner$3.run(ParentRunner.java:231)
	at org.junit.runners.ParentRunner$1.schedule(ParentRunner.java:60)
	at org.junit.runners.ParentRunner.runChildren(ParentRunner.java:229)
	at org.junit.runners.ParentRunner.access$000(ParentRunner.java:50)
	at org.junit.runners.ParentRunner$2.evaluate(ParentRunner.java:222)
	at org.junit.runners.ParentRunner.run(ParentRunner.java:300)
	at com.carrotsearch.ant.tasks.junit4.slave.SlaveMain.execute(SlaveMain.java:251)
	at com.carrotsearch.ant.tasks.junit4.slave.SlaveMain.main(SlaveMain.java:368)
	at com.carrotsearch.ant.tasks.junit4.slave.SlaveMainSafe.main(SlaveMainSafe.java:13)
Caused by: java.lang.IllegalStateException: Error invoking java.lang.reflect.AnnotatedParameterizedType#getAnnotatedActualTypeArguments
	at net.bytebuddy.description.type.TypeDescription$Generic$AnnotationReader$ForTypeArgument.resolve(TypeDescription.java:3271)
	at net.bytebuddy.description.type.TypeDescription$Generic$AnnotationReader$Delegator$Chained.resolve(TypeDescription.java:3052)
	at net.bytebuddy.description.type.TypeDescription$Generic$AnnotationReader$ForTypeArgument.resolve(TypeDescription.java:3238)
	at net.bytebuddy.description.type.TypeDescription$Generic$AnnotationReader$Delegator.asList(TypeDescription.java:3006)
	at net.bytebuddy.description.type.TypeDescription$Generic$OfNonGenericType$ForLoadedType.getDeclaredAnnotations(TypeDescription.java:3566)
	at net.bytebuddy.implementation.attribute.AnnotationAppender$ForTypeAnnotations.apply(AnnotationAppender.java:639)
	at net.bytebuddy.implementation.attribute.AnnotationAppender$ForTypeAnnotations.onNonGenericType(AnnotationAppender.java:620)
	at net.bytebuddy.implementation.attribute.AnnotationAppender$ForTypeAnnotations.onNonGenericType(AnnotationAppender.java:333)
	at net.bytebuddy.description.type.TypeDescription$Generic$OfNonGenericType.accept(TypeDescription.java:3433)
	at net.bytebuddy.implementation.attribute.AnnotationAppender$ForTypeAnnotations.onParameterizedType(AnnotationAppender.java:601)
	at net.bytebuddy.implementation.attribute.AnnotationAppender$ForTypeAnnotations.onParameterizedType(AnnotationAppender.java:333)
	at net.bytebuddy.description.type.TypeDescription$Generic$OfParameterizedType.accept(TypeDescription.java:4356)
	at net.bytebuddy.implementation.attribute.MethodAttributeAppender$ForInstrumentedMethod.apply(MethodAttributeAppender.java:171)
	at net.bytebuddy.implementation.attribute.MethodAttributeAppender$Compound.apply(MethodAttributeAppender.java:425)
	at net.bytebuddy.dynamic.scaffold.TypeWriter$MethodPool$Record$ForDefinedMethod$WithBody.applyAttributes(TypeWriter.java:609)
	at net.bytebuddy.dynamic.scaffold.TypeWriter$MethodPool$Record$ForDefinedMethod$WithBody.applyBody(TypeWriter.java:601)
	at net.bytebuddy.dynamic.scaffold.TypeWriter$MethodPool$Record$ForDefinedMethod.apply(TypeWriter.java:521)
	at net.bytebuddy.dynamic.scaffold.TypeWriter$Default$ForCreation.create(TypeWriter.java:4089)
	at net.bytebuddy.dynamic.scaffold.TypeWriter$Default.make(TypeWriter.java:1612)
	at net.bytebuddy.dynamic.scaffold.subclass.SubclassDynamicTypeBuilder.make(SubclassDynamicTypeBuilder.java:174)
	at net.bytebuddy.dynamic.scaffold.subclass.SubclassDynamicTypeBuilder.make(SubclassDynamicTypeBuilder.java:155)
	at net.bytebuddy.dynamic.DynamicType$Builder$AbstractBase.make(DynamicType.java:2536)
	at net.bytebuddy.dynamic.DynamicType$Builder$AbstractBase$Delegator.make(DynamicType.java:2638)
	at org.mockito.internal.creation.bytebuddy.SubclassBytecodeGenerator.mockClass(SubclassBytecodeGenerator.java:94)
	at org.mockito.internal.creation.bytebuddy.TypeCachingBytecodeGenerator$1.call(TypeCachingBytecodeGenerator.java:35)
	at org.mockito.internal.creation.bytebuddy.TypeCachingBytecodeGenerator$1.call(TypeCachingBytecodeGenerator.java:32)
	at net.bytebuddy.TypeCache.findOrInsert(TypeCache.java:138)
	at net.bytebuddy.TypeCache$WithInlineExpunction.findOrInsert(TypeCache.java:346)
	at net.bytebuddy.TypeCache.findOrInsert(TypeCache.java:161)
	at net.bytebuddy.TypeCache$WithInlineExpunction.findOrInsert(TypeCache.java:355)
	at org.mockito.internal.creation.bytebuddy.TypeCachingBytecodeGenerator.mockClass(TypeCachingBytecodeGenerator.java:30)
	at org.mockito.internal.creation.bytebuddy.SubclassByteBuddyMockMaker.createMockType(SubclassByteBuddyMockMaker.java:71)
	at org.mockito.internal.creation.bytebuddy.SubclassByteBuddyMockMaker.createMock(SubclassByteBuddyMockMaker.java:42)
	at org.mockito.internal.creation.bytebuddy.ByteBuddyMockMaker.createMock(ByteBuddyMockMaker.java:26)
	at org.mockito.internal.util.MockUtil.createMock(MockUtil.java:35)
	at org.mockito.internal.MockitoCore.mock(MockitoCore.java:65)
	at org.mockito.Mockito.mock(Mockito.java:1681)
	at org.mockito.Mockito.mock(Mockito.java:1594)
	... 20 more
Caused by: java.lang.NoClassDefFoundError: org/apache/solr/core/CoreContainer$CoreLoadFailure
	at java.lang.Class.getDeclaringClass0(Native Method)
	at java.lang.Class.getDeclaringClass(Class.java:1235)
	at java.lang.Class.getEnclosingClass(Class.java:1277)
	at sun.reflect.annotation.AnnotatedTypeFactory.addNesting(AnnotatedTypeFactory.java:96)
	at sun.reflect.annotation.AnnotatedTypeFactory.buildAnnotatedType(AnnotatedTypeFactory.java:65)
	at sun.reflect.annotation.AnnotatedTypeFactory$AnnotatedParameterizedTypeImpl.getAnnotatedActualTypeArguments(AnnotatedTypeFactory.java:255)
	at sun.reflect.GeneratedMethodAccessor80.invoke(Unknown Source)
	at sun.reflect.DelegatingMethodAccessorImpl.invoke(DelegatingMethodAccessorImpl.java:43)
	at java.lang.reflect.Method.invoke(Method.java:498)
	at net.bytebuddy.description.type.TypeDescription$Generic$AnnotationReader$ForTypeArgument.resolve(TypeDescription.java:3265)
	... 57 more


FAILED:  org.apache.solr.core.SolrCoreCheckLockOnStartupTest.testSimpleLockErrorOnStartup

Error Message:
Expected LockObtainFailedException

Stack Trace:
java.lang.AssertionError: Expected LockObtainFailedException
	at __randomizedtesting.SeedInfo.seed([393134CE924FE1A4:10CA5E8783C01D16]:0)
	at org.junit.Assert.fail(Assert.java:93)
	at org.apache.solr.core.SolrCoreCheckLockOnStartupTest.testSimpleLockErrorOnStartup(SolrCoreCheckLockOnStartupTest.java:66)
	at sun.reflect.NativeMethodAccessorImpl.invoke0(Native Method)
	at sun.reflect.NativeMethodAccessorImpl.invoke(NativeMethodAccessorImpl.java:62)
	at sun.reflect.DelegatingMethodAccessorImpl.invoke(DelegatingMethodAccessorImpl.java:43)
	at java.lang.reflect.Method.invoke(Method.java:498)
	at com.carrotsearch.randomizedtesting.RandomizedRunner.invoke(RandomizedRunner.java:1737)
	at com.carrotsearch.randomizedtesting.RandomizedRunner$8.evaluate(RandomizedRunner.java:934)
	at com.carrotsearch.randomizedtesting.RandomizedRunner$9.evaluate(RandomizedRunner.java:970)
	at com.carrotsearch.randomizedtesting.RandomizedRunner$10.evaluate(RandomizedRunner.java:984)
	at com.carrotsearch.randomizedtesting.rules.SystemPropertiesRestoreRule$1.evaluate(SystemPropertiesRestoreRule.java:57)
	at org.apache.lucene.util.TestRuleSetupTeardownChained$1.evaluate(TestRuleSetupTeardownChained.java:49)
	at org.apache.lucene.util.AbstractBeforeAfterRule$1.evaluate(AbstractBeforeAfterRule.java:45)
	at org.apache.lucene.util.TestRuleThreadAndTestName$1.evaluate(TestRuleThreadAndTestName.java:48)
	at org.apache.lucene.util.TestRuleIgnoreAfterMaxFailures$1.evaluate(TestRuleIgnoreAfterMaxFailures.java:64)
	at org.apache.lucene.util.TestRuleMarkFailure$1.evaluate(TestRuleMarkFailure.java:47)
	at com.carrotsearch.randomizedtesting.rules.StatementAdapter.evaluate(StatementAdapter.java:36)
	at com.carrotsearch.randomizedtesting.ThreadLeakControl$StatementRunner.run(ThreadLeakControl.java:368)
	at com.carrotsearch.randomizedtesting.ThreadLeakControl.forkTimeoutingTask(ThreadLeakControl.java:817)
	at com.carrotsearch.randomizedtesting.ThreadLeakControl$3.evaluate(ThreadLeakControl.java:468)
	at com.carrotsearch.randomizedtesting.RandomizedRunner.runSingleTest(RandomizedRunner.java:943)
	at com.carrotsearch.randomizedtesting.RandomizedRunner$5.evaluate(RandomizedRunner.java:829)
	at com.carrotsearch.randomizedtesting.RandomizedRunner$6.evaluate(RandomizedRunner.java:879)
	at com.carrotsearch.randomizedtesting.RandomizedRunner$7.evaluate(RandomizedRunner.java:890)
	at com.carrotsearch.randomizedtesting.rules.StatementAdapter.evaluate(StatementAdapter.java:36)
	at com.carrotsearch.randomizedtesting.rules.SystemPropertiesRestoreRule$1.evaluate(SystemPropertiesRestoreRule.java:57)
	at org.apache.lucene.util.AbstractBeforeAfterRule$1.evaluate(AbstractBeforeAfterRule.java:45)
	at com.carrotsearch.randomizedtesting.rules.StatementAdapter.evaluate(StatementAdapter.java:36)
	at org.apache.lucene.util.TestRuleStoreClassName$1.evaluate(TestRuleStoreClassName.java:41)
	at com.carrotsearch.randomizedtesting.rules.NoShadowingOrOverridesOnMethodsRule$1.evaluate(NoShadowingOrOverridesOnMethodsRule.java:40)
	at com.carrotsearch.randomizedtesting.rules.NoShadowingOrOverridesOnMethodsRule$1.evaluate(NoShadowingOrOverridesOnMethodsRule.java:40)
	at com.carrotsearch.randomizedtesting.rules.StatementAdapter.evaluate(StatementAdapter.java:36)
	at com.carrotsearch.randomizedtesting.rules.StatementAdapter.evaluate(StatementAdapter.java:36)
	at com.carrotsearch.randomizedtesting.rules.StatementAdapter.evaluate(StatementAdapter.java:36)
	at org.apache.lucene.util.TestRuleAssertionsRequired$1.evaluate(TestRuleAssertionsRequired.java:53)
	at org.apache.lucene.util.TestRuleMarkFailure$1.evaluate(TestRuleMarkFailure.java:47)
	at org.apache.lucene.util.TestRuleIgnoreAfterMaxFailures$1.evaluate(TestRuleIgnoreAfterMaxFailures.java:64)
	at org.apache.lucene.util.TestRuleIgnoreTestSuites$1.evaluate(TestRuleIgnoreTestSuites.java:54)
	at com.carrotsearch.randomizedtesting.rules.StatementAdapter.evaluate(StatementAdapter.java:36)
	at com.carrotsearch.randomizedtesting.ThreadLeakControl$StatementRunner.run(ThreadLeakControl.java:368)
	at java.lang.Thread.run(Thread.java:748)


FAILED:  org.apache.solr.core.SolrCoreCheckLockOnStartupTest.testNativeLockErrorOnStartup

Error Message:
Expected LockObtainFailedException

Stack Trace:
java.lang.AssertionError: Expected LockObtainFailedException
	at __randomizedtesting.SeedInfo.seed([393134CE924FE1A4:B01CC74EB69B7C78]:0)
	at org.junit.Assert.fail(Assert.java:93)
	at org.apache.solr.core.SolrCoreCheckLockOnStartupTest.testNativeLockErrorOnStartup(SolrCoreCheckLockOnStartupTest.java:93)
	at sun.reflect.NativeMethodAccessorImpl.invoke0(Native Method)
	at sun.reflect.NativeMethodAccessorImpl.invoke(NativeMethodAccessorImpl.java:62)
	at sun.reflect.DelegatingMethodAccessorImpl.invoke(DelegatingMethodAccessorImpl.java:43)
	at java.lang.reflect.Method.invoke(Method.java:498)
	at com.carrotsearch.randomizedtesting.RandomizedRunner.invoke(RandomizedRunner.java:1737)
	at com.carrotsearch.randomizedtesting.RandomizedRunner$8.evaluate(RandomizedRunner.java:934)
	at com.carrotsearch.randomizedtesting.RandomizedRunner$9.evaluate(RandomizedRunner.java:970)
	at com.carrotsearch.randomizedtesting.RandomizedRunner$10.evaluate(RandomizedRunner.java:984)
	at com.carrotsearch.randomizedtesting.rules.SystemPropertiesRestoreRule$1.evaluate(SystemPropertiesRestoreRule.java:57)
	at org.apache.lucene.util.TestRuleSetupTeardownChained$1.evaluate(TestRuleSetupTeardownChained.java:49)
	at org.apache.lucene.util.AbstractBeforeAfterRule$1.evaluate(AbstractBeforeAfterRule.java:45)
	at org.apache.lucene.util.TestRuleThreadAndTestName$1.evaluate(TestRuleThreadAndTestName.java:48)
	at org.apache.lucene.util.TestRuleIgnoreAfterMaxFailures$1.evaluate(TestRuleIgnoreAfterMaxFailures.java:64)
	at org.apache.lucene.util.TestRuleMarkFailure$1.evaluate(TestRuleMarkFailure.java:47)
	at com.carrotsearch.randomizedtesting.rules.StatementAdapter.evaluate(StatementAdapter.java:36)
	at com.carrotsearch.randomizedtesting.ThreadLeakControl$StatementRunner.run(ThreadLeakControl.java:368)
	at com.carrotsearch.randomizedtesting.ThreadLeakControl.forkTimeoutingTask(ThreadLeakControl.java:817)
	at com.carrotsearch.randomizedtesting.ThreadLeakControl$3.evaluate(ThreadLeakControl.java:468)
	at com.carrotsearch.randomizedtesting.RandomizedRunner.runSingleTest(RandomizedRunner.java:943)
	at com.carrotsearch.randomizedtesting.RandomizedRunner$5.evaluate(RandomizedRunner.java:829)
	at com.carrotsearch.randomizedtesting.RandomizedRunner$6.evaluate(RandomizedRunner.java:879)
	at com.carrotsearch.randomizedtesting.RandomizedRunner$7.evaluate(RandomizedRunner.java:890)
	at com.carrotsearch.randomizedtesting.rules.StatementAdapter.evaluate(StatementAdapter.java:36)
	at com.carrotsearch.randomizedtesting.rules.SystemPropertiesRestoreRule$1.evaluate(SystemPropertiesRestoreRule.java:57)
	at org.apache.lucene.util.AbstractBeforeAfterRule$1.evaluate(AbstractBeforeAfterRule.java:45)
	at com.carrotsearch.randomizedtesting.rules.StatementAdapter.evaluate(StatementAdapter.java:36)
	at org.apache.lucene.util.TestRuleStoreClassName$1.evaluate(TestRuleStoreClassName.java:41)
	at com.carrotsearch.randomizedtesting.rules.NoShadowingOrOverridesOnMethodsRule$1.evaluate(NoShadowingOrOverridesOnMethodsRule.java:40)
	at com.carrotsearch.randomizedtesting.rules.NoShadowingOrOverridesOnMethodsRule$1.evaluate(NoShadowingOrOverridesOnMethodsRule.java:40)
	at com.carrotsearch.randomizedtesting.rules.StatementAdapter.evaluate(StatementAdapter.java:36)
	at com.carrotsearch.randomizedtesting.rules.StatementAdapter.evaluate(StatementAdapter.java:36)
	at com.carrotsearch.randomizedtesting.rules.StatementAdapter.evaluate(StatementAdapter.java:36)
	at org.apache.lucene.util.TestRuleAssertionsRequired$1.evaluate(TestRuleAssertionsRequired.java:53)
	at org.apache.lucene.util.TestRuleMarkFailure$1.evaluate(TestRuleMarkFailure.java:47)
	at org.apache.lucene.util.TestRuleIgnoreAfterMaxFailures$1.evaluate(TestRuleIgnoreAfterMaxFailures.java:64)
	at org.apache.lucene.util.TestRuleIgnoreTestSuites$1.evaluate(TestRuleIgnoreTestSuites.java:54)
	at com.carrotsearch.randomizedtesting.rules.StatementAdapter.evaluate(StatementAdapter.java:36)
	at com.carrotsearch.randomizedtesting.ThreadLeakControl$StatementRunner.run(ThreadLeakControl.java:368)
	at java.lang.Thread.run(Thread.java:748)


FAILED:  org.apache.solr.core.TestBadConfig.testUpdateLogButNoVersionField

Error Message:
Did not encounter any exception from: solrconfig.xml using schema12.xml

Stack Trace:
java.lang.AssertionError: Did not encounter any exception from: solrconfig.xml using schema12.xml
	at __randomizedtesting.SeedInfo.seed([393134CE924FE1A4:1D71C71DA63BD904]:0)
	at org.junit.Assert.fail(Assert.java:93)
	at org.apache.solr.core.AbstractBadConfigTestBase.assertConfigs(AbstractBadConfigTestBase.java:73)
	at org.apache.solr.core.AbstractBadConfigTestBase.assertConfigs(AbstractBadConfigTestBase.java:35)
	at org.apache.solr.core.TestBadConfig.testUpdateLogButNoVersionField(TestBadConfig.java:50)
	at sun.reflect.NativeMethodAccessorImpl.invoke0(Native Method)
	at sun.reflect.NativeMethodAccessorImpl.invoke(NativeMethodAccessorImpl.java:62)
	at sun.reflect.DelegatingMethodAccessorImpl.invoke(DelegatingMethodAccessorImpl.java:43)
	at java.lang.reflect.Method.invoke(Method.java:498)
	at com.carrotsearch.randomizedtesting.RandomizedRunner.invoke(RandomizedRunner.java:1737)
	at com.carrotsearch.randomizedtesting.RandomizedRunner$8.evaluate(RandomizedRunner.java:934)
	at com.carrotsearch.randomizedtesting.RandomizedRunner$9.evaluate(RandomizedRunner.java:970)
	at com.carrotsearch.randomizedtesting.RandomizedRunner$10.evaluate(RandomizedRunner.java:984)
	at com.carrotsearch.randomizedtesting.rules.SystemPropertiesRestoreRule$1.evaluate(SystemPropertiesRestoreRule.java:57)
	at org.apache.lucene.util.TestRuleSetupTeardownChained$1.evaluate(TestRuleSetupTeardownChained.java:49)
	at org.apache.lucene.util.AbstractBeforeAfterRule$1.evaluate(AbstractBeforeAfterRule.java:45)
	at org.apache.lucene.util.TestRuleThreadAndTestName$1.evaluate(TestRuleThreadAndTestName.java:48)
	at org.apache.lucene.util.TestRuleIgnoreAfterMaxFailures$1.evaluate(TestRuleIgnoreAfterMaxFailures.java:64)
	at org.apache.lucene.util.TestRuleMarkFailure$1.evaluate(TestRuleMarkFailure.java:47)
	at com.carrotsearch.randomizedtesting.rules.StatementAdapter.evaluate(StatementAdapter.java:36)
	at com.carrotsearch.randomizedtesting.ThreadLeakControl$StatementRunner.run(ThreadLeakControl.java:368)
	at com.carrotsearch.randomizedtesting.ThreadLeakControl.forkTimeoutingTask(ThreadLeakControl.java:817)
	at com.carrotsearch.randomizedtesting.ThreadLeakControl$3.evaluate(ThreadLeakControl.java:468)
	at com.carrotsearch.randomizedtesting.RandomizedRunner.runSingleTest(RandomizedRunner.java:943)
	at com.carrotsearch.randomizedtesting.RandomizedRunner$5.evaluate(RandomizedRunner.java:829)
	at com.carrotsearch.randomizedtesting.RandomizedRunner$6.evaluate(RandomizedRunner.java:879)
	at com.carrotsearch.randomizedtesting.RandomizedRunner$7.evaluate(RandomizedRunner.java:890)
	at com.carrotsearch.randomizedtesting.rules.StatementAdapter.evaluate(StatementAdapter.java:36)
	at com.carrotsearch.randomizedtesting.rules.SystemPropertiesRestoreRule$1.evaluate(SystemPropertiesRestoreRule.java:57)
	at org.apache.lucene.util.AbstractBeforeAfterRule$1.evaluate(AbstractBeforeAfterRule.java:45)
	at com.carrotsearch.randomizedtesting.rules.StatementAdapter.evaluate(StatementAdapter.java:36)
	at org.apache.lucene.util.TestRuleStoreClassName$1.evaluate(TestRuleStoreClassName.java:41)
	at com.carrotsearch.randomizedtesting.rules.NoShadowingOrOverridesOnMethodsRule$1.evaluate(NoShadowingOrOverridesOnMethodsRule.java:40)
	at com.carrotsearch.randomizedtesting.rules.NoShadowingOrOverridesOnMethodsRule$1.evaluate(NoShadowingOrOverridesOnMethodsRule.java:40)
	at com.carrotsearch.randomizedtesting.rules.StatementAdapter.evaluate(StatementAdapter.java:36)
	at com.carrotsearch.randomizedtesting.rules.StatementAdapter.evaluate(StatementAdapter.java:36)
	at com.carrotsearch.randomizedtesting.rules.StatementAdapter.evaluate(StatementAdapter.java:36)
	at org.apache.lucene.util.TestRuleAssertionsRequired$1.evaluate(TestRuleAssertionsRequired.java:53)
	at org.apache.lucene.util.TestRuleMarkFailure$1.evaluate(TestRuleMarkFailure.java:47)
	at org.apache.lucene.util.TestRuleIgnoreAfterMaxFailures$1.evaluate(TestRuleIgnoreAfterMaxFailures.java:64)
	at org.apache.lucene.util.TestRuleIgnoreTestSuites$1.evaluate(TestRuleIgnoreTestSuites.java:54)
	at com.carrotsearch.randomizedtesting.rules.StatementAdapter.evaluate(StatementAdapter.java:36)
	at com.carrotsearch.randomizedtesting.ThreadLeakControl$StatementRunner.run(ThreadLeakControl.java:368)
	at java.lang.Thread.run(Thread.java:748)


FAILED:  org.apache.solr.core.TestBadConfig.testBogusScriptEngine

Error Message:
Did not encounter any exception from: bad-solrconfig-bogus-scriptengine-name.xml using schema.xml

Stack Trace:
java.lang.AssertionError: Did not encounter any exception from: bad-solrconfig-bogus-scriptengine-name.xml using schema.xml
	at __randomizedtesting.SeedInfo.seed([393134CE924FE1A4:88CCA362B9842CF2]:0)
	at org.junit.Assert.fail(Assert.java:93)
	at org.apache.solr.core.AbstractBadConfigTestBase.assertConfigs(AbstractBadConfigTestBase.java:73)
	at org.apache.solr.core.AbstractBadConfigTestBase.assertConfigs(AbstractBadConfigTestBase.java:35)
	at org.apache.solr.core.TestBadConfig.testBogusScriptEngine(TestBadConfig.java:60)
	at sun.reflect.NativeMethodAccessorImpl.invoke0(Native Method)
	at sun.reflect.NativeMethodAccessorImpl.invoke(NativeMethodAccessorImpl.java:62)
	at sun.reflect.DelegatingMethodAccessorImpl.invoke(DelegatingMethodAccessorImpl.java:43)
	at java.lang.reflect.Method.invoke(Method.java:498)
	at com.carrotsearch.randomizedtesting.RandomizedRunner.invoke(RandomizedRunner.java:1737)
	at com.carrotsearch.randomizedtesting.RandomizedRunner$8.evaluate(RandomizedRunner.java:934)
	at com.carrotsearch.randomizedtesting.RandomizedRunner$9.evaluate(RandomizedRunner.java:970)
	at com.carrotsearch.randomizedtesting.RandomizedRunner$10.evaluate(RandomizedRunner.java:984)
	at com.carrotsearch.randomizedtesting.rules.SystemPropertiesRestoreRule$1.evaluate(SystemPropertiesRestoreRule.java:57)
	at org.apache.lucene.util.TestRuleSetupTeardownChained$1.evaluate(TestRuleSetupTeardownChained.java:49)
	at org.apache.lucene.util.AbstractBeforeAfterRule$1.evaluate(AbstractBeforeAfterRule.java:45)
	at org.apache.lucene.util.TestRuleThreadAndTestName$1.evaluate(TestRuleThreadAndTestName.java:48)
	at org.apache.lucene.util.TestRuleIgnoreAfterMaxFailures$1.evaluate(TestRuleIgnoreAfterMaxFailures.java:64)
	at org.apache.lucene.util.TestRuleMarkFailure$1.evaluate(TestRuleMarkFailure.java:47)
	at com.carrotsearch.randomizedtesting.rules.StatementAdapter.evaluate(StatementAdapter.java:36)
	at com.carrotsearch.randomizedtesting.ThreadLeakControl$StatementRunner.run(ThreadLeakControl.java:368)
	at com.carrotsearch.randomizedtesting.ThreadLeakControl.forkTimeoutingTask(ThreadLeakControl.java:817)
	at com.carrotsearch.randomizedtesting.ThreadLeakControl$3.evaluate(ThreadLeakControl.java:468)
	at com.carrotsearch.randomizedtesting.RandomizedRunner.runSingleTest(RandomizedRunner.java:943)
	at com.carrotsearch.randomizedtesting.RandomizedRunner$5.evaluate(RandomizedRunner.java:829)
	at com.carrotsearch.randomizedtesting.RandomizedRunner$6.evaluate(RandomizedRunner.java:879)
	at com.carrotsearch.randomizedtesting.RandomizedRunner$7.evaluate(RandomizedRunner.java:890)
	at com.carrotsearch.randomizedtesting.rules.StatementAdapter.evaluate(StatementAdapter.java:36)
	at com.carrotsearch.randomizedtesting.rules.SystemPropertiesRestoreRule$1.evaluate(SystemPropertiesRestoreRule.java:57)
	at org.apache.lucene.util.AbstractBeforeAfterRule$1.evaluate(AbstractBeforeAfterRule.java:45)
	at com.carrotsearch.randomizedtesting.rules.StatementAdapter.evaluate(StatementAdapter.java:36)
	at org.apache.lucene.util.TestRuleStoreClassName$1.evaluate(TestRuleStoreClassName.java:41)
	at com.carrotsearch.randomizedtesting.rules.NoShadowingOrOverridesOnMethodsRule$1.evaluate(NoShadowingOrOverridesOnMethodsRule.java:40)
	at com.carrotsearch.randomizedtesting.rules.NoShadowingOrOverridesOnMethodsRule$1.evaluate(NoShadowingOrOverridesOnMethodsRule.java:40)
	at com.carrotsearch.randomizedtesting.rules.StatementAdapter.evaluate(StatementAdapter.java:36)
	at com.carrotsearch.randomizedtesting.rules.StatementAdapter.evaluate(StatementAdapter.java:36)
	at com.carrotsearch.randomizedtesting.rules.StatementAdapter.evaluate(StatementAdapter.java:36)
	at org.apache.lucene.util.TestRuleAssertionsRequired$1.evaluate(TestRuleAssertionsRequired.java:53)
	at org.apache.lucene.util.TestRuleMarkFailure$1.evaluate(TestRuleMarkFailure.java:47)
	at org.apache.lucene.util.TestRuleIgnoreAfterMaxFailures$1.evaluate(TestRuleIgnoreAfterMaxFailures.java:64)
	at org.apache.lucene.util.TestRuleIgnoreTestSuites$1.evaluate(TestRuleIgnoreTestSuites.java:54)
	at com.carrotsearch.randomizedtesting.rules.StatementAdapter.evaluate(StatementAdapter.java:36)
	at com.carrotsearch.randomizedtesting.ThreadLeakControl$StatementRunner.run(ThreadLeakControl.java:368)
	at java.lang.Thread.run(Thread.java:748)


FAILED:  org.apache.solr.core.TestBadConfig.testTolerantUpdateProcessorNoUniqueKey

Error Message:
Did not encounter any exception from: solrconfig-tolerant-update-minimal.xml using schema-minimal.xml

Stack Trace:
java.lang.AssertionError: Did not encounter any exception from: solrconfig-tolerant-update-minimal.xml using schema-minimal.xml
	at __randomizedtesting.SeedInfo.seed([393134CE924FE1A4:BF4CC0457D2120D2]:0)
	at org.junit.Assert.fail(Assert.java:93)
	at org.apache.solr.core.AbstractBadConfigTestBase.assertConfigs(AbstractBadConfigTestBase.java:73)
	at org.apache.solr.core.AbstractBadConfigTestBase.assertConfigs(AbstractBadConfigTestBase.java:35)
	at org.apache.solr.core.TestBadConfig.testTolerantUpdateProcessorNoUniqueKey(TestBadConfig.java:99)
	at sun.reflect.NativeMethodAccessorImpl.invoke0(Native Method)
	at sun.reflect.NativeMethodAccessorImpl.invoke(NativeMethodAccessorImpl.java:62)
	at sun.reflect.DelegatingMethodAccessorImpl.invoke(DelegatingMethodAccessorImpl.java:43)
	at java.lang.reflect.Method.invoke(Method.java:498)
	at com.carrotsearch.randomizedtesting.RandomizedRunner.invoke(RandomizedRunner.java:1737)
	at com.carrotsearch.randomizedtesting.RandomizedRunner$8.evaluate(RandomizedRunner.java:934)
	at com.carrotsearch.randomizedtesting.RandomizedRunner$9.evaluate(RandomizedRunner.java:970)
	at com.carrotsearch.randomizedtesting.RandomizedRunner$10.evaluate(RandomizedRunner.java:984)
	at com.carrotsearch.randomizedtesting.rules.SystemPropertiesRestoreRule$1.evaluate(SystemPropertiesRestoreRule.java:57)
	at org.apache.lucene.util.TestRuleSetupTeardownChained$1.evaluate(TestRuleSetupTeardownChained.java:49)
	at org.apache.lucene.util.AbstractBeforeAfterRule$1.evaluate(AbstractBeforeAfterRule.java:45)
	at org.apache.lucene.util.TestRuleThreadAndTestName$1.evaluate(TestRuleThreadAndTestName.java:48)
	at org.apache.lucene.util.TestRuleIgnoreAfterMaxFailures$1.evaluate(TestRuleIgnoreAfterMaxFailures.java:64)
	at org.apache.lucene.util.TestRuleMarkFailure$1.evaluate(TestRuleMarkFailure.java:47)
	at com.carrotsearch.randomizedtesting.rules.StatementAdapter.evaluate(StatementAdapter.java:36)
	at com.carrotsearch.randomizedtesting.ThreadLeakControl$StatementRunner.run(ThreadLeakControl.java:368)
	at com.carrotsearch.randomizedtesting.ThreadLeakControl.forkTimeoutingTask(ThreadLeakControl.java:817)
	at com.carrotsearch.randomizedtesting.ThreadLeakControl$3.evaluate(ThreadLeakControl.java:468)
	at com.carrotsearch.randomizedtesting.RandomizedRunner.runSingleTest(RandomizedRunner.java:943)
	at com.carrotsearch.randomizedtesting.RandomizedRunner$5.evaluate(RandomizedRunner.java:829)
	at com.carrotsearch.randomizedtesting.RandomizedRunner$6.evaluate(RandomizedRunner.java:879)
	at com.carrotsearch.randomizedtesting.RandomizedRunner$7.evaluate(RandomizedRunner.java:890)
	at com.carrotsearch.randomizedtesting.rules.StatementAdapter.evaluate(StatementAdapter.java:36)
	at com.carrotsearch.randomizedtesting.rules.SystemPropertiesRestoreRule$1.evaluate(SystemPropertiesRestoreRule.java:57)
	at org.apache.lucene.util.AbstractBeforeAfterRule$1.evaluate(AbstractBeforeAfterRule.java:45)
	at com.carrotsearch.randomizedtesting.rules.StatementAdapter.evaluate(StatementAdapter.java:36)
	at org.apache.lucene.util.TestRuleStoreClassName$1.evaluate(TestRuleStoreClassName.java:41)
	at com.carrotsearch.randomizedtesting.rules.NoShadowingOrOverridesOnMethodsRule$1.evaluate(NoShadowingOrOverridesOnMethodsRule.java:40)
	at com.carrotsearch.randomizedtesting.rules.NoShadowingOrOverridesOnMethodsRule$1.evaluate(NoShadowingOrOverridesOnMethodsRule.java:40)
	at com.carrotsearch.randomizedtesting.rules.StatementAdapter.evaluate(StatementAdapter.java:36)
	at com.carrotsearch.randomizedtesting.rules.StatementAdapter.evaluate(StatementAdapter.java:36)
	at com.carrotsearch.randomizedtesting.rules.StatementAdapter.evaluate(StatementAdapter.java:36)
	at org.apache.lucene.util.TestRuleAssertionsRequired$1.evaluate(TestRuleAssertionsRequired.java:53)
	at org.apache.lucene.util.TestRuleMarkFailure$1.evaluate(TestRuleMarkFailure.java:47)
	at org.apache.lucene.util.TestRuleIgnoreAfterMaxFailures$1.evaluate(TestRuleIgnoreAfterMaxFailures.java:64)
	at org.apache.lucene.util.TestRuleIgnoreTestSuites$1.evaluate(TestRuleIgnoreTestSuites.java:54)
	at com.carrotsearch.randomizedtesting.rules.StatementAdapter.evaluate(StatementAdapter.java:36)
	at com.carrotsearch.randomizedtesting.ThreadLeakControl$StatementRunner.run(ThreadLeakControl.java:368)
	at java.lang.Thread.run(Thread.java:748)


FAILED:  org.apache.solr.core.TestBadConfig.testInvalidScriptFile

Error Message:
Did not encounter any exception from: bad-solrconfig-invalid-scriptfile.xml using schema.xml

Stack Trace:
java.lang.AssertionError: Did not encounter any exception from: bad-solrconfig-invalid-scriptfile.xml using schema.xml
	at __randomizedtesting.SeedInfo.seed([393134CE924FE1A4:2720A37B0A802F16]:0)
	at org.junit.Assert.fail(Assert.java:93)
	at org.apache.solr.core.AbstractBadConfigTestBase.assertConfigs(AbstractBadConfigTestBase.java:73)
	at org.apache.solr.core.AbstractBadConfigTestBase.assertConfigs(AbstractBadConfigTestBase.java:35)
	at org.apache.solr.core.TestBadConfig.testInvalidScriptFile(TestBadConfig.java:74)
	at sun.reflect.NativeMethodAccessorImpl.invoke0(Native Method)
	at sun.reflect.NativeMethodAccessorImpl.invoke(NativeMethodAccessorImpl.java:62)
	at sun.reflect.DelegatingMethodAccessorImpl.invoke(DelegatingMethodAccessorImpl.java:43)
	at java.lang.reflect.Method.invoke(Method.java:498)
	at com.carrotsearch.randomizedtesting.RandomizedRunner.invoke(RandomizedRunner.java:1737)
	at com.carrotsearch.randomizedtesting.RandomizedRunner$8.evaluate(RandomizedRunner.java:934)
	at com.carrotsearch.randomizedtesting.RandomizedRunner$9.evaluate(RandomizedRunner.java:970)
	at com.carrotsearch.randomizedtesting.RandomizedRunner$10.evaluate(RandomizedRunner.java:984)
	at com.carrotsearch.randomizedtesting.rules.SystemPropertiesRestoreRule$1.evaluate(SystemPropertiesRestoreRule.java:57)
	at org.apache.lucene.util.TestRuleSetupTeardownChained$1.evaluate(TestRuleSetupTeardownChained.java:49)
	at org.apache.lucene.util.AbstractBeforeAfterRule$1.evaluate(AbstractBeforeAfterRule.java:45)
	at org.apache.lucene.util.TestRuleThreadAndTestName$1.evaluate(TestRuleThreadAndTestName.java:48)
	at org.apache.lucene.util.TestRuleIgnoreAfterMaxFailures$1.evaluate(TestRuleIgnoreAfterMaxFailures.java:64)
	at org.apache.lucene.util.TestRuleMarkFailure$1.evaluate(TestRuleMarkFailure.java:47)
	at com.carrotsearch.randomizedtesting.rules.StatementAdapter.evaluate(StatementAdapter.java:36)
	at com.carrotsearch.randomizedtesting.ThreadLeakControl$StatementRunner.run(ThreadLeakControl.java:368)
	at com.carrotsearch.randomizedtesting.ThreadLeakControl.forkTimeoutingTask(ThreadLeakControl.java:817)
	at com.carrotsearch.randomizedtesting.ThreadLeakControl$3.evaluate(ThreadLeakControl.java:468)
	at com.carrotsearch.randomizedtesting.RandomizedRunner.runSingleTest(RandomizedRunner.java:943)
	at com.carrotsearch.randomizedtesting.RandomizedRunner$5.evaluate(RandomizedRunner.java:829)
	at com.carrotsearch.randomizedtesting.RandomizedRunner$6.evaluate(RandomizedRunner.java:879)
	at com.carrotsearch.randomizedtesting.RandomizedRunner$7.evaluate(RandomizedRunner.java:890)
	at com.carrotsearch.randomizedtesting.rules.StatementAdapter.evaluate(StatementAdapter.java:36)
	at com.carrotsearch.randomizedtesting.rules.SystemPropertiesRestoreRule$1.evaluate(SystemPropertiesRestoreRule.java:57)
	at org.apache.lucene.util.AbstractBeforeAfterRule$1.evaluate(AbstractBeforeAfterRule.java:45)
	at com.carrotsearch.randomizedtesting.rules.StatementAdapter.evaluate(StatementAdapter.java:36)
	at org.apache.lucene.util.TestRuleStoreClassName$1.evaluate(TestRuleStoreClassName.java:41)
	at com.carrotsearch.randomizedtesting.rules.NoShadowingOrOverridesOnMethodsRule$1.evaluate(NoShadowingOrOverridesOnMethodsRule.java:40)
	at com.carrotsearch.randomizedtesting.rules.NoShadowingOrOverridesOnMethodsRule$1.evaluate(NoShadowingOrOverridesOnMethodsRule.java:40)
	at com.carrotsearch.randomizedtesting.rules.StatementAdapter.evaluate(StatementAdapter.java:36)
	at com.carrotsearch.randomizedtesting.rules.StatementAdapter.evaluate(StatementAdapter.java:36)
	at com.carrotsearch.randomizedtesting.rules.StatementAdapter.evaluate(StatementAdapter.java:36)
	at org.apache.lucene.util.TestRuleAssertionsRequired$1.evaluate(TestRuleAssertionsRequired.java:53)
	at org.apache.lucene.util.TestRuleMarkFailure$1.evaluate(TestRuleMarkFailure.java:47)
	at org.apache.lucene.util.TestRuleIgnoreAfterMaxFailures$1.evaluate(TestRuleIgnoreAfterMaxFailures.java:64)
	at org.apache.lucene.util.TestRuleIgnoreTestSuites$1.evaluate(TestRuleIgnoreTestSuites.java:54)
	at com.carrotsearch.randomizedtesting.rules.StatementAdapter.evaluate(StatementAdapter.java:36)
	at com.carrotsearch.randomizedtesting.ThreadLeakControl$StatementRunner.run(ThreadLeakControl.java:368)
	at java.lang.Thread.run(Thread.java:748)


FAILED:  org.apache.solr.core.TestBadConfig.testBogusMergePolicy

Error Message:
Did not encounter any exception from: bad-mpf-solrconfig.xml using schema-minimal.xml

Stack Trace:
java.lang.AssertionError: Did not encounter any exception from: bad-mpf-solrconfig.xml using schema-minimal.xml
	at __randomizedtesting.SeedInfo.seed([393134CE924FE1A4:D5466A3B388B7330]:0)
	at org.junit.Assert.fail(Assert.java:93)
	at org.apache.solr.core.AbstractBadConfigTestBase.assertConfigs(AbstractBadConfigTestBase.java:73)
	at org.apache.solr.core.AbstractBadConfigTestBase.assertConfigs(AbstractBadConfigTestBase.java:35)
	at org.apache.solr.core.TestBadConfig.testBogusMergePolicy(TestBadConfig.java:79)
	at sun.reflect.NativeMethodAccessorImpl.invoke0(Native Method)
	at sun.reflect.NativeMethodAccessorImpl.invoke(NativeMethodAccessorImpl.java:62)
	at sun.reflect.DelegatingMethodAccessorImpl.invoke(DelegatingMethodAccessorImpl.java:43)
	at java.lang.reflect.Method.invoke(Method.java:498)
	at com.carrotsearch.randomizedtesting.RandomizedRunner.invoke(RandomizedRunner.java:1737)
	at com.carrotsearch.randomizedtesting.RandomizedRunner$8.evaluate(RandomizedRunner.java:934)
	at com.carrotsearch.randomizedtesting.RandomizedRunner$9.evaluate(RandomizedRunner.java:970)
	at com.carrotsearch.randomizedtesting.RandomizedRunner$10.evaluate(RandomizedRunner.java:984)
	at com.carrotsearch.randomizedtesting.rules.SystemPropertiesRestoreRule$1.evaluate(SystemPropertiesRestoreRule.java:57)
	at org.apache.lucene.util.TestRuleSetupTeardownChained$1.evaluate(TestRuleSetupTeardownChained.java:49)
	at org.apache.lucene.util.AbstractBeforeAfterRule$1.evaluate(AbstractBeforeAfterRule.java:45)
	at org.apache.lucene.util.TestRuleThreadAndTestName$1.evaluate(TestRuleThreadAndTestName.java:48)
	at org.apache.lucene.util.TestRuleIgnoreAfterMaxFailures$1.evaluate(TestRuleIgnoreAfterMaxFailures.java:64)
	at org.apache.lucene.util.TestRuleMarkFailure$1.evaluate(TestRuleMarkFailure.java:47)
	at com.carrotsearch.randomizedtesting.rules.StatementAdapter.evaluate(StatementAdapter.java:36)
	at com.carrotsearch.randomizedtesting.ThreadLeakControl$StatementRunner.run(ThreadLeakControl.java:368)
	at com.carrotsearch.randomizedtesting.ThreadLeakControl.forkTimeoutingTask(ThreadLeakControl.java:817)
	at com.carrotsearch.randomizedtesting.ThreadLeakControl$3.evaluate(ThreadLeakControl.java:468)
	at com.carrotsearch.randomizedtesting.RandomizedRunner.runSingleTest(RandomizedRunner.java:943)
	at com.carrotsearch.randomizedtesting.RandomizedRunner$5.evaluate(RandomizedRunner.java:829)
	at com.carrotsearch.randomizedtesting.RandomizedRunner$6.evaluate(RandomizedRunner.java:879)
	at com.carrotsearch.randomizedtesting.RandomizedRunner$7.evaluate(RandomizedRunner.java:890)
	at com.carrotsearch.randomizedtesting.rules.StatementAdapter.evaluate(StatementAdapter.java:36)
	at com.carrotsearch.randomizedtesting.rules.SystemPropertiesRestoreRule$1.evaluate(SystemPropertiesRestoreRule.java:57)
	at org.apache.lucene.util.AbstractBeforeAfterRule$1.evaluate(AbstractBeforeAfterRule.java:45)
	at com.carrotsearch.randomizedtesting.rules.StatementAdapter.evaluate(StatementAdapter.java:36)
	at org.apache.lucene.util.TestRuleStoreClassName$1.evaluate(TestRuleStoreClassName.java:41)
	at com.carrotsearch.randomizedtesting.rules.NoShadowingOrOverridesOnMethodsRule$1.evaluate(NoShadowingOrOverridesOnMethodsRule.java:40)
	at com.carrotsearch.randomizedtesting.rules.NoShadowingOrOverridesOnMethodsRule$1.evaluate(NoShadowingOrOverridesOnMethodsRule.java:40)
	at com.carrotsearch.randomizedtesting.rules.StatementAdapter.evaluate(StatementAdapter.java:36)
	at com.carrotsearch.randomizedtesting.rules.StatementAdapter.evaluate(StatementAdapter.java:36)
	at com.carrotsearch.randomizedtesting.rules.StatementAdapter.evaluate(StatementAdapter.java:36)
	at org.apache.lucene.util.TestRuleAssertionsRequired$1.evaluate(TestRuleAssertionsRequired.java:53)
	at org.apache.lucene.util.TestRuleMarkFailure$1.evaluate(TestRuleMarkFailure.java:47)
	at org.apache.lucene.util.TestRuleIgnoreAfterMaxFailures$1.evaluate(TestRuleIgnoreAfterMaxFailures.java:64)
	at org.apache.lucene.util.TestRuleIgnoreTestSuites$1.evaluate(TestRuleIgnoreTestSuites.java:54)
	at com.carrotsearch.randomizedtesting.rules.StatementAdapter.evaluate(StatementAdapter.java:36)
	at com.carrotsearch.randomizedtesting.ThreadLeakControl$StatementRunner.run(ThreadLeakControl.java:368)
	at java.lang.Thread.run(Thread.java:748)


FAILED:  org.apache.solr.core.TestBadConfig.testMissingScriptFile

Error Message:
Did not encounter any exception from: bad-solrconfig-missing-scriptfile.xml using schema.xml

Stack Trace:
java.lang.AssertionError: Did not encounter any exception from: bad-solrconfig-missing-scriptfile.xml using schema.xml
	at __randomizedtesting.SeedInfo.seed([393134CE924FE1A4:9037B0F7D81C1453]:0)
	at org.junit.Assert.fail(Assert.java:93)
	at org.apache.solr.core.AbstractBadConfigTestBase.assertConfigs(AbstractBadConfigTestBase.java:73)
	at org.apache.solr.core.AbstractBadConfigTestBase.assertConfigs(AbstractBadConfigTestBase.java:35)
	at org.apache.solr.core.TestBadConfig.testMissingScriptFile(TestBadConfig.java:67)
	at sun.reflect.NativeMethodAccessorImpl.invoke0(Native Method)
	at sun.reflect.NativeMethodAccessorImpl.invoke(NativeMethodAccessorImpl.java:62)
	at sun.reflect.DelegatingMethodAccessorImpl.invoke(DelegatingMethodAccessorImpl.java:43)
	at java.lang.reflect.Method.invoke(Method.java:498)
	at com.carrotsearch.randomizedtesting.RandomizedRunner.invoke(RandomizedRunner.java:1737)
	at com.carrotsearch.randomizedtesting.RandomizedRunner$8.evaluate(RandomizedRunner.java:934)
	at com.carrotsearch.randomizedtesting.RandomizedRunner$9.evaluate(RandomizedRunner.java:970)
	at com.carrotsearch.randomizedtesting.RandomizedRunner$10.evaluate(RandomizedRunner.java:984)
	at com.carrotsearch.randomizedtesting.rules.SystemPropertiesRestoreRule$1.evaluate(SystemPropertiesRestoreRule.java:57)
	at org.apache.lucene.util.TestRuleSetupTeardownChained$1.evaluate(TestRuleSetupTeardownChained.java:49)
	at org.apache.lucene.util.AbstractBeforeAfterRule$1.evaluate(AbstractBeforeAfterRule.java:45)
	at org.apache.lucene.util.TestRuleThreadAndTestName$1.evaluate(TestRuleThreadAndTestName.java:48)
	at org.apache.lucene.util.TestRuleIgnoreAfterMaxFailures$1.evaluate(TestRuleIgnoreAfterMaxFailures.java:64)
	at org.apache.lucene.util.TestRuleMarkFailure$1.evaluate(TestRuleMarkFailure.java:47)
	at com.carrotsearch.randomizedtesting.rules.StatementAdapter.evaluate(StatementAdapter.java:36)
	at com.carrotsearch.randomizedtesting.ThreadLeakControl$StatementRunner.run(ThreadLeakControl.java:368)
	at com.carrotsearch.randomizedtesting.ThreadLeakControl.forkTimeoutingTask(ThreadLeakControl.java:817)
	at com.carrotsearch.randomizedtesting.ThreadLeakControl$3.evaluate(ThreadLeakControl.java:468)
	at com.carrotsearch.randomizedtesting.RandomizedRunner.runSingleTest(RandomizedRunner.java:943)
	at com.carrotsearch.randomizedtesting.RandomizedRunner$5.evaluate(RandomizedRunner.java:829)
	at com.carrotsearch.randomizedtesting.RandomizedRunner$6.evaluate(RandomizedRunner.java:879)
	at com.carrotsearch.randomizedtesting.RandomizedRunner$7.evaluate(RandomizedRunner.java:890)
	at com.carrotsearch.randomizedtesting.rules.StatementAdapter.evaluate(StatementAdapter.java:36)
	at com.carrotsearch.randomizedtesting.rules.SystemPropertiesRestoreRule$1.evaluate(SystemPropertiesRestoreRule.java:57)
	at org.apache.lucene.util.AbstractBeforeAfterRule$1.evaluate(AbstractBeforeAfterRule.java:45)
	at com.carrotsearch.randomizedtesting.rules.StatementAdapter.evaluate(StatementAdapter.java:36)
	at org.apache.lucene.util.TestRuleStoreClassName$1.evaluate(TestRuleStoreClassName.java:41)
	at com.carrotsearch.randomizedtesting.rules.NoShadowingOrOverridesOnMethodsRule$1.evaluate(NoShadowingOrOverridesOnMethodsRule.java:40)
	at com.carrotsearch.randomizedtesting.rules.NoShadowingOrOverridesOnMethodsRule$1.evaluate(NoShadowingOrOverridesOnMethodsRule.java:40)
	at com.carrotsearch.randomizedtesting.rules.StatementAdapter.evaluate(StatementAdapter.java:36)
	at com.carrotsearch.randomizedtesting.rules.StatementAdapter.evaluate(StatementAdapter.java:36)
	at com.carrotsearch.randomizedtesting.rules.StatementAdapter.evaluate(StatementAdapter.java:36)
	at org.apache.lucene.util.TestRuleAssertionsRequired$1.evaluate(TestRuleAssertionsRequired.java:53)
	at org.apache.lucene.util.TestRuleMarkFailure$1.evaluate(TestRuleMarkFailure.java:47)
	at org.apache.lucene.util.TestRuleIgnoreAfterMaxFailures$1.evaluate(TestRuleIgnoreAfterMaxFailures.java:64)
	at org.apache.lucene.util.TestRuleIgnoreTestSuites$1.evaluate(TestRuleIgnoreTestSuites.java:54)
	at com.carrotsearch.randomizedtesting.rules.StatementAdapter.evaluate(StatementAdapter.java:36)
	at com.carrotsearch.randomizedtesting.ThreadLeakControl$StatementRunner.run(ThreadLeakControl.java:368)
	at java.lang.Thread.run(Thread.java:748)


FAILED:  org.apache.solr.core.TestCoreContainer.testCoreInitFailuresOnReload

Error Message:
wrong number of core failures expected:<1> but was:<0>

Stack Trace:
java.lang.AssertionError: wrong number of core failures expected:<1> but was:<0>
	at __randomizedtesting.SeedInfo.seed([393134CE924FE1A4:35474967DDE505FB]:0)
	at org.junit.Assert.fail(Assert.java:93)
	at org.junit.Assert.failNotEquals(Assert.java:647)
	at org.junit.Assert.assertEquals(Assert.java:128)
	at org.junit.Assert.assertEquals(Assert.java:472)
	at org.apache.solr.core.TestCoreContainer.testCoreInitFailuresOnReload(TestCoreContainer.java:488)
	at sun.reflect.NativeMethodAccessorImpl.invoke0(Native Method)
	at sun.reflect.NativeMethodAccessorImpl.invoke(NativeMethodAccessorImpl.java:62)
	at sun.reflect.DelegatingMethodAccessorImpl.invoke(DelegatingMethodAccessorImpl.java:43)
	at java.lang.reflect.Method.invoke(Method.java:498)
	at com.carrotsearch.randomizedtesting.RandomizedRunner.invoke(RandomizedRunner.java:1737)
	at com.carrotsearch.randomizedtesting.RandomizedRunner$8.evaluate(RandomizedRunner.java:934)
	at com.carrotsearch.randomizedtesting.RandomizedRunner$9.evaluate(RandomizedRunner.java:970)
	at com.carrotsearch.randomizedtesting.RandomizedRunner$10.evaluate(RandomizedRunner.java:984)
	at com.carrotsearch.randomizedtesting.rules.SystemPropertiesRestoreRule$1.evaluate(SystemPropertiesRestoreRule.java:57)
	at org.apache.lucene.util.TestRuleSetupTeardownChained$1.evaluate(TestRuleSetupTeardownChained.java:49)
	at org.apache.lucene.util.AbstractBeforeAfterRule$1.evaluate(AbstractBeforeAfterRule.java:45)
	at org.apache.lucene.util.TestRuleThreadAndTestName$1.evaluate(TestRuleThreadAndTestName.java:48)
	at org.apache.lucene.util.TestRuleIgnoreAfterMaxFailures$1.evaluate(TestRuleIgnoreAfterMaxFailures.java:64)
	at org.apache.lucene.util.TestRuleMarkFailure$1.evaluate(TestRuleMarkFailure.java:47)
	at com.carrotsearch.randomizedtesting.rules.StatementAdapter.evaluate(StatementAdapter.java:36)
	at com.carrotsearch.randomizedtesting.ThreadLeakControl$StatementRunner.run(ThreadLeakControl.java:368)
	at com.carrotsearch.randomizedtesting.ThreadLeakControl.forkTimeoutingTask(ThreadLeakControl.java:817)
	at com.carrotsearch.randomizedtesting.ThreadLeakControl$3.evaluate(ThreadLeakControl.java:468)
	at com.carrotsearch.randomizedtesting.RandomizedRunner.runSingleTest(RandomizedRunner.java:943)
	at com.carrotsearch.randomizedtesting.RandomizedRunner$5.evaluate(RandomizedRunner.java:829)
	at com.carrotsearch.randomizedtesting.RandomizedRunner$6.evaluate(RandomizedRunner.java:879)
	at com.carrotsearch.randomizedtesting.RandomizedRunner$7.evaluate(RandomizedRunner.java:890)
	at com.carrotsearch.randomizedtesting.rules.StatementAdapter.evaluate(StatementAdapter.java:36)
	at com.carrotsearch.randomizedtesting.rules.SystemPropertiesRestoreRule$1.evaluate(SystemPropertiesRestoreRule.java:57)
	at org.apache.lucene.util.AbstractBeforeAfterRule$1.evaluate(AbstractBeforeAfterRule.java:45)
	at com.carrotsearch.randomizedtesting.rules.StatementAdapter.evaluate(StatementAdapter.java:36)
	at org.apache.lucene.util.TestRuleStoreClassName$1.evaluate(TestRuleStoreClassName.java:41)
	at com.carrotsearch.randomizedtesting.rules.NoShadowingOrOverridesOnMethodsRule$1.evaluate(NoShadowingOrOverridesOnMethodsRule.java:40)
	at com.carrotsearch.randomizedtesting.rules.NoShadowingOrOverridesOnMethodsRule$1.evaluate(NoShadowingOrOverridesOnMethodsRule.java:40)
	at com.carrotsearch.randomizedtesting.rules.StatementAdapter.evaluate(StatementAdapter.java:36)
	at com.carrotsearch.randomizedtesting.rules.StatementAdapter.evaluate(StatementAdapter.java:36)
	at com.carrotsearch.randomizedtesting.rules.StatementAdapter.evaluate(StatementAdapter.java:36)
	at org.apache.lucene.util.TestRuleAssertionsRequired$1.evaluate(TestRuleAssertionsRequired.java:53)
	at org.apache.lucene.util.TestRuleMarkFailure$1.evaluate(TestRuleMarkFailure.java:47)
	at org.apache.lucene.util.TestRuleIgnoreAfterMaxFailures$1.evaluate(TestRuleIgnoreAfterMaxFailures.java:64)
	at org.apache.lucene.util.TestRuleIgnoreTestSuites$1.evaluate(TestRuleIgnoreTestSuites.java:54)
	at com.carrotsearch.randomizedtesting.rules.StatementAdapter.evaluate(StatementAdapter.java:36)
	at com.carrotsearch.randomizedtesting.ThreadLeakControl$StatementRunner.run(ThreadLeakControl.java:368)
	at java.lang.Thread.run(Thread.java:748)


FAILED:  org.apache.solr.core.TestCoreContainer.testDeleteBadCores

Error Message:
 Expected: is <1>      got: <0> 

Stack Trace:
java.lang.AssertionError: 
Expected: is <1>
     got: <0>

	at __randomizedtesting.SeedInfo.seed([393134CE924FE1A4:4A66BA544B50CD5F]:0)
	at org.junit.Assert.assertThat(Assert.java:780)
	at org.junit.Assert.assertThat(Assert.java:738)
	at org.apache.solr.core.TestCoreContainer.testDeleteBadCores(TestCoreContainer.java:224)
	at sun.reflect.NativeMethodAccessorImpl.invoke0(Native Method)
	at sun.reflect.NativeMethodAccessorImpl.invoke(NativeMethodAccessorImpl.java:62)
	at sun.reflect.DelegatingMethodAccessorImpl.invoke(DelegatingMethodAccessorImpl.java:43)
	at java.lang.reflect.Method.invoke(Method.java:498)
	at com.carrotsearch.randomizedtesting.RandomizedRunner.invoke(RandomizedRunner.java:1737)
	at com.carrotsearch.randomizedtesting.RandomizedRunner$8.evaluate(RandomizedRunner.java:934)
	at com.carrotsearch.randomizedtesting.RandomizedRunner$9.evaluate(RandomizedRunner.java:970)
	at com.carrotsearch.randomizedtesting.RandomizedRunner$10.evaluate(RandomizedRunner.java:984)
	at com.carrotsearch.randomizedtesting.rules.SystemPropertiesRestoreRule$1.evaluate(SystemPropertiesRestoreRule.java:57)
	at org.apache.lucene.util.TestRuleSetupTeardownChained$1.evaluate(TestRuleSetupTeardownChained.java:49)
	at org.apache.lucene.util.AbstractBeforeAfterRule$1.evaluate(AbstractBeforeAfterRule.java:45)
	at org.apache.lucene.util.TestRuleThreadAndTestName$1.evaluate(TestRuleThreadAndTestName.java:48)
	at org.apache.lucene.util.TestRuleIgnoreAfterMaxFailures$1.evaluate(TestRuleIgnoreAfterMaxFailures.java:64)
	at org.apache.lucene.util.TestRuleMarkFailure$1.evaluate(TestRuleMarkFailure.java:47)
	at com.carrotsearch.randomizedtesting.rules.StatementAdapter.evaluate(StatementAdapter.java:36)
	at com.carrotsearch.randomizedtesting.ThreadLeakControl$StatementRunner.run(ThreadLeakControl.java:368)
	at com.carrotsearch.randomizedtesting.ThreadLeakControl.forkTimeoutingTask(ThreadLeakControl.java:817)
	at com.carrotsearch.randomizedtesting.ThreadLeakControl$3.evaluate(ThreadLeakControl.java:468)
	at com.carrotsearch.randomizedtesting.RandomizedRunner.runSingleTest(RandomizedRunner.java:943)
	at com.carrotsearch.randomizedtesting.RandomizedRunner$5.evaluate(RandomizedRunner.java:829)
	at com.carrotsearch.randomizedtesting.RandomizedRunner$6.evaluate(RandomizedRunner.java:879)
	at com.carrotsearch.randomizedtesting.RandomizedRunner$7.evaluate(RandomizedRunner.java:890)
	at com.carrotsearch.randomizedtesting.rules.StatementAdapter.evaluate(StatementAdapter.java:36)
	at com.carrotsearch.randomizedtesting.rules.SystemPropertiesRestoreRule$1.evaluate(SystemPropertiesRestoreRule.java:57)
	at org.apache.lucene.util.AbstractBeforeAfterRule$1.evaluate(AbstractBeforeAfterRule.java:45)
	at com.carrotsearch.randomizedtesting.rules.StatementAdapter.evaluate(StatementAdapter.java:36)
	at org.apache.lucene.util.TestRuleStoreClassName$1.evaluate(TestRuleStoreClassName.java:41)
	at com.carrotsearch.randomizedtesting.rules.NoShadowingOrOverridesOnMethodsRule$1.evaluate(NoShadowingOrOverridesOnMethodsRule.java:40)
	at com.carrotsearch.randomizedtesting.rules.NoShadowingOrOverridesOnMethodsRule$1.evaluate(NoShadowingOrOverridesOnMethodsRule.java:40)
	at com.carrotsearch.randomizedtesting.rules.StatementAdapter.evaluate(StatementAdapter.java:36)
	at com.carrotsearch.randomizedtesting.rules.StatementAdapter.evaluate(StatementAdapter.java:36)
	at com.carrotsearch.randomizedtesting.rules.StatementAdapter.evaluate(StatementAdapter.java:36)
	at org.apache.lucene.util.TestRuleAssertionsRequired$1.evaluate(TestRuleAssertionsRequired.java:53)
	at org.apache.lucene.util.TestRuleMarkFailure$1.evaluate(TestRuleMarkFailure.java:47)
	at org.apache.lucene.util.TestRuleIgnoreAfterMaxFailures$1.evaluate(TestRuleIgnoreAfterMaxFailures.java:64)
	at org.apache.lucene.util.TestRuleIgnoreTestSuites$1.evaluate(TestRuleIgnoreTestSuites.java:54)
	at com.carrotsearch.randomizedtesting.rules.StatementAdapter.evaluate(StatementAdapter.java:36)
	at com.carrotsearch.randomizedtesting.ThreadLeakControl$StatementRunner.run(ThreadLeakControl.java:368)
	at java.lang.Thread.run(Thread.java:748)


FAILED:  org.apache.solr.core.TestCoreContainer.testCoreInitFailuresFromEmptyContainer

Error Message:
org/apache/solr/core/CoreContainer$CoreLoadFailure

Stack Trace:
java.lang.NoClassDefFoundError: org/apache/solr/core/CoreContainer$CoreLoadFailure
	at __randomizedtesting.SeedInfo.seed([393134CE924FE1A4:66C98A4C34BDFD2B]:0)
	at org.apache.solr.core.CoreContainer.createFromDescriptor(CoreContainer.java:1012)
	at org.apache.solr.core.CoreContainer.create(CoreContainer.java:934)
	at org.apache.solr.core.CoreContainer.create(CoreContainer.java:896)
	at org.apache.solr.core.TestCoreContainer.testCoreInitFailuresFromEmptyContainer(TestCoreContainer.java:416)
	at sun.reflect.NativeMethodAccessorImpl.invoke0(Native Method)
	at sun.reflect.NativeMethodAccessorImpl.invoke(NativeMethodAccessorImpl.java:62)
	at sun.reflect.DelegatingMethodAccessorImpl.invoke(DelegatingMethodAccessorImpl.java:43)
	at java.lang.reflect.Method.invoke(Method.java:498)
	at com.carrotsearch.randomizedtesting.RandomizedRunner.invoke(RandomizedRunner.java:1737)
	at com.carrotsearch.randomizedtesting.RandomizedRunner$8.evaluate(RandomizedRunner.java:934)
	at com.carrotsearch.randomizedtesting.RandomizedRunner$9.evaluate(RandomizedRunner.java:970)
	at com.carrotsearch.randomizedtesting.RandomizedRunner$10.evaluate(RandomizedRunner.java:984)
	at com.carrotsearch.randomizedtesting.rules.SystemPropertiesRestoreRule$1.evaluate(SystemPropertiesRestoreRule.java:57)
	at org.apache.lucene.util.TestRuleSetupTeardownChained$1.evaluate(TestRuleSetupTeardownChained.java:49)
	at org.apache.lucene.util.AbstractBeforeAfterRule$1.evaluate(AbstractBeforeAfterRule.java:45)
	at org.apache.lucene.util.TestRuleThreadAndTestName$1.evaluate(TestRuleThreadAndTestName.java:48)
	at org.apache.lucene.util.TestRuleIgnoreAfterMaxFailures$1.evaluate(TestRuleIgnoreAfterMaxFailures.java:64)
	at org.apache.lucene.util.TestRuleMarkFailure$1.evaluate(TestRuleMarkFailure.java:47)
	at com.carrotsearch.randomizedtesting.rules.StatementAdapter.evaluate(StatementAdapter.java:36)
	at com.carrotsearch.randomizedtesting.ThreadLeakControl$StatementRunner.run(ThreadLeakControl.java:368)
	at com.carrotsearch.randomizedtesting.ThreadLeakControl.forkTimeoutingTask(ThreadLeakControl.java:817)
	at com.carrotsearch.randomizedtesting.ThreadLeakControl$3.evaluate(ThreadLeakControl.java:468)
	at com.carrotsearch.randomizedtesting.RandomizedRunner.runSingleTest(RandomizedRunner.java:943)
	at com.carrotsearch.randomizedtesting.RandomizedRunner$5.evaluate(RandomizedRunner.java:829)
	at com.carrotsearch.randomizedtesting.RandomizedRunner$6.evaluate(RandomizedRunner.java:879)
	at com.carrotsearch.randomizedtesting.RandomizedRunner$7.evaluate(RandomizedRunner.java:890)
	at com.carrotsearch.randomizedtesting.rules.StatementAdapter.evaluate(StatementAdapter.java:36)
	at com.carrotsearch.randomizedtesting.rules.SystemPropertiesRestoreRule$1.evaluate(SystemPropertiesRestoreRule.java:57)
	at org.apache.lucene.util.AbstractBeforeAfterRule$1.evaluate(AbstractBeforeAfterRule.java:45)
	at com.carrotsearch.randomizedtesting.rules.StatementAdapter.evaluate(StatementAdapter.java:36)
	at org.apache.lucene.util.TestRuleStoreClassName$1.evaluate(TestRuleStoreClassName.java:41)
	at com.carrotsearch.randomizedtesting.rules.NoShadowingOrOverridesOnMethodsRule$1.evaluate(NoShadowingOrOverridesOnMethodsRule.java:40)
	at com.carrotsearch.randomizedtesting.rules.NoShadowingOrOverridesOnMethod

[...truncated too long message...]

unit4]    > 	at net.bytebuddy.implementation.attribute.MethodAttributeAppender$Compound.apply(MethodAttributeAppender.java:425)
   [junit4]    > 	at net.bytebuddy.dynamic.scaffold.TypeWriter$MethodPool$Record$ForDefinedMethod$WithBody.applyAttributes(TypeWriter.java:609)
   [junit4]    > 	at net.bytebuddy.dynamic.scaffold.TypeWriter$MethodPool$Record$ForDefinedMethod$WithBody.applyBody(TypeWriter.java:601)
   [junit4]    > 	at net.bytebuddy.dynamic.scaffold.TypeWriter$MethodPool$Record$ForDefinedMethod.apply(TypeWriter.java:521)
   [junit4]    > 	at net.bytebuddy.dynamic.scaffold.TypeWriter$Default$ForCreation.create(TypeWriter.java:4089)
   [junit4]    > 	at net.bytebuddy.dynamic.scaffold.TypeWriter$Default.make(TypeWriter.java:1612)
   [junit4]    > 	at net.bytebuddy.dynamic.scaffold.subclass.SubclassDynamicTypeBuilder.make(SubclassDynamicTypeBuilder.java:174)
   [junit4]    > 	at net.bytebuddy.dynamic.scaffold.subclass.SubclassDynamicTypeBuilder.make(SubclassDynamicTypeBuilder.java:155)
   [junit4]    > 	at net.bytebuddy.dynamic.DynamicType$Builder$AbstractBase.make(DynamicType.java:2536)
   [junit4]    > 	at net.bytebuddy.dynamic.DynamicType$Builder$AbstractBase$Delegator.make(DynamicType.java:2638)
   [junit4]    > 	at org.mockito.internal.creation.bytebuddy.SubclassBytecodeGenerator.mockClass(SubclassBytecodeGenerator.java:94)
   [junit4]    > 	at org.mockito.internal.creation.bytebuddy.TypeCachingBytecodeGenerator$1.call(TypeCachingBytecodeGenerator.java:35)
   [junit4]    > 	at org.mockito.internal.creation.bytebuddy.TypeCachingBytecodeGenerator$1.call(TypeCachingBytecodeGenerator.java:32)
   [junit4]    > 	at net.bytebuddy.TypeCache.findOrInsert(TypeCache.java:138)
   [junit4]    > 	at net.bytebuddy.TypeCache$WithInlineExpunction.findOrInsert(TypeCache.java:346)
   [junit4]    > 	at net.bytebuddy.TypeCache.findOrInsert(TypeCache.java:161)
   [junit4]    > 	at net.bytebuddy.TypeCache$WithInlineExpunction.findOrInsert(TypeCache.java:355)
   [junit4]    > 	at org.mockito.internal.creation.bytebuddy.TypeCachingBytecodeGenerator.mockClass(TypeCachingBytecodeGenerator.java:30)
   [junit4]    > 	at org.mockito.internal.creation.bytebuddy.SubclassByteBuddyMockMaker.createMockType(SubclassByteBuddyMockMaker.java:71)
   [junit4]    > 	at org.mockito.internal.creation.bytebuddy.SubclassByteBuddyMockMaker.createMock(SubclassByteBuddyMockMaker.java:42)
   [junit4]    > 	at org.mockito.internal.creation.bytebuddy.ByteBuddyMockMaker.createMock(ByteBuddyMockMaker.java:26)
   [junit4]    > 	at org.mockito.internal.util.MockUtil.createMock(MockUtil.java:35)
   [junit4]    > 	at org.mockito.internal.MockitoCore.mock(MockitoCore.java:65)
   [junit4]    > 	at org.mockito.Mockito.mock(Mockito.java:1681)
   [junit4]    > 	at org.mockito.Mockito.mock(Mockito.java:1594)
   [junit4]    > 	... 20 more
   [junit4]    > Caused by: java.lang.NoClassDefFoundError: org/apache/solr/core/CoreContainer$CoreLoadFailure
   [junit4]    > 	at java.lang.Class.getDeclaringClass0(Native Method)
   [junit4]    > 	at java.lang.Class.getDeclaringClass(Class.java:1235)
   [junit4]    > 	at java.lang.Class.getEnclosingClass(Class.java:1277)
   [junit4]    > 	at net.bytebuddy.description.type.TypeDescription$Generic$AnnotationReader$ForTypeArgument.resolve(TypeDescription.java:3265)
   [junit4]    > 	... 57 more
   [junit4] ERROR   0.00s J1 | BlobRepositoryMockingTest.testGetBlobIncrRefStringDecoder <<<
   [junit4]    > Throwable #1: org.mockito.exceptions.base.MockitoException: 
   [junit4]    > Mockito cannot mock this class: class org.apache.solr.core.CoreContainer.
   [junit4]    > Mockito can only mock non-private & non-final classes.
   [junit4]    > If you're not sure why you're getting this error, please report to the mailing list.
   [junit4]    > Java               : 1.8
   [junit4]    > JVM vendor name    : Oracle Corporation
   [junit4]    > JVM vendor version : 25.144-b01
   [junit4]    > JVM name           : Java HotSpot(TM) 64-Bit Server VM
   [junit4]    > JVM version        : 1.8.0_144-b01
   [junit4]    > JVM info           : mixed mode
   [junit4]    > OS name            : Mac OS X
   [junit4]    > OS version         : 10.11.6
   [junit4]    > Underlying exception : java.lang.IllegalStateException: Error invoking java.lang.reflect.AnnotatedParameterizedType#getAnnotatedActualTypeArguments
   [junit4]    > 	at org.apache.solr.core.BlobRepositoryMockingTest.<init>(BlobRepositoryMockingTest.java:43)
   [junit4]    > 	at java.lang.reflect.Constructor.newInstance(Constructor.java:423)
   [junit4]    > Caused by: java.lang.IllegalStateException: Error invoking java.lang.reflect.AnnotatedParameterizedType#getAnnotatedActualTypeArguments
   [junit4]    > 	at net.bytebuddy.description.type.TypeDescription$Generic$AnnotationReader$ForTypeArgument.resolve(TypeDescription.java:3271)
   [junit4]    > 	at net.bytebuddy.description.type.TypeDescription$Generic$AnnotationReader$Delegator$Chained.resolve(TypeDescription.java:3052)
   [junit4]    > 	at net.bytebuddy.description.type.TypeDescription$Generic$AnnotationReader$ForTypeArgument.resolve(TypeDescription.java:3238)
   [junit4]    > 	at net.bytebuddy.description.type.TypeDescription$Generic$AnnotationReader$Delegator.asList(TypeDescription.java:3006)
   [junit4]    > 	at net.bytebuddy.description.type.TypeDescription$Generic$OfNonGenericType$ForLoadedType.getDeclaredAnnotations(TypeDescription.java:3566)
   [junit4]    > 	at net.bytebuddy.implementation.attribute.AnnotationAppender$ForTypeAnnotations.apply(AnnotationAppender.java:639)
   [junit4]    > 	at net.bytebuddy.implementation.attribute.AnnotationAppender$ForTypeAnnotations.onNonGenericType(AnnotationAppender.java:620)
   [junit4]    > 	at net.bytebuddy.implementation.attribute.AnnotationAppender$ForTypeAnnotations.onNonGenericType(AnnotationAppender.java:333)
   [junit4]    > 	at net.bytebuddy.description.type.TypeDescription$Generic$OfNonGenericType.accept(TypeDescription.java:3433)
   [junit4]    > 	at net.bytebuddy.implementation.attribute.AnnotationAppender$ForTypeAnnotations.onParameterizedType(AnnotationAppender.java:601)
   [junit4]    > 	at net.bytebuddy.implementation.attribute.AnnotationAppender$ForTypeAnnotations.onParameterizedType(AnnotationAppender.java:333)
   [junit4]    > 	at net.bytebuddy.description.type.TypeDescription$Generic$OfParameterizedType.accept(TypeDescription.java:4356)
   [junit4]    > 	at net.bytebuddy.implementation.attribute.MethodAttributeAppender$ForInstrumentedMethod.apply(MethodAttributeAppender.java:171)
   [junit4]    > 	at net.bytebuddy.implementation.attribute.MethodAttributeAppender$Compound.apply(MethodAttributeAppender.java:425)
   [junit4]    > 	at net.bytebuddy.dynamic.scaffold.TypeWriter$MethodPool$Record$ForDefinedMethod$WithBody.applyAttributes(TypeWriter.java:609)
   [junit4]    > 	at net.bytebuddy.dynamic.scaffold.TypeWriter$MethodPool$Record$ForDefinedMethod$WithBody.applyBody(TypeWriter.java:601)
   [junit4]    > 	at net.bytebuddy.dynamic.scaffold.TypeWriter$MethodPool$Record$ForDefinedMethod.apply(TypeWriter.java:521)
   [junit4]    > 	at net.bytebuddy.dynamic.scaffold.TypeWriter$Default$ForCreation.create(TypeWriter.java:4089)
   [junit4]    > 	at net.bytebuddy.dynamic.scaffold.TypeWriter$Default.make(TypeWriter.java:1612)
   [junit4]    > 	at net.bytebuddy.dynamic.scaffold.subclass.SubclassDynamicTypeBuilder.make(SubclassDynamicTypeBuilder.java:174)
   [junit4]    > 	at net.bytebuddy.dynamic.scaffold.subclass.SubclassDynamicTypeBuilder.make(SubclassDynamicTypeBuilder.java:155)
   [junit4]    > 	at net.bytebuddy.dynamic.DynamicType$Builder$AbstractBase.make(DynamicType.java:2536)
   [junit4]    > 	at net.bytebuddy.dynamic.DynamicType$Builder$AbstractBase$Delegator.make(DynamicType.java:2638)
   [junit4]    > 	at org.mockito.internal.creation.bytebuddy.SubclassBytecodeGenerator.mockClass(SubclassBytecodeGenerator.java:94)
   [junit4]    > 	at org.mockito.internal.creation.bytebuddy.TypeCachingBytecodeGenerator$1.call(TypeCachingBytecodeGenerator.java:35)
   [junit4]    > 	at org.mockito.internal.creation.bytebuddy.TypeCachingBytecodeGenerator$1.call(TypeCachingBytecodeGenerator.java:32)
   [junit4]    > 	at net.bytebuddy.TypeCache.findOrInsert(TypeCache.java:138)
   [junit4]    > 	at net.bytebuddy.TypeCache$WithInlineExpunction.findOrInsert(TypeCache.java:346)
   [junit4]    > 	at net.bytebuddy.TypeCache.findOrInsert(TypeCache.java:161)
   [junit4]    > 	at net.bytebuddy.TypeCache$WithInlineExpunction.findOrInsert(TypeCache.java:355)
   [junit4]    > 	at org.mockito.internal.creation.bytebuddy.TypeCachingBytecodeGenerator.mockClass(TypeCachingBytecodeGenerator.java:30)
   [junit4]    > 	at org.mockito.internal.creation.bytebuddy.SubclassByteBuddyMockMaker.createMockType(SubclassByteBuddyMockMaker.java:71)
   [junit4]    > 	at org.mockito.internal.creation.bytebuddy.SubclassByteBuddyMockMaker.createMock(SubclassByteBuddyMockMaker.java:42)
   [junit4]    > 	at org.mockito.internal.creation.bytebuddy.ByteBuddyMockMaker.createMock(ByteBuddyMockMaker.java:26)
   [junit4]    > 	at org.mockito.internal.util.MockUtil.createMock(MockUtil.java:35)
   [junit4]    > 	at org.mockito.internal.MockitoCore.mock(MockitoCore.java:65)
   [junit4]    > 	at org.mockito.Mockito.mock(Mockito.java:1681)
   [junit4]    > 	at org.mockito.Mockito.mock(Mockito.java:1594)
   [junit4]    > 	... 20 more
   [junit4]    > Caused by: java.lang.NoClassDefFoundError: org/apache/solr/core/CoreContainer$CoreLoadFailure
   [junit4]    > 	at java.lang.Class.getDeclaringClass0(Native Method)
   [junit4]    > 	at java.lang.Class.getDeclaringClass(Class.java:1235)
   [junit4]    > 	at java.lang.Class.getEnclosingClass(Class.java:1277)
   [junit4]    > 	at net.bytebuddy.description.type.TypeDescription$Generic$AnnotationReader$ForTypeArgument.resolve(TypeDescription.java:3265)
   [junit4]    > 	... 57 more
   [junit4] Completed [574/731 (10!)] on J1 in 0.12s, 4 tests, 4 errors <<< FAILURES!

[...truncated 46739 lines...]