You are viewing a plain text version of this content. The canonical link for it is here.
Posted to dev@lucene.apache.org by Apache Jenkins Server <je...@builds.apache.org> on 2013/01/25 15:42:49 UTC

[JENKINS] Lucene-Solr-Tests-trunk-Java6 - Build # 15856 - Failure

Build: https://builds.apache.org/job/Lucene-Solr-Tests-trunk-Java6/15856/

1 tests failed.
REGRESSION:  org.apache.solr.cloud.SyncSliceTest.testDistribSearch

Error Message:
shard1 should have just been set up to be inconsistent - but it's still consistent

Stack Trace:
java.lang.AssertionError: shard1 should have just been set up to be inconsistent - but it's still consistent
	at __randomizedtesting.SeedInfo.seed([AB6038BC5D4C511F:2A86B6A42A133123]:0)
	at org.junit.Assert.fail(Assert.java:93)
	at org.junit.Assert.assertTrue(Assert.java:43)
	at org.junit.Assert.assertNotNull(Assert.java:526)
	at org.apache.solr.cloud.SyncSliceTest.doTest(SyncSliceTest.java:214)
	at org.apache.solr.BaseDistributedSearchTestCase.testDistribSearch(BaseDistributedSearchTestCase.java:794)
	at sun.reflect.NativeMethodAccessorImpl.invoke0(Native Method)
	at sun.reflect.NativeMethodAccessorImpl.invoke(NativeMethodAccessorImpl.java:57)
	at sun.reflect.DelegatingMethodAccessorImpl.invoke(DelegatingMethodAccessorImpl.java:43)
	at java.lang.reflect.Method.invoke(Method.java:616)
	at com.carrotsearch.randomizedtesting.RandomizedRunner.invoke(RandomizedRunner.java:1559)
	at com.carrotsearch.randomizedtesting.RandomizedRunner.access$600(RandomizedRunner.java:79)
	at com.carrotsearch.randomizedtesting.RandomizedRunner$6.evaluate(RandomizedRunner.java:737)
	at com.carrotsearch.randomizedtesting.RandomizedRunner$7.evaluate(RandomizedRunner.java:773)
	at com.carrotsearch.randomizedtesting.RandomizedRunner$8.evaluate(RandomizedRunner.java:787)
	at com.carrotsearch.randomizedtesting.rules.SystemPropertiesRestoreRule$1.evaluate(SystemPropertiesRestoreRule.java:53)
	at org.apache.lucene.util.TestRuleSetupTeardownChained$1.evaluate(TestRuleSetupTeardownChained.java:50)
	at org.apache.lucene.util.TestRuleFieldCacheSanity$1.evaluate(TestRuleFieldCacheSanity.java:51)
	at org.apache.lucene.util.AbstractBeforeAfterRule$1.evaluate(AbstractBeforeAfterRule.java:46)
	at com.carrotsearch.randomizedtesting.rules.SystemPropertiesInvariantRule$1.evaluate(SystemPropertiesInvariantRule.java:55)
	at org.apache.lucene.util.TestRuleThreadAndTestName$1.evaluate(TestRuleThreadAndTestName.java:49)
	at org.apache.lucene.util.TestRuleIgnoreAfterMaxFailures$1.evaluate(TestRuleIgnoreAfterMaxFailures.java:70)
	at org.apache.lucene.util.TestRuleMarkFailure$1.evaluate(TestRuleMarkFailure.java:48)
	at com.carrotsearch.randomizedtesting.rules.StatementAdapter.evaluate(StatementAdapter.java:36)
	at com.carrotsearch.randomizedtesting.ThreadLeakControl$StatementRunner.run(ThreadLeakControl.java:358)
	at com.carrotsearch.randomizedtesting.ThreadLeakControl.forkTimeoutingTask(ThreadLeakControl.java:782)
	at com.carrotsearch.randomizedtesting.ThreadLeakControl$3.evaluate(ThreadLeakControl.java:442)
	at com.carrotsearch.randomizedtesting.RandomizedRunner.runSingleTest(RandomizedRunner.java:746)
	at com.carrotsearch.randomizedtesting.RandomizedRunner$3.evaluate(RandomizedRunner.java:648)
	at com.carrotsearch.randomizedtesting.RandomizedRunner$4.evaluate(RandomizedRunner.java:682)
	at com.carrotsearch.randomizedtesting.RandomizedRunner$5.evaluate(RandomizedRunner.java:693)
	at com.carrotsearch.randomizedtesting.rules.StatementAdapter.evaluate(StatementAdapter.java:36)
	at com.carrotsearch.randomizedtesting.rules.SystemPropertiesRestoreRule$1.evaluate(SystemPropertiesRestoreRule.java:53)
	at org.apache.lucene.util.AbstractBeforeAfterRule$1.evaluate(AbstractBeforeAfterRule.java:46)
	at org.apache.lucene.util.TestRuleStoreClassName$1.evaluate(TestRuleStoreClassName.java:42)
	at com.carrotsearch.randomizedtesting.rules.SystemPropertiesInvariantRule$1.evaluate(SystemPropertiesInvariantRule.java:55)
	at com.carrotsearch.randomizedtesting.rules.NoShadowingOrOverridesOnMethodsRule$1.evaluate(NoShadowingOrOverridesOnMethodsRule.java:39)
	at com.carrotsearch.randomizedtesting.rules.NoShadowingOrOverridesOnMethodsRule$1.evaluate(NoShadowingOrOverridesOnMethodsRule.java:39)
	at com.carrotsearch.randomizedtesting.rules.StatementAdapter.evaluate(StatementAdapter.java:36)
	at org.apache.lucene.util.TestRuleAssertionsRequired$1.evaluate(TestRuleAssertionsRequired.java:43)
	at org.apache.lucene.util.TestRuleMarkFailure$1.evaluate(TestRuleMarkFailure.java:48)
	at org.apache.lucene.util.TestRuleIgnoreAfterMaxFailures$1.evaluate(TestRuleIgnoreAfterMaxFailures.java:70)
	at org.apache.lucene.util.TestRuleIgnoreTestSuites$1.evaluate(TestRuleIgnoreTestSuites.java:55)
	at com.carrotsearch.randomizedtesting.rules.StatementAdapter.evaluate(StatementAdapter.java:36)
	at com.carrotsearch.randomizedtesting.ThreadLeakControl$StatementRunner.run(ThreadLeakControl.java:358)
	at java.lang.Thread.run(Thread.java:679)




Build Log:
[...truncated 8687 lines...]
[junit4:junit4] Suite: org.apache.solr.cloud.SyncSliceTest
[junit4:junit4]   2> 0 T1498 oas.BaseDistributedSearchTestCase.initHostContext Setting hostContext system property: /s/t
[junit4:junit4]   2> 4 T1498 oas.SolrTestCaseJ4.setUp ###Starting testDistribSearch
[junit4:junit4]   2> Creating dataDir: /usr/home/hudson/hudson-slave/workspace/Lucene-Solr-Tests-trunk-Java6/solr/build/solr-core/test/J0/./solrtest-SyncSliceTest-1359124613698
[junit4:junit4]   2> 6 T1498 oasc.ZkTestServer.run STARTING ZK TEST SERVER
[junit4:junit4]   2> 6 T1499 oasc.ZkTestServer$ZKServerMain.runFromConfig Starting server
[junit4:junit4]   2> 8 T1499 oazs.ZooKeeperServer.setTickTime tickTime set to 1000
[junit4:junit4]   2> 8 T1499 oazs.ZooKeeperServer.setMinSessionTimeout minSessionTimeout set to -1
[junit4:junit4]   2> 8 T1499 oazs.ZooKeeperServer.setMaxSessionTimeout maxSessionTimeout set to -1
[junit4:junit4]   2> 9 T1499 oazs.NIOServerCnxnFactory.configure binding to port 0.0.0.0/0.0.0.0:0
[junit4:junit4]   2> 9 T1499 oazsp.FileTxnSnapLog.save Snapshotting: 0x0 to /usr/home/hudson/hudson-slave/workspace/Lucene-Solr-Tests-trunk-Java6/solr/build/solr-core/test/J0/./org.apache.solr.cloud.SyncSliceTest-1359124613698/zookeeper/server1/data/version-2/snapshot.0
[junit4:junit4]   2> 107 T1498 oasc.ZkTestServer.run start zk server on port:38917
[junit4:junit4]   2> 107 T1498 oaz.ZooKeeper.<init> Initiating client connection, connectString=127.0.0.1:38917 sessionTimeout=10000 watcher=org.apache.solr.common.cloud.ConnectionManager@11a78ca7
[junit4:junit4]   2> 108 T1498 oascc.ConnectionManager.waitForConnected Waiting for client to connect to ZooKeeper
[junit4:junit4]   2> 108 T1504 oaz.ClientCnxn$SendThread.logStartConnect Opening socket connection to server localhost/127.0.0.1:38917. Will not attempt to authenticate using SASL (access denied (javax.security.auth.AuthPermission getLoginConfiguration))
[junit4:junit4]   2> 109 T1504 oaz.ClientCnxn$SendThread.primeConnection Socket connection established to localhost/127.0.0.1:38917, initiating session
[junit4:junit4]   2> 109 T1500 oazs.NIOServerCnxnFactory.run Accepted socket connection from /140.211.11.196:11677
[junit4:junit4]   2> 109 T1500 oazs.ZooKeeperServer.processConnectRequest Client attempting to establish new session at /140.211.11.196:11677
[junit4:junit4]   2> 109 T1502 oazsp.FileTxnLog.append Creating new log file: log.1
[junit4:junit4]   2> 111 T1502 oazs.ZooKeeperServer.finishSessionInit Established session 0x13c7223ca470000 with negotiated timeout 10000 for client /140.211.11.196:11677
[junit4:junit4]   2> 111 T1504 oaz.ClientCnxn$SendThread.onConnected Session establishment complete on server localhost/127.0.0.1:38917, sessionid = 0x13c7223ca470000, negotiated timeout = 10000
[junit4:junit4]   2> 112 T1505 oascc.ConnectionManager.process Watcher org.apache.solr.common.cloud.ConnectionManager@11a78ca7 name:ZooKeeperConnection Watcher:127.0.0.1:38917 got event WatchedEvent state:SyncConnected type:None path:null path:null type:None
[junit4:junit4]   2> 112 T1498 oascc.ConnectionManager.waitForConnected Client is connected to ZooKeeper
[junit4:junit4]   2> 112 T1498 oascc.SolrZkClient.makePath makePath: /solr
[junit4:junit4]   2> 115 T1503 oazs.PrepRequestProcessor.pRequest2Txn Processed session termination for sessionid: 0x13c7223ca470000
[junit4:junit4]   2> 123 T1505 oaz.ClientCnxn$EventThread.run EventThread shut down
[junit4:junit4]   2> 124 T1500 oazs.NIOServerCnxn.closeSock Closed socket connection for client /140.211.11.196:11677 which had sessionid 0x13c7223ca470000
[junit4:junit4]   2> 123 T1498 oaz.ZooKeeper.close Session: 0x13c7223ca470000 closed
[junit4:junit4]   2> 124 T1498 oaz.ZooKeeper.<init> Initiating client connection, connectString=127.0.0.1:38917/solr sessionTimeout=10000 watcher=org.apache.solr.common.cloud.ConnectionManager@358a426f
[junit4:junit4]   2> 125 T1498 oascc.ConnectionManager.waitForConnected Waiting for client to connect to ZooKeeper
[junit4:junit4]   2> 125 T1506 oaz.ClientCnxn$SendThread.logStartConnect Opening socket connection to server localhost/127.0.0.1:38917. Will not attempt to authenticate using SASL (access denied (javax.security.auth.AuthPermission getLoginConfiguration))
[junit4:junit4]   2> 125 T1506 oaz.ClientCnxn$SendThread.primeConnection Socket connection established to localhost/127.0.0.1:38917, initiating session
[junit4:junit4]   2> 125 T1500 oazs.NIOServerCnxnFactory.run Accepted socket connection from /140.211.11.196:31056
[junit4:junit4]   2> 126 T1500 oazs.ZooKeeperServer.processConnectRequest Client attempting to establish new session at /140.211.11.196:31056
[junit4:junit4]   2> 127 T1502 oazs.ZooKeeperServer.finishSessionInit Established session 0x13c7223ca470001 with negotiated timeout 10000 for client /140.211.11.196:31056
[junit4:junit4]   2> 127 T1506 oaz.ClientCnxn$SendThread.onConnected Session establishment complete on server localhost/127.0.0.1:38917, sessionid = 0x13c7223ca470001, negotiated timeout = 10000
[junit4:junit4]   2> 127 T1507 oascc.ConnectionManager.process Watcher org.apache.solr.common.cloud.ConnectionManager@358a426f name:ZooKeeperConnection Watcher:127.0.0.1:38917/solr got event WatchedEvent state:SyncConnected type:None path:null path:null type:None
[junit4:junit4]   2> 127 T1498 oascc.ConnectionManager.waitForConnected Client is connected to ZooKeeper
[junit4:junit4]   2> 127 T1498 oascc.SolrZkClient.makePath makePath: /collections/collection1
[junit4:junit4]   2> 137 T1498 oascc.SolrZkClient.makePath makePath: /collections/collection1/shards
[junit4:junit4]   2> 139 T1498 oascc.SolrZkClient.makePath makePath: /collections/control_collection
[junit4:junit4]   2> 141 T1498 oascc.SolrZkClient.makePath makePath: /collections/control_collection/shards
[junit4:junit4]   2> 148 T1498 oasc.AbstractZkTestCase.putConfig put /usr/home/hudson/hudson-slave/workspace/Lucene-Solr-Tests-trunk-Java6/solr/build/solr-core/test-files/solr/collection1/conf/solrconfig.xml to /configs/conf1/solrconfig.xml
[junit4:junit4]   2> 149 T1498 oascc.SolrZkClient.makePath makePath: /configs/conf1/solrconfig.xml
[junit4:junit4]   2> 160 T1498 oasc.AbstractZkTestCase.putConfig put /usr/home/hudson/hudson-slave/workspace/Lucene-Solr-Tests-trunk-Java6/solr/build/solr-core/test-files/solr/collection1/conf/schema.xml to /configs/conf1/schema.xml
[junit4:junit4]   2> 161 T1498 oascc.SolrZkClient.makePath makePath: /configs/conf1/schema.xml
[junit4:junit4]   2> 266 T1498 oasc.AbstractZkTestCase.putConfig put /usr/home/hudson/hudson-slave/workspace/Lucene-Solr-Tests-trunk-Java6/solr/build/solr-core/test-files/solr/collection1/conf/stopwords.txt to /configs/conf1/stopwords.txt
[junit4:junit4]   2> 266 T1498 oascc.SolrZkClient.makePath makePath: /configs/conf1/stopwords.txt
[junit4:junit4]   2> 278 T1498 oasc.AbstractZkTestCase.putConfig put /usr/home/hudson/hudson-slave/workspace/Lucene-Solr-Tests-trunk-Java6/solr/build/solr-core/test-files/solr/collection1/conf/protwords.txt to /configs/conf1/protwords.txt
[junit4:junit4]   2> 279 T1498 oascc.SolrZkClient.makePath makePath: /configs/conf1/protwords.txt
[junit4:junit4]   2> 282 T1498 oasc.AbstractZkTestCase.putConfig put /usr/home/hudson/hudson-slave/workspace/Lucene-Solr-Tests-trunk-Java6/solr/build/solr-core/test-files/solr/collection1/conf/currency.xml to /configs/conf1/currency.xml
[junit4:junit4]   2> 283 T1498 oascc.SolrZkClient.makePath makePath: /configs/conf1/currency.xml
[junit4:junit4]   2> 285 T1498 oasc.AbstractZkTestCase.putConfig put /usr/home/hudson/hudson-slave/workspace/Lucene-Solr-Tests-trunk-Java6/solr/build/solr-core/test-files/solr/collection1/conf/open-exchange-rates.json to /configs/conf1/open-exchange-rates.json
[junit4:junit4]   2> 286 T1498 oascc.SolrZkClient.makePath makePath: /configs/conf1/open-exchange-rates.json
[junit4:junit4]   2> 293 T1498 oasc.AbstractZkTestCase.putConfig put /usr/home/hudson/hudson-slave/workspace/Lucene-Solr-Tests-trunk-Java6/solr/build/solr-core/test-files/solr/collection1/conf/mapping-ISOLatin1Accent.txt to /configs/conf1/mapping-ISOLatin1Accent.txt
[junit4:junit4]   2> 294 T1498 oascc.SolrZkClient.makePath makePath: /configs/conf1/mapping-ISOLatin1Accent.txt
[junit4:junit4]   2> 296 T1498 oasc.AbstractZkTestCase.putConfig put /usr/home/hudson/hudson-slave/workspace/Lucene-Solr-Tests-trunk-Java6/solr/build/solr-core/test-files/solr/collection1/conf/old_synonyms.txt to /configs/conf1/old_synonyms.txt
[junit4:junit4]   2> 297 T1498 oascc.SolrZkClient.makePath makePath: /configs/conf1/old_synonyms.txt
[junit4:junit4]   2> 300 T1498 oasc.AbstractZkTestCase.putConfig put /usr/home/hudson/hudson-slave/workspace/Lucene-Solr-Tests-trunk-Java6/solr/build/solr-core/test-files/solr/collection1/conf/synonyms.txt to /configs/conf1/synonyms.txt
[junit4:junit4]   2> 300 T1498 oascc.SolrZkClient.makePath makePath: /configs/conf1/synonyms.txt
[junit4:junit4]   2> 303 T1503 oazs.PrepRequestProcessor.pRequest2Txn Processed session termination for sessionid: 0x13c7223ca470001
[junit4:junit4]   2> 310 T1507 oaz.ClientCnxn$EventThread.run EventThread shut down
[junit4:junit4]   2> 311 T1500 oazs.NIOServerCnxn.closeSock Closed socket connection for client /140.211.11.196:31056 which had sessionid 0x13c7223ca470001
[junit4:junit4]   2> 310 T1498 oaz.ZooKeeper.close Session: 0x13c7223ca470001 closed
[junit4:junit4]   2> 466 T1498 oejs.Server.doStart jetty-8.1.8.v20121106
[junit4:junit4]   2> 471 T1498 oejs.AbstractConnector.doStart Started SocketConnector@127.0.0.1:41597
[junit4:junit4]   2> 472 T1498 oass.SolrDispatchFilter.init SolrDispatchFilter.init()
[junit4:junit4]   2> 472 T1498 oasc.SolrResourceLoader.locateSolrHome JNDI not configured for solr (NoInitialContextEx)
[junit4:junit4]   2> 473 T1498 oasc.SolrResourceLoader.locateSolrHome using system property solr.solr.home: /usr/home/hudson/hudson-slave/workspace/Lucene-Solr-Tests-trunk-Java6/solr/build/solr-core/test/J0/./org.apache.solr.cloud.SyncSliceTest-controljetty-1359124614004
[junit4:junit4]   2> 473 T1498 oasc.CoreContainer$Initializer.initialize looking for solr.xml: /usr/home/hudson/hudson-slave/workspace/Lucene-Solr-Tests-trunk-Java6/solr/build/solr-core/test/J0/./org.apache.solr.cloud.SyncSliceTest-controljetty-1359124614004/solr.xml
[junit4:junit4]   2> 473 T1498 oasc.CoreContainer.<init> New CoreContainer 1976671672
[junit4:junit4]   2> 474 T1498 oasc.CoreContainer.load Loading CoreContainer using Solr Home: '/usr/home/hudson/hudson-slave/workspace/Lucene-Solr-Tests-trunk-Java6/solr/build/solr-core/test/J0/./org.apache.solr.cloud.SyncSliceTest-controljetty-1359124614004/'
[junit4:junit4]   2> 474 T1498 oasc.SolrResourceLoader.<init> new SolrResourceLoader for directory: '/usr/home/hudson/hudson-slave/workspace/Lucene-Solr-Tests-trunk-Java6/solr/build/solr-core/test/J0/./org.apache.solr.cloud.SyncSliceTest-controljetty-1359124614004/'
[junit4:junit4]   2> 516 T1498 oashc.HttpShardHandlerFactory.getParameter Setting socketTimeout to: 60000
[junit4:junit4]   2> 516 T1498 oashc.HttpShardHandlerFactory.getParameter Setting urlScheme to: http://
[junit4:junit4]   2> 517 T1498 oashc.HttpShardHandlerFactory.getParameter Setting connTimeout to: 15000
[junit4:junit4]   2> 517 T1498 oashc.HttpShardHandlerFactory.getParameter Setting maxConnectionsPerHost to: 20
[junit4:junit4]   2> 517 T1498 oashc.HttpShardHandlerFactory.getParameter Setting corePoolSize to: 0
[junit4:junit4]   2> 518 T1498 oashc.HttpShardHandlerFactory.getParameter Setting maximumPoolSize to: 2147483647
[junit4:junit4]   2> 518 T1498 oashc.HttpShardHandlerFactory.getParameter Setting maxThreadIdleTime to: 5
[junit4:junit4]   2> 519 T1498 oashc.HttpShardHandlerFactory.getParameter Setting sizeOfQueue to: -1
[junit4:junit4]   2> 519 T1498 oashc.HttpShardHandlerFactory.getParameter Setting fairnessPolicy to: false
[junit4:junit4]   2> 520 T1498 oascsi.HttpClientUtil.createClient Creating new http client, config:maxConnectionsPerHost=20&maxConnections=10000&socketTimeout=60000&connTimeout=15000&retry=false
[junit4:junit4]   2> 540 T1498 oasc.CoreContainer.load Registering Log Listener
[junit4:junit4]   2> 558 T1498 oasc.CoreContainer.initZooKeeper Zookeeper client=127.0.0.1:38917/solr
[junit4:junit4]   2> 558 T1498 oasc.ZkController.checkChrootPath zkHost includes chroot
[junit4:junit4]   2> 559 T1498 oaz.ZooKeeper.<init> Initiating client connection, connectString=127.0.0.1:38917 sessionTimeout=60000 watcher=org.apache.solr.common.cloud.ConnectionManager@4f608ea3
[junit4:junit4]   2> 560 T1498 oascc.ConnectionManager.waitForConnected Waiting for client to connect to ZooKeeper
[junit4:junit4]   2> 560 T1517 oaz.ClientCnxn$SendThread.logStartConnect Opening socket connection to server localhost/127.0.0.1:38917. Will not attempt to authenticate using SASL (access denied (javax.security.auth.AuthPermission getLoginConfiguration))
[junit4:junit4]   2> 561 T1517 oaz.ClientCnxn$SendThread.primeConnection Socket connection established to localhost/127.0.0.1:38917, initiating session
[junit4:junit4]   2> 561 T1500 oazs.NIOServerCnxnFactory.run Accepted socket connection from /140.211.11.196:41940
[junit4:junit4]   2> 561 T1500 oazs.ZooKeeperServer.processConnectRequest Client attempting to establish new session at /140.211.11.196:41940
[junit4:junit4]   2> 563 T1502 oazs.ZooKeeperServer.finishSessionInit Established session 0x13c7223ca470002 with negotiated timeout 20000 for client /140.211.11.196:41940
[junit4:junit4]   2> 563 T1517 oaz.ClientCnxn$SendThread.onConnected Session establishment complete on server localhost/127.0.0.1:38917, sessionid = 0x13c7223ca470002, negotiated timeout = 20000
[junit4:junit4]   2> 563 T1518 oascc.ConnectionManager.process Watcher org.apache.solr.common.cloud.ConnectionManager@4f608ea3 name:ZooKeeperConnection Watcher:127.0.0.1:38917 got event WatchedEvent state:SyncConnected type:None path:null path:null type:None
[junit4:junit4]   2> 564 T1498 oascc.ConnectionManager.waitForConnected Client is connected to ZooKeeper
[junit4:junit4]   2> 565 T1503 oazs.PrepRequestProcessor.pRequest2Txn Processed session termination for sessionid: 0x13c7223ca470002
[junit4:junit4]   2> 574 T1518 oaz.ClientCnxn$EventThread.run EventThread shut down
[junit4:junit4]   2> 574 T1500 oazs.NIOServerCnxn.closeSock Closed socket connection for client /140.211.11.196:41940 which had sessionid 0x13c7223ca470002
[junit4:junit4]   2> 574 T1498 oaz.ZooKeeper.close Session: 0x13c7223ca470002 closed
[junit4:junit4]   2> 574 T1498 oascsi.HttpClientUtil.createClient Creating new http client, config:maxConnections=500&maxConnectionsPerHost=16&socketTimeout=60000&connTimeout=15000
[junit4:junit4]   2> 585 T1498 oaz.ZooKeeper.<init> Initiating client connection, connectString=127.0.0.1:38917/solr sessionTimeout=30000 watcher=org.apache.solr.common.cloud.ConnectionManager@68c5e32e
[junit4:junit4]   2> 586 T1498 oascc.ConnectionManager.waitForConnected Waiting for client to connect to ZooKeeper
[junit4:junit4]   2> 586 T1519 oaz.ClientCnxn$SendThread.logStartConnect Opening socket connection to server localhost/127.0.0.1:38917. Will not attempt to authenticate using SASL (access denied (javax.security.auth.AuthPermission getLoginConfiguration))
[junit4:junit4]   2> 587 T1519 oaz.ClientCnxn$SendThread.primeConnection Socket connection established to localhost/127.0.0.1:38917, initiating session
[junit4:junit4]   2> 587 T1500 oazs.NIOServerCnxnFactory.run Accepted socket connection from /140.211.11.196:64086
[junit4:junit4]   2> 587 T1500 oazs.ZooKeeperServer.processConnectRequest Client attempting to establish new session at /140.211.11.196:64086
[junit4:junit4]   2> 588 T1502 oazs.ZooKeeperServer.finishSessionInit Established session 0x13c7223ca470003 with negotiated timeout 20000 for client /140.211.11.196:64086
[junit4:junit4]   2> 588 T1519 oaz.ClientCnxn$SendThread.onConnected Session establishment complete on server localhost/127.0.0.1:38917, sessionid = 0x13c7223ca470003, negotiated timeout = 20000
[junit4:junit4]   2> 589 T1520 oascc.ConnectionManager.process Watcher org.apache.solr.common.cloud.ConnectionManager@68c5e32e name:ZooKeeperConnection Watcher:127.0.0.1:38917/solr got event WatchedEvent state:SyncConnected type:None path:null path:null type:None
[junit4:junit4]   2> 589 T1498 oascc.ConnectionManager.waitForConnected Client is connected to ZooKeeper
[junit4:junit4]   2> 591 T1503 oazs.PrepRequestProcessor.pRequest Got user-level KeeperException when processing sessionid:0x13c7223ca470003 type:create cxid:0x2 zxid:0x1a txntype:-1 reqpath:n/a Error Path:/solr/overseer Error:KeeperErrorCode = NodeExists for /solr/overseer
[junit4:junit4]   2> 593 T1498 oascc.SolrZkClient.makePath makePath: /live_nodes
[junit4:junit4]   2> 601 T1498 oasc.ZkController.createEphemeralLiveNode Register node as live in ZooKeeper:/live_nodes/127.0.0.1:41597_s%2Ft
[junit4:junit4]   2> 602 T1503 oazs.PrepRequestProcessor.pRequest Got user-level KeeperException when processing sessionid:0x13c7223ca470003 type:delete cxid:0x7 zxid:0x1c txntype:-1 reqpath:n/a Error Path:/solr/live_nodes/127.0.0.1:41597_s%2Ft Error:KeeperErrorCode = NoNode for /solr/live_nodes/127.0.0.1:41597_s%2Ft
[junit4:junit4]   2> 603 T1498 oascc.SolrZkClient.makePath makePath: /live_nodes/127.0.0.1:41597_s%2Ft
[junit4:junit4]   2> 606 T1498 oascc.SolrZkClient.makePath makePath: /overseer_elect/election
[junit4:junit4]   2> 617 T1503 oazs.PrepRequestProcessor.pRequest Got user-level KeeperException when processing sessionid:0x13c7223ca470003 type:delete cxid:0x15 zxid:0x21 txntype:-1 reqpath:n/a Error Path:/solr/overseer_elect/leader Error:KeeperErrorCode = NoNode for /solr/overseer_elect/leader
[junit4:junit4]   2> 626 T1498 oascc.SolrZkClient.makePath makePath: /overseer_elect/leader
[junit4:junit4]   2> 628 T1498 oasc.Overseer.start Overseer (id=89071590683639811-127.0.0.1:41597_s%2Ft-n_0000000000) starting
[junit4:junit4]   2> 629 T1503 oazs.PrepRequestProcessor.pRequest Got user-level KeeperException when processing sessionid:0x13c7223ca470003 type:create cxid:0x1a zxid:0x23 txntype:-1 reqpath:n/a Error Path:/solr/overseer Error:KeeperErrorCode = NodeExists for /solr/overseer
[junit4:junit4]   2> 630 T1503 oazs.PrepRequestProcessor.pRequest Got user-level KeeperException when processing sessionid:0x13c7223ca470003 type:create cxid:0x1b zxid:0x24 txntype:-1 reqpath:n/a Error Path:/solr/overseer Error:KeeperErrorCode = NodeExists for /solr/overseer
[junit4:junit4]   2> 632 T1503 oazs.PrepRequestProcessor.pRequest Got user-level KeeperException when processing sessionid:0x13c7223ca470003 type:create cxid:0x1c zxid:0x25 txntype:-1 reqpath:n/a Error Path:/solr/overseer Error:KeeperErrorCode = NodeExists for /solr/overseer
[junit4:junit4]   2> 642 T1503 oazs.PrepRequestProcessor.pRequest Got user-level KeeperException when processing sessionid:0x13c7223ca470003 type:create cxid:0x1d zxid:0x26 txntype:-1 reqpath:n/a Error Path:/solr/overseer Error:KeeperErrorCode = NodeExists for /solr/overseer
[junit4:junit4]   2> 643 T1522 oasc.OverseerCollectionProcessor.run Process current queue of collection messages
[junit4:junit4]   2> 644 T1498 oascc.SolrZkClient.makePath makePath: /clusterstate.json
[junit4:junit4]   2> 654 T1498 oascc.ZkStateReader.createClusterStateWatchersAndUpdate Updating cluster state from ZooKeeper... 
[junit4:junit4]   2> 656 T1521 oasc.Overseer$ClusterStateUpdater.run Starting to work on the main queue
[junit4:junit4]   2> 661 T1523 oasc.CoreContainer.create Creating SolrCore 'collection1' using instanceDir: /usr/home/hudson/hudson-slave/workspace/Lucene-Solr-Tests-trunk-Java6/solr/build/solr-core/test/J0/./org.apache.solr.cloud.SyncSliceTest-controljetty-1359124614004/collection1
[junit4:junit4]   2> 661 T1523 oasc.ZkController.createCollectionZkNode Check for collection zkNode:control_collection
[junit4:junit4]   2> 661 T1523 oasc.ZkController.createCollectionZkNode Collection zkNode exists
[junit4:junit4]   2> 662 T1523 oasc.ZkController.readConfigName Load collection config from:/collections/control_collection
[junit4:junit4]   2> 663 T1523 oasc.SolrResourceLoader.<init> new SolrResourceLoader for directory: '/usr/home/hudson/hudson-slave/workspace/Lucene-Solr-Tests-trunk-Java6/solr/build/solr-core/test/J0/./org.apache.solr.cloud.SyncSliceTest-controljetty-1359124614004/collection1/'
[junit4:junit4]   2> 664 T1523 oasc.SolrResourceLoader.replaceClassLoader Adding 'file:/usr/home/hudson/hudson-slave/workspace/Lucene-Solr-Tests-trunk-Java6/solr/build/solr-core/test/J0/org.apache.solr.cloud.SyncSliceTest-controljetty-1359124614004/collection1/lib/README' to classloader
[junit4:junit4]   2> 664 T1523 oasc.SolrResourceLoader.replaceClassLoader Adding 'file:/usr/home/hudson/hudson-slave/workspace/Lucene-Solr-Tests-trunk-Java6/solr/build/solr-core/test/J0/org.apache.solr.cloud.SyncSliceTest-controljetty-1359124614004/collection1/lib/classes/' to classloader
[junit4:junit4]   2> 714 T1523 oasc.SolrConfig.<init> Using Lucene MatchVersion: LUCENE_50
[junit4:junit4]   2> 788 T1523 oasc.SolrConfig.<init> Loaded SolrConfig: solrconfig.xml
[junit4:junit4]   2> 889 T1523 oass.IndexSchema.readSchema Reading Solr Schema
[junit4:junit4]   2> 894 T1523 oass.IndexSchema.readSchema Schema name=test
[junit4:junit4]   2> 1488 T1523 oass.OpenExchangeRatesOrgProvider.init Initialized with rates=open-exchange-rates.json, refreshInterval=1440.
[junit4:junit4]   2> 1498 T1523 oass.IndexSchema.readSchema default search field in schema is text
[junit4:junit4]   2> 1502 T1523 oass.IndexSchema.readSchema unique key field: id
[junit4:junit4]   2> 1515 T1523 oass.FileExchangeRateProvider.reload Reloading exchange rates from file currency.xml
[junit4:junit4]   2> 1519 T1523 oass.FileExchangeRateProvider.reload Reloading exchange rates from file currency.xml
[junit4:junit4]   2> 1524 T1523 oass.OpenExchangeRatesOrgProvider.reload Reloading exchange rates from open-exchange-rates.json
[junit4:junit4]   2> 1525 T1523 oass.OpenExchangeRatesOrgProvider.reload Reloading exchange rates from open-exchange-rates.json
[junit4:junit4]   2> 1526 T1523 oasc.SolrCore.<init> [collection1] Opening new SolrCore at /usr/home/hudson/hudson-slave/workspace/Lucene-Solr-Tests-trunk-Java6/solr/build/solr-core/test/J0/./org.apache.solr.cloud.SyncSliceTest-controljetty-1359124614004/collection1/, dataDir=./org.apache.solr.cloud.SyncSliceTest-1359124613698/control/data/
[junit4:junit4]   2> 1526 T1523 oasc.JmxMonitoredMap.<init> JMX monitoring is enabled. Adding Solr mbeans to JMX Server: com.sun.jmx.mbeanserver.JmxMBeanServer@10cbd8dc
[junit4:junit4]   2> 1527 T1523 oasc.SolrCore.initDirectoryFactory solr.NRTCachingDirectoryFactory
[junit4:junit4]   2> 1528 T1523 oasc.CachingDirectoryFactory.get return new directory for /usr/home/hudson/hudson-slave/workspace/Lucene-Solr-Tests-trunk-Java6/solr/build/solr-core/test/J0/./org.apache.solr.cloud.SyncSliceTest-1359124613698/control/data forceNew:false
[junit4:junit4]   2> 1529 T1523 oasc.CachingDirectoryFactory.close Releasing directory:/usr/home/hudson/hudson-slave/workspace/Lucene-Solr-Tests-trunk-Java6/solr/build/solr-core/test/J0/./org.apache.solr.cloud.SyncSliceTest-1359124613698/control/data
[junit4:junit4]   2> 1529 T1523 oasc.SolrCore.getNewIndexDir New index directory detected: old=null new=./org.apache.solr.cloud.SyncSliceTest-1359124613698/control/data/index/
[junit4:junit4]   2> 1530 T1523 oasc.SolrCore.initIndex WARNING [collection1] Solr index directory './org.apache.solr.cloud.SyncSliceTest-1359124613698/control/data/index' doesn't exist. Creating new index...
[junit4:junit4]   2> 1531 T1523 oasc.CachingDirectoryFactory.get return new directory for /usr/home/hudson/hudson-slave/workspace/Lucene-Solr-Tests-trunk-Java6/solr/build/solr-core/test/J0/./org.apache.solr.cloud.SyncSliceTest-1359124613698/control/data/index forceNew:false
[junit4:junit4]   2> 1537 T1523 oasc.SolrDeletionPolicy.onCommit SolrDeletionPolicy.onCommit: commits:num=1
[junit4:junit4]   2> 		commit{dir=RateLimitedDirectoryWrapper(NRTCachingDirectory(org.apache.lucene.store.NIOFSDirectory@/usr/home/hudson/hudson-slave/workspace/Lucene-Solr-Tests-trunk-Java6/solr/build/solr-core/test/J0/org.apache.solr.cloud.SyncSliceTest-1359124613698/control/data/index lockFactory=org.apache.lucene.store.NativeFSLockFactory@715750ed; maxCacheMB=48.0 maxMergeSizeMB=4.0)),segFN=segments_1,generation=1,filenames=[segments_1]
[junit4:junit4]   2> 1537 T1523 oasc.SolrDeletionPolicy.updateCommits newest commit = 1[segments_1]
[junit4:junit4]   2> 1538 T1523 oasc.CachingDirectoryFactory.close Releasing directory:/usr/home/hudson/hudson-slave/workspace/Lucene-Solr-Tests-trunk-Java6/solr/build/solr-core/test/J0/./org.apache.solr.cloud.SyncSliceTest-1359124613698/control/data/index
[junit4:junit4]   2> 1538 T1523 oasc.SolrCore.initWriters created xml: solr.XMLResponseWriter
[junit4:junit4]   2> 1540 T1523 oasup.UpdateRequestProcessorChain.init inserting DistributedUpdateProcessorFactory into updateRequestProcessorChain "dedupe"
[junit4:junit4]   2> 1540 T1523 oasup.UpdateRequestProcessorChain.init inserting DistributedUpdateProcessorFactory into updateRequestProcessorChain "dedupe-allfields"
[junit4:junit4]   2> 1540 T1523 oasup.UpdateRequestProcessorChain.init inserting DistributedUpdateProcessorFactory into updateRequestProcessorChain "stored_sig"
[junit4:junit4]   2> 1541 T1523 oasup.UpdateRequestProcessorChain.init inserting DistributedUpdateProcessorFactory into updateRequestProcessorChain "uniq-fields"
[junit4:junit4]   2> 1541 T1523 oasup.UpdateRequestProcessorChain.init inserting DistributedUpdateProcessorFactory into updateRequestProcessorChain "distrib-dup-test-chain-implicit"
[junit4:junit4]   2> 1541 T1523 oasc.RequestHandlers.initHandlersFromConfig adding lazy requestHandler: solr.ReplicationHandler
[junit4:junit4]   2> 1542 T1523 oasc.RequestHandlers.initHandlersFromConfig created /replication: solr.ReplicationHandler
[junit4:junit4]   2> 1542 T1523 oasc.RequestHandlers.initHandlersFromConfig created standard: solr.StandardRequestHandler
[junit4:junit4]   2> 1543 T1523 oasc.RequestHandlers.initHandlersFromConfig created /get: solr.RealTimeGetHandler
[junit4:junit4]   2> 1543 T1523 oasc.RequestHandlers.initHandlersFromConfig created dismax: solr.SearchHandler
[junit4:junit4]   2> 1543 T1523 oasc.RequestHandlers.initHandlersFromConfig created mock: org.apache.solr.core.MockQuerySenderListenerReqHandler
[junit4:junit4]   2> 1544 T1523 oasc.RequestHandlers.initHandlersFromConfig created /admin/: org.apache.solr.handler.admin.AdminHandlers
[junit4:junit4]   2> 1544 T1523 oasc.RequestHandlers.initHandlersFromConfig created defaults: solr.StandardRequestHandler
[junit4:junit4]   2> 1544 T1523 oasc.RequestHandlers.initHandlersFromConfig adding lazy requestHandler: solr.StandardRequestHandler
[junit4:junit4]   2> 1545 T1523 oasc.RequestHandlers.initHandlersFromConfig created lazy: solr.StandardRequestHandler
[junit4:junit4]   2> 1545 T1523 oasc.RequestHandlers.initHandlersFromConfig created /update: solr.UpdateRequestHandler
[junit4:junit4]   2> 1545 T1523 oasc.RequestHandlers.initHandlersFromConfig created /terms: org.apache.solr.handler.component.SearchHandler
[junit4:junit4]   2> 1546 T1523 oasc.RequestHandlers.initHandlersFromConfig created spellCheckCompRH: org.apache.solr.handler.component.SearchHandler
[junit4:junit4]   2> 1546 T1523 oasc.RequestHandlers.initHandlersFromConfig created spellCheckCompRH_Direct: org.apache.solr.handler.component.SearchHandler
[junit4:junit4]   2> 1547 T1523 oasc.RequestHandlers.initHandlersFromConfig created spellCheckWithWordbreak: org.apache.solr.handler.component.SearchHandler
[junit4:junit4]   2> 1547 T1523 oasc.RequestHandlers.initHandlersFromConfig created spellCheckWithWordbreak_Direct: org.apache.solr.handler.component.SearchHandler
[junit4:junit4]   2> 1547 T1523 oasc.RequestHandlers.initHandlersFromConfig created spellCheckCompRH1: org.apache.solr.handler.component.SearchHandler
[junit4:junit4]   2> 1548 T1523 oasc.RequestHandlers.initHandlersFromConfig created mltrh: org.apache.solr.handler.component.SearchHandler
[junit4:junit4]   2> 1548 T1523 oasc.RequestHandlers.initHandlersFromConfig created tvrh: org.apache.solr.handler.component.SearchHandler
[junit4:junit4]   2> 1548 T1523 oasc.RequestHandlers.initHandlersFromConfig created /mlt: solr.MoreLikeThisHandler
[junit4:junit4]   2> 1549 T1523 oasc.RequestHandlers.initHandlersFromConfig created /debug/dump: solr.DumpRequestHandler
[junit4:junit4]   2> 1556 T1523 oashl.XMLLoader.init xsltCacheLifetimeSeconds=60
[junit4:junit4]   2> 1560 T1523 oasc.SolrCore.initDeprecatedSupport WARNING solrconfig.xml uses deprecated <admin/gettableFiles>, Please update your config to use the ShowFileRequestHandler.
[junit4:junit4]   2> 1561 T1523 oasc.SolrCore.initDeprecatedSupport WARNING adding ShowFileRequestHandler with hidden files: [SCHEMA.XML, OLD_SYNONYMS.TXT, STOPWORDS.TXT, PROTWORDS.TXT, OPEN-EXCHANGE-RATES.JSON, SYNONYMS.TXT, CURRENCY.XML, MAPPING-ISOLATIN1ACCENT.TXT]
[junit4:junit4]   2> 1564 T1523 oasc.CachingDirectoryFactory.close Releasing directory:/usr/home/hudson/hudson-slave/workspace/Lucene-Solr-Tests-trunk-Java6/solr/build/solr-core/test/J0/./org.apache.solr.cloud.SyncSliceTest-1359124613698/control/data
[junit4:junit4]   2> 1566 T1523 oass.SolrIndexSearcher.<init> Opening Searcher@58dce838 main
[junit4:junit4]   2> 1567 T1523 oasu.CommitTracker.<init> Hard AutoCommit: disabled
[junit4:junit4]   2> 1567 T1523 oasu.CommitTracker.<init> Soft AutoCommit: disabled
[junit4:junit4]   2> 1567 T1523 oashc.SpellCheckComponent.inform Initializing spell checkers
[junit4:junit4]   2> 1583 T1523 oass.DirectSolrSpellChecker.init init: {name=direct,classname=DirectSolrSpellChecker,field=lowerfilt,minQueryLength=3}
[junit4:junit4]   2> 1631 T1524 oasc.SolrCore.registerSearcher [collection1] Registered new searcher Searcher@58dce838 main{StandardDirectoryReader(segments_1:1)}
[junit4:junit4]   2> 1635 T1523 oasc.ZkController.publish publishing core=collection1 state=down
[junit4:junit4]   2> 1635 T1523 oasc.ZkController.publish numShards not found on descriptor - reading it from system property
[junit4:junit4]   2> 1635 T1503 oazs.PrepRequestProcessor.pRequest Got user-level KeeperException when processing sessionid:0x13c7223ca470003 type:create cxid:0x50 zxid:0x29 txntype:-1 reqpath:n/a Error Path:/solr/overseer/queue Error:KeeperErrorCode = NoNode for /solr/overseer/queue
[junit4:junit4]   2> 2159 T1521 oascc.ZkStateReader.updateClusterState Updating cloud state from ZooKeeper... 
[junit4:junit4]   2> 2160 T1521 oasc.Overseer$ClusterStateUpdater.updateState Update state numShards=1 message={
[junit4:junit4]   2> 	  "operation":"state",
[junit4:junit4]   2> 	  "numShards":"1",
[junit4:junit4]   2> 	  "shard":null,
[junit4:junit4]   2> 	  "roles":null,
[junit4:junit4]   2> 	  "state":"down",
[junit4:junit4]   2> 	  "core":"collection1",
[junit4:junit4]   2> 	  "collection":"control_collection",
[junit4:junit4]   2> 	  "node_name":"127.0.0.1:41597_s%2Ft",
[junit4:junit4]   2> 	  "base_url":"http://127.0.0.1:41597/s/t"}
[junit4:junit4]   2> 2160 T1521 oasc.Overseer$ClusterStateUpdater.createCollection Create collection control_collection with numShards 1
[junit4:junit4]   2> 2160 T1521 oasc.Overseer$ClusterStateUpdater.updateState Assigning new node to shard shard=shard1
[junit4:junit4]   2> 2161 T1503 oazs.PrepRequestProcessor.pRequest Got user-level KeeperException when processing sessionid:0x13c7223ca470003 type:create cxid:0x58 zxid:0x2c txntype:-1 reqpath:n/a Error Path:/solr/overseer/queue-work Error:KeeperErrorCode = NoNode for /solr/overseer/queue-work
[junit4:junit4]   2> 2178 T1520 oascc.ZkStateReader$2.process A cluster state change: WatchedEvent state:SyncConnected type:NodeDataChanged path:/clusterstate.json, has occurred - updating... (live nodes size: 1)
[junit4:junit4]   2> 2647 T1523 oasc.CoreContainer.registerCore registering core: collection1
[junit4:junit4]   2> 2647 T1523 oasc.ZkController.register Register replica - core:collection1 address:http://127.0.0.1:41597/s/t collection:control_collection shard:shard1
[junit4:junit4]   2> 2648 T1523 oascc.SolrZkClient.makePath makePath: /collections/control_collection/leader_elect/shard1/election
[junit4:junit4]   2> 2664 T1503 oazs.PrepRequestProcessor.pRequest Got user-level KeeperException when processing sessionid:0x13c7223ca470003 type:delete cxid:0x72 zxid:0x36 txntype:-1 reqpath:n/a Error Path:/solr/collections/control_collection/leaders Error:KeeperErrorCode = NoNode for /solr/collections/control_collection/leaders
[junit4:junit4]   2> 2665 T1523 oasc.ShardLeaderElectionContext.runLeaderProcess Running the leader process.
[junit4:junit4]   2> 2665 T1503 oazs.PrepRequestProcessor.pRequest Got user-level KeeperException when processing sessionid:0x13c7223ca470003 type:create cxid:0x73 zxid:0x37 txntype:-1 reqpath:n/a Error Path:/solr/overseer Error:KeeperErrorCode = NodeExists for /solr/overseer
[junit4:junit4]   2> 2667 T1523 oasc.ShardLeaderElectionContext.waitForReplicasToComeUp Enough replicas found to continue.
[junit4:junit4]   2> 2667 T1523 oasc.ShardLeaderElectionContext.runLeaderProcess I may be the new leader - try and sync
[junit4:junit4]   2> 2668 T1523 oasc.SyncStrategy.sync Sync replicas to http://127.0.0.1:41597/s/t/collection1/
[junit4:junit4]   2> 2668 T1523 oasc.SyncStrategy.syncReplicas Sync Success - now sync replicas to me
[junit4:junit4]   2> 2668 T1523 oasc.SyncStrategy.syncToMe http://127.0.0.1:41597/s/t/collection1/ has no replicas
[junit4:junit4]   2> 2669 T1523 oasc.ShardLeaderElectionContext.runLeaderProcess I am the new leader: http://127.0.0.1:41597/s/t/collection1/
[junit4:junit4]   2> 2669 T1523 oascc.SolrZkClient.makePath makePath: /collections/control_collection/leaders/shard1
[junit4:junit4]   2> 2673 T1503 oazs.PrepRequestProcessor.pRequest Got user-level KeeperException when processing sessionid:0x13c7223ca470003 type:create cxid:0x7d zxid:0x3b txntype:-1 reqpath:n/a Error Path:/solr/overseer Error:KeeperErrorCode = NodeExists for /solr/overseer
[junit4:junit4]   2> 3682 T1521 oascc.ZkStateReader.updateClusterState Updating cloud state from ZooKeeper... 
[junit4:junit4]   2> 3875 T1520 oascc.ZkStateReader$2.process A cluster state change: WatchedEvent state:SyncConnected type:NodeDataChanged path:/clusterstate.json, has occurred - updating... (live nodes size: 1)
[junit4:junit4]   2> 3950 T1523 oasc.ZkController.register We are http://127.0.0.1:41597/s/t/collection1/ and leader is http://127.0.0.1:41597/s/t/collection1/
[junit4:junit4]   2> 3950 T1523 oasc.ZkController.register No LogReplay needed for core=collection1 baseURL=http://127.0.0.1:41597/s/t
[junit4:junit4]   2> 3950 T1523 oasc.ZkController.checkRecovery I am the leader, no recovery necessary
[junit4:junit4]   2> 3950 T1523 oasc.ZkController.publish publishing core=collection1 state=active
[junit4:junit4]   2> 3951 T1523 oasc.ZkController.publish numShards not found on descriptor - reading it from system property
[junit4:junit4]   2> 3952 T1523 oascc.ZkStateReader.updateClusterState Updating cloud state from ZooKeeper... 
[junit4:junit4]   2> 3953 T1498 oass.SolrDispatchFilter.init user.dir=/usr/home/hudson/hudson-slave/workspace/Lucene-Solr-Tests-trunk-Java6/solr/build/solr-core/test/J0
[junit4:junit4]   2> 3953 T1498 oass.SolrDispatchFilter.init SolrDispatchFilter.init() done
[junit4:junit4]   2> 3954 T1498 oascsi.HttpClientUtil.createClient Creating new http client, config:maxConnections=128&maxConnectionsPerHost=32&followRedirects=false
[junit4:junit4]   2> 3967 T1498 oascsi.HttpClientUtil.createClient Creating new http client, config:
[junit4:junit4]   2> 3977 T1498 oaz.ZooKeeper.<init> Initiating client connection, connectString=127.0.0.1:38917/solr sessionTimeout=10000 watcher=org.apache.solr.common.cloud.ConnectionManager@3bb4c0dd
[junit4:junit4]   2> 3978 T1498 oascc.ConnectionManager.waitForConnected Waiting for client to connect to ZooKeeper
[junit4:junit4]   2> 3978 T1525 oaz.ClientCnxn$SendThread.logStartConnect Opening socket connection to server localhost/127.0.0.1:38917. Will not attempt to authenticate using SASL (access denied (javax.security.auth.AuthPermission getLoginConfiguration))
[junit4:junit4]   2> 3978 T1525 oaz.ClientCnxn$SendThread.primeConnection Socket connection established to localhost/127.0.0.1:38917, initiating session
[junit4:junit4]   2> 3979 T1500 oazs.NIOServerCnxnFactory.run Accepted socket connection from /140.211.11.196:42592
[junit4:junit4]   2> 3979 T1500 oazs.ZooKeeperServer.processConnectRequest Client attempting to establish new session at /140.211.11.196:42592
[junit4:junit4]   2> 3980 T1502 oazs.ZooKeeperServer.finishSessionInit Established session 0x13c7223ca470004 with negotiated timeout 10000 for client /140.211.11.196:42592
[junit4:junit4]   2> 3980 T1525 oaz.ClientCnxn$SendThread.onConnected Session establishment complete on server localhost/127.0.0.1:38917, sessionid = 0x13c7223ca470004, negotiated timeout = 10000
[junit4:junit4]   2> 3981 T1526 oascc.ConnectionManager.process Watcher org.apache.solr.common.cloud.ConnectionManager@3bb4c0dd name:ZooKeeperConnection Watcher:127.0.0.1:38917/solr got event WatchedEvent state:SyncConnected type:None path:null path:null type:None
[junit4:junit4]   2> 3981 T1498 oascc.ConnectionManager.waitForConnected Client is connected to ZooKeeper
[junit4:junit4]   2> 3982 T1498 oascc.ZkStateReader.createClusterStateWatchersAndUpdate Updating cluster state from ZooKeeper... 
[junit4:junit4]   2> 3984 T1498 oasc.ChaosMonkey.monkeyLog monkey: init - expire sessions:true cause connection loss:true
[junit4:junit4]   2> 4134 T1498 oejs.Server.doStart jetty-8.1.8.v20121106
[junit4:junit4]   2> 4137 T1498 oejs.AbstractConnector.doStart Started SocketConnector@127.0.0.1:16126
[junit4:junit4]   2> 4137 T1498 oass.SolrDispatchFilter.init SolrDispatchFilter.init()
[junit4:junit4]   2> 4138 T1498 oasc.SolrResourceLoader.locateSolrHome JNDI not configured for solr (NoInitialContextEx)
[junit4:junit4]   2> 4138 T1498 oasc.SolrResourceLoader.locateSolrHome using system property solr.solr.home: /usr/home/hudson/hudson-slave/workspace/Lucene-Solr-Tests-trunk-Java6/solr/build/solr-core/test/J0/./org.apache.solr.cloud.SyncSliceTest-jetty1-1359124617677
[junit4:junit4]   2> 4138 T1498 oasc.CoreContainer$Initializer.initialize looking for solr.xml: /usr/home/hudson/hudson-slave/workspace/Lucene-Solr-Tests-trunk-Java6/solr/build/solr-core/test/J0/./org.apache.solr.cloud.SyncSliceTest-jetty1-1359124617677/solr.xml
[junit4:junit4]   2> 4139 T1498 oasc.CoreContainer.<init> New CoreContainer 1811070770
[junit4:junit4]   2> 4139 T1498 oasc.CoreContainer.load Loading CoreContainer using Solr Home: '/usr/home/hudson/hudson-slave/workspace/Lucene-Solr-Tests-trunk-Java6/solr/build/solr-core/test/J0/./org.apache.solr.cloud.SyncSliceTest-jetty1-1359124617677/'
[junit4:junit4]   2> 4140 T1498 oasc.SolrResourceLoader.<init> new SolrResourceLoader for directory: '/usr/home/hudson/hudson-slave/workspace/Lucene-Solr-Tests-trunk-Java6/solr/build/solr-core/test/J0/./org.apache.solr.cloud.SyncSliceTest-jetty1-1359124617677/'
[junit4:junit4]   2> 4178 T1498 oashc.HttpShardHandlerFactory.getParameter Setting socketTimeout to: 60000
[junit4:junit4]   2> 4178 T1498 oashc.HttpShardHandlerFactory.getParameter Setting urlScheme to: http://
[junit4:junit4]   2> 4179 T1498 oashc.HttpShardHandlerFactory.getParameter Setting connTimeout to: 15000
[junit4:junit4]   2> 4179 T1498 oashc.HttpShardHandlerFactory.getParameter Setting maxConnectionsPerHost to: 20
[junit4:junit4]   2> 4180 T1498 oashc.HttpShardHandlerFactory.getParameter Setting corePoolSize to: 0
[junit4:junit4]   2> 4180 T1498 oashc.HttpShardHandlerFactory.getParameter Setting maximumPoolSize to: 2147483647
[junit4:junit4]   2> 4180 T1498 oashc.HttpShardHandlerFactory.getParameter Setting maxThreadIdleTime to: 5
[junit4:junit4]   2> 4181 T1498 oashc.HttpShardHandlerFactory.getParameter Setting sizeOfQueue to: -1
[junit4:junit4]   2> 4181 T1498 oashc.HttpShardHandlerFactory.getParameter Setting fairnessPolicy to: false
[junit4:junit4]   2> 4182 T1498 oascsi.HttpClientUtil.createClient Creating new http client, config:maxConnectionsPerHost=20&maxConnections=10000&socketTimeout=60000&connTimeout=15000&retry=false
[junit4:junit4]   2> 4202 T1498 oasc.CoreContainer.load Registering Log Listener
[junit4:junit4]   2> 4220 T1498 oasc.CoreContainer.initZooKeeper Zookeeper client=127.0.0.1:38917/solr
[junit4:junit4]   2> 4221 T1498 oasc.ZkController.checkChrootPath zkHost includes chroot
[junit4:junit4]   2> 4221 T1498 oaz.ZooKeeper.<init> Initiating client connection, connectString=127.0.0.1:38917 sessionTimeout=60000 watcher=org.apache.solr.common.cloud.ConnectionManager@20d65585
[junit4:junit4]   2> 4222 T1498 oascc.ConnectionManager.waitForConnected Waiting for client to connect to ZooKeeper
[junit4:junit4]   2> 4223 T1536 oaz.ClientCnxn$SendThread.logStartConnect Opening socket connection to server localhost/127.0.0.1:38917. Will not attempt to authenticate using SASL (access denied (javax.security.auth.AuthPermission getLoginConfiguration))
[junit4:junit4]   2> 4224 T1536 oaz.ClientCnxn$SendThread.primeConnection Socket connection established to localhost/127.0.0.1:38917, initiating session
[junit4:junit4]   2> 4224 T1500 oazs.NIOServerCnxnFactory.run Accepted socket connection from /140.211.11.196:46663
[junit4:junit4]   2> 4224 T1500 oazs.ZooKeeperServer.processConnectRequest Client attempting to establish new session at /140.211.11.196:46663
[junit4:junit4]   2> 4229 T1502 oazs.ZooKeeperServer.finishSessionInit Established session 0x13c7223ca470005 with negotiated timeout 20000 for client /140.211.11.196:46663
[junit4:junit4]   2> 4229 T1536 oaz.ClientCnxn$SendThread.onConnected Session establishment complete on server localhost/127.0.0.1:38917, sessionid = 0x13c7223ca470005, negotiated timeout = 20000
[junit4:junit4]   2> 4230 T1537 oascc.ConnectionManager.process Watcher org.apache.solr.common.cloud.ConnectionManager@20d65585 name:ZooKeeperConnection Watcher:127.0.0.1:38917 got event WatchedEvent state:SyncConnected type:None path:null path:null type:None
[junit4:junit4]   2> 4230 T1498 oascc.ConnectionManager.waitForConnected Client is connected to ZooKeeper
[junit4:junit4]   2> 4231 T1503 oazs.PrepRequestProcessor.pRequest2Txn Processed session termination for sessionid: 0x13c7223ca470005
[junit4:junit4]   2> 4233 T1537 oaz.ClientCnxn$EventThread.run EventThread shut down
[junit4:junit4]   2> 4233 T1500 oazs.NIOServerCnxn.closeSock Closed socket connection for client /140.211.11.196:46663 which had sessionid 0x13c7223ca470005
[junit4:junit4]   2> 4233 T1498 oaz.ZooKeeper.close Session: 0x13c7223ca470005 closed
[junit4:junit4]   2> 4233 T1498 oascsi.HttpClientUtil.createClient Creating new http client, config:maxConnections=500&maxConnectionsPerHost=16&socketTimeout=60000&connTimeout=15000
[junit4:junit4]   2> 4244 T1498 oaz.ZooKeeper.<init> Initiating client connection, connectString=127.0.0.1:38917/solr sessionTimeout=30000 watcher=org.apache.solr.common.cloud.ConnectionManager@19ee657
[junit4:junit4]   2> 4245 T1498 oascc.ConnectionManager.waitForConnected Waiting for client to connect to ZooKeeper
[junit4:junit4]   2> 4245 T1538 oaz.ClientCnxn$SendThread.logStartConnect Opening socket connection to server localhost/127.0.0.1:38917. Will not attempt to authenticate using SASL (access denied (javax.security.auth.AuthPermission getLoginConfiguration))
[junit4:junit4]   2> 4246 T1538 oaz.ClientCnxn$SendThread.primeConnection Socket connection established to localhost/127.0.0.1:38917, initiating session
[junit4:junit4]   2> 4246 T1500 oazs.NIOServerCnxnFactory.run Accepted socket connection from /140.211.11.196:30705
[junit4:junit4]   2> 4246 T1500 oazs.ZooKeeperServer.processConnectRequest Client attempting to establish new session at /140.211.11.196:30705
[junit4:junit4]   2> 4248 T1502 oazs.ZooKeeperServer.finishSessionInit Established session 0x13c7223ca470006 with negotiated timeout 20000 for client /140.211.11.196:30705
[junit4:junit4]   2> 4248 T1538 oaz.ClientCnxn$SendThread.onConnected Session establishment complete on server localhost/127.0.0.1:38917, sessionid = 0x13c7223ca470006, negotiated timeout = 20000
[junit4:junit4]   2> 4248 T1539 oascc.ConnectionManager.process Watcher org.apache.solr.common.cloud.ConnectionManager@19ee657 name:ZooKeeperConnection Watcher:127.0.0.1:38917/solr got event WatchedEvent state:SyncConnected type:None path:null path:null type:None
[junit4:junit4]   2> 4248 T1498 oascc.ConnectionManager.waitForConnected Client is connected to ZooKeeper
[junit4:junit4]   2> 4249 T1503 oazs.PrepRequestProcessor.pRequest Got user-level KeeperException when processing sessionid:0x13c7223ca470006 type:create cxid:0x1 zxid:0x49 txntype:-1 reqpath:n/a Error Path:/solr/overseer Error:KeeperErrorCode = NodeExists for /solr/overseer
[junit4:junit4]   2> 4251 T1503 oazs.PrepRequestProcessor.pRequest Got user-level KeeperException when processing sessionid:0x13c7223ca470006 type:create cxid:0x2 zxid:0x4a txntype:-1 reqpath:n/a Error Path:/solr/overseer Error:KeeperErrorCode = NodeExists for /solr/overseer
[junit4:junit4]   2> 4259 T1498 oasc.ZkController.createEphemeralLiveNode Register node as live in ZooKeeper:/live_nodes/127.0.0.1:16126_s%2Ft
[junit4:junit4]   2> 4260 T1503 oazs.PrepRequestProcessor.pRequest Got user-level KeeperException when processing sessionid:0x13c7223ca470006 type:delete cxid:0x4 zxid:0x4b txntype:-1 reqpath:n/a Error Path:/solr/live_nodes/127.0.0.1:16126_s%2Ft Error:KeeperErrorCode = NoNode for /solr/live_nodes/127.0.0.1:16126_s%2Ft
[junit4:junit4]   2> 4261 T1498 oascc.SolrZkClient.makePath makePath: /live_nodes/127.0.0.1:16126_s%2Ft
[junit4:junit4]   2> 4264 T1526 oascc.ZkStateReader$3.process Updating live nodes... (2)
[junit4:junit4]   2> 4264 T1520 oascc.ZkStateReader$3.process Updating live nodes... (2)
[junit4:junit4]   2> 4265 T1520 oascc.ZkStateReader$2.process A cluster state change: WatchedEvent state:SyncConnected type:NodeChildrenChanged path:/live_nodes, has occurred - updating... (live nodes size: 2)
[junit4:junit4]   2> 4272 T1498 oascc.ZkStateReader.createClusterStateWatchersAndUpdate Updating cluster state from ZooKeeper... 
[junit4:junit4]   2> 4279 T1540 oasc.CoreContainer.create Creating SolrCore 'collection1' using instanceDir: /usr/home/hudson/hudson-slave/workspace/Lucene-Solr-Tests-trunk-Java6/solr/build/solr-core/test/J0/./org.apache.solr.cloud.SyncSliceTest-jetty1-1359124617677/collection1
[junit4:junit4]   2> 4279 T1540 oasc.ZkController.createCollectionZkNode Check for collection zkNode:collection1
[junit4:junit4]   2> 4280 T1540 oasc.ZkController.createCollectionZkNode Collection zkNode exists
[junit4:junit4]   2> 4280 T1540 oasc.ZkController.readConfigName Load collection config from:/collections/collection1
[junit4:junit4]   2> 4281 T1540 oasc.SolrResourceLoader.<init> new SolrResourceLoader for directory: '/usr/home/hudson/hudson-slave/workspace/Lucene-Solr-Tests-trunk-Java6/solr/build/solr-core/test/J0/./org.apache.solr.cloud.SyncSliceTest-jetty1-1359124617677/collection1/'
[junit4:junit4]   2> 4282 T1540 oasc.SolrResourceLoader.replaceClassLoader Adding 'file:/usr/home/hudson/hudson-slave/workspace/Lucene-Solr-Tests-trunk-Java6/solr/build/solr-core/test/J0/org.apache.solr.cloud.SyncSliceTest-jetty1-1359124617677/collection1/lib/README' to classloader
[junit4:junit4]   2> 4283 T1540 oasc.SolrResourceLoader.replaceClassLoader Adding 'file:/usr/home/hudson/hudson-slave/workspace/Lucene-Solr-Tests-trunk-Java6/solr/build/solr-core/test/J0/org.apache.solr.cloud.SyncSliceTest-jetty1-1359124617677/collection1/lib/classes/' to classloader
[junit4:junit4]   2> 4336 T1540 oasc.SolrConfig.<init> Using Lucene MatchVersion: LUCENE_50
[junit4:junit4]   2> 4408 T1540 oasc.SolrConfig.<init> Loaded SolrConfig: solrconfig.xml
[junit4:junit4]   2> 4509 T1540 oass.IndexSchema.readSchema Reading Solr Schema
[junit4:junit4]   2> 4515 T1540 oass.IndexSchema.readSchema Schema name=test
[junit4:junit4]   2> 5143 T1540 oass.OpenExchangeRatesOrgProvider.init Initialized with rates=open-exchange-rates.json, refreshInterval=1440.
[junit4:junit4]   2> 5154 T1540 oass.IndexSchema.readSchema default search field in schema is text
[junit4:junit4]   2> 5158 T1540 oass.IndexSchema.readSchema unique key field: id
[junit4:junit4]   2> 5237 T1540 oass.FileExchangeRateProvider.reload Reloading exchange rates from file currency.xml
[junit4:junit4]   2> 5242 T1540 oass.FileExchangeRateProvider.reload Reloading exchange rates from file currency.xml
[junit4:junit4]   2> 5246 T1540 oass.OpenExchangeRatesOrgProvider.reload Reloading exchange rates from open-exchange-rates.json
[junit4:junit4]   2> 5247 T1540 oass.OpenExchangeRatesOrgProvider.reload Reloading exchange rates from open-exchange-rates.json
[junit4:junit4]   2> 5248 T1540 oasc.SolrCore.<init> [collection1] Opening new SolrCore at /usr/home/hudson/hudson-slave/workspace/Lucene-Solr-Tests-trunk-Java6/solr/build/solr-core/test/J0/./org.apache.solr.cloud.SyncSliceTest-jetty1-1359124617677/collection1/, dataDir=./org.apache.solr.cloud.SyncSliceTest-1359124613698/jetty1/
[junit4:junit4]   2> 5249 T1540 oasc.JmxMonitoredMap.<init> JMX monitoring is enabled. Adding Solr mbeans to JMX Server: com.sun.jmx.mbeanserver.JmxMBeanServer@10cbd8dc
[junit4:junit4]   2> 5249 T1540 oasc.SolrCore.initDirectoryFactory solr.NRTCachingDirectoryFactory
[junit4:junit4]   2> 5250 T1540 oasc.CachingDirectoryFactory.get return new directory for /usr/home/hudson/hudson-slave/workspace/Lucene-Solr-Tests-trunk-Java6/solr/build/solr-core/test/J0/./org.apache.solr.cloud.SyncSliceTest-1359124613698/jetty1 forceNew:false
[junit4:junit4]   2> 5250 T1540 oasc.CachingDirectoryFactory.close Releasing directory:/usr/home/hudson/hudson-slave/workspace/Lucene-Solr-Tests-trunk-Java6/solr/build/solr-core/test/J0/./org.apache.solr.cloud.SyncSliceTest-1359124613698/jetty1
[junit4:junit4]   2> 5251 T1540 oasc.SolrCore.getNewIndexDir New index directory detected: old=null new=./org.apache.solr.cloud.SyncSliceTest-1359124613698/jetty1/index/
[junit4:junit4]   2> 5251 T1540 oasc.SolrCore.initIndex WARNING [collection1] Solr index directory './org.apache.solr.cloud.SyncSliceTest-1359124613698/jetty1/index' doesn't exist. Creating new index...
[junit4:junit4]   2> 5252 T1540 oasc.CachingDirectoryFactory.get return new directory for /usr/home/hudson/hudson-slave/workspace/Lucene-Solr-Tests-trunk-Java6/solr/build/solr-core/test/J0/./org.apache.solr.cloud.SyncSliceTest-1359124613698/jetty1/index forceNew:false
[junit4:junit4]   2> 5285 T1540 oasc.SolrDeletionPolicy.onCommit SolrDeletionPolicy.onCommit: commits:num=1
[junit4:junit4]   2> 		commit{dir=RateLimitedDirectoryWrapper(NRTCachingDirectory(org.apache.lucene.store.NIOFSDirectory@/usr/home/hudson/hudson-slave/workspace/Lucene-Solr-Tests-trunk-Java6/solr/build/solr-core/test/J0/org.apache.solr.cloud.SyncSliceTest-1359124613698/jetty1/index lockFactory=org.apache.lucene.store.NativeFSLockFactory@46214457; maxCacheMB=48.0 maxMergeSizeMB=4.0)),segFN=segments_1,generation=1,filenames=[segments_1]
[junit4:junit4]   2> 5285 T1540 oasc.SolrDeletionPolicy.updateCommits newest commit = 1[segments_1]
[junit4:junit4]   2> 5286 T1540 oasc.CachingDirectoryFactory.close Releasing directory:/usr/home/hudson/hudson-slave/workspace/Lucene-Solr-Tests-trunk-Java6/solr/build/solr-core/test/J0/./org.apache.solr.cloud.SyncSliceTest-1359124613698/jetty1/index
[junit4:junit4]   2> 5286 T1540 oasc.SolrCore.initWriters created xml: solr.XMLResponseWriter
[junit4:junit4]   2> 5288 T1540 oasup.UpdateRequestProcessorChain.init inserting DistributedUpdateProcessorFactory into updateRequestProcessorChain "dedupe"
[junit4:junit4]   2> 5288 T1540 oasup.UpdateRequestProcessorChain.init inserting DistributedUpdateProcessorFactory into updateRequestProcessorChain "dedupe-allfields"
[junit4:junit4]   2> 5288 T1540 oasup.UpdateRequestProcessorChain.init inserting DistributedUpdateProcessorFactory into updateRequestProcessorChain "stored_sig"
[junit4:junit4]   2> 5288 T1540 oasup.UpdateRequestProcessorChain.init inserting DistributedUpdateProcessorFactory into updateRequestProcessorChain "uniq-fields"
[junit4:junit4]   2> 5289 T1540 oasup.UpdateRequestProcessorChain.init inserting DistributedUpdateProcessorFactory into updateRequestProcessorChain "distrib-dup-test-chain-implicit"
[junit4:junit4]   2> 5289 T1540 oasc.RequestHandlers.initHandlersFromConfig adding lazy requestHandler: solr.ReplicationHandler
[junit4:junit4]   2> 5289 T1540 oasc.RequestHandlers.initHandlersFromConfig created /replication: solr.ReplicationHandler
[junit4:junit4]   2> 5290 T1540 oasc.RequestHandlers.initHandlersFromConfig created standard: solr.StandardRequestHandler
[junit4:junit4]   2> 5290 T1540 oasc.RequestHandlers.initHandlersFromConfig created /get: solr.RealTimeGetHandler
[junit4:junit4]   2> 5291 T1540 oasc.RequestHandlers.initHandlersFromConfig created dismax: solr.SearchHandler
[junit4:junit4]   2> 5291 T1540 oasc.RequestHandlers.initHandlersFromConfig created mock: org.apache.solr.core.MockQuerySenderListenerReqHandler
[junit4:junit4]   2> 5292 T1540 oasc.RequestHandlers.initHandlersFromConfig created /admin/: org.apache.solr.handler.admin.AdminHandlers
[junit4:junit4]   2> 5292 T1540 oasc.RequestHandlers.initHandlersFromConfig created defaults: solr.StandardRequestHandler
[junit4:junit4]   2> 5292 T1540 oasc.RequestHandlers.initHandlersFromConfig adding lazy requestHandler: solr.StandardRequestHandler
[junit4:junit4]   2> 5293 T1540 oasc.RequestHandlers.initHandlersFromConfig created lazy: solr.StandardRequestHandler
[junit4:junit4]   2> 5293 T1540 oasc.RequestHandlers.initHandlersFromConfig created /update: solr.UpdateRequestHandler
[junit4:junit4]   2> 5293 T1540 oasc.RequestHandlers.initHandlersFromConfig created /terms: org.apache.solr.handler.component.SearchHandler
[junit4:junit4]   2> 5294 T1540 oasc.RequestHandlers.initHandlersFromConfig created spellCheckCompRH: org.apache.solr.handler.component.SearchHandler
[junit4:junit4]   2> 5294 T1540 oasc.RequestHandlers.initHandlersFromConfig created spellCheckCompRH_Direct: org.apache.solr.handler.component.SearchHandler
[junit4:junit4]   2> 5295 T1540 oasc.RequestHandlers.initHandlersFromConfig created spellCheckWithWordbreak: org.apache.solr.handler.component.SearchHandler
[junit4:junit4]   2> 5295 T1540 oasc.RequestHandlers.initHandlersFromConfig created spellCheckWithWordbreak_Direct: org.apache.solr.handler.component.SearchHandler
[junit4:junit4]   2> 5295 T1540 oasc.RequestHandlers.initHandlersFromConfig created spellCheckCompRH1: org.apache.solr.handler.component.SearchHandler
[junit4:junit4]   2> 5296 T1540 oasc.RequestHandlers.initHandlersFromConfig created mltrh: org.apache.solr.handler.component.SearchHandler
[junit4:junit4]   2> 5296 T1540 oasc.RequestHandlers.initHandlersFromConfig created tvrh: org.apache.solr.handler.component.SearchHandler
[junit4:junit4]   2> 5297 T1540 oasc.RequestHandlers.initHandlersFromConfig created /mlt: solr.MoreLikeThisHandler
[junit4:junit4]   2> 5297 T1540 oasc.RequestHandlers.initHandlersFromConfig created /debug/dump: solr.DumpRequestHandler
[junit4:junit4]   2> 5304 T1540 oashl.XMLLoader.init xsltCacheLifetimeSeconds=60
[junit4:junit4]   2> 5308 T1540 oasc.SolrCore.initDeprecatedSupport WARNING solrconfig.xml uses deprecated <admin/gettableFiles>, Please update your config to use the ShowFileRequestHandler.
[junit4:junit4]   2> 5310 T1540 oasc.SolrCore.initDeprecatedSupport WARNING adding ShowFileRequestHandler with hidden files: [SCHEMA.XML, OLD_SYNONYMS.TXT, STOPWORDS.TXT, PROTWORDS.TXT, OPEN-EXCHANGE-RATES.JSON, SYNONYMS.TXT, CURRENCY.XML, MAPPING-ISOLATIN1ACCENT.TXT]
[junit4:junit4]   2> 5312 T1540 oasc.CachingDirectoryFactory.close Releasing directory:/usr/home/hudson/hudson-slave/workspace/Lucene-Solr-Tests-trunk-Java6/solr/build/solr-core/test/J0/./org.apache.solr.cloud.SyncSliceTest-1359124613698/jetty1
[junit4:junit4]   2> 5314 T1540 oass.SolrIndexSearcher.<init> Opening Searcher@20f8f1af main
[junit4:junit4]   2> 5315 T1540 oasu.CommitTracker.<init> Hard AutoCommit: disabled
[junit4:junit4]   2> 5315 T1540 oasu.CommitTracker.<init> Soft AutoCommit: disabled
[junit4:junit4]   2> 5315 T1540 oashc.SpellCheckComponent.inform Initializing spell checkers
[junit4:junit4]   2> 5322 T1540 oass.DirectSolrSpellChecker.init init: {name=direct,classname=DirectSolrSpellChecker,field=lowerfilt,minQueryLength=3}
[junit4:junit4]   2> 5370 T1541 oasc.SolrCore.registerSearcher [collection1] Registered new searcher Searcher@20f8f1af main{StandardDirectoryReader(segments_1:1)}
[junit4:junit4]   2> 5374 T1540 oasc.ZkController.publish publishing core=collection1 state=down
[junit4:junit4]   2> 5374 T1540 oasc.ZkController.publish numShards not found on descriptor - reading it from system property
[junit4:junit4]   2> 5433 T1521 oascc.ZkStateReader.updateClusterState Updating cloud state from ZooKeeper... 
[junit4:junit4]   2> 5434 T1521 oasc.Overseer$ClusterStateUpdater.updateState Update state numShards=1 message={
[junit4:junit4]   2> 	  "operation":"state",
[junit4:junit4]   2> 	  "numShards":"1",
[junit4:junit4]   2> 	  "shard":"shard1",
[junit4:junit4]   2> 	  "roles":null,
[junit4:junit4]   2> 	  "state":"active",
[junit4:junit4]   2> 	  "core":"collection1",
[junit4:junit4]   2> 	  "collection":"control_collection",
[junit4:junit4]   2> 	  "node_name":"127.0.0.1:41597_s%2Ft",
[junit4:junit4]   2> 	  "base_url":"http://127.0.0.1:41597/s/t"}
[junit4:junit4]   2> 5437 T1521 oasc.Overseer$ClusterStateUpdater.updateState Update state numShards=1 message={
[junit4:junit4]   2> 	  "operation":"state",
[junit4:junit4]   2> 	  "numShards":"1",
[junit4:junit4]   2> 	  "shard":null,
[junit4:junit4]   2> 	  "roles":null,
[junit4:junit4]   2> 	  "state":"down",
[junit4:junit4]   2> 	  "core":"collection1",
[junit4:junit4]   2> 	  "collection":"collection1",
[junit4:junit4]   2> 	  "node_name":"127.0.0.1:16126_s%2Ft",
[junit4:junit4]   2> 	  "base_url":"http://127.0.0.1:16126/s/t"}
[junit4:junit4]   2> 5437 T1521 oasc.Overseer$ClusterStateUpdater.createCollection Create collection collection1 with numShards 1
[junit4:junit4]   2> 5437 T1521 oasc.Overseer$ClusterStateUpdater.updateState Assigning new node to shard shard=shard1
[junit4:junit4]   2> 5450 T1539 oascc.ZkStateReader$2.process A cluster state change: WatchedEvent state:SyncConnected type:NodeDataChanged path:/clusterstate.json, has occurred - updating... (live nodes size: 2)
[junit4:junit4]   2> 5450 T1526 oascc.ZkStateReader$2.process A cluster state change: WatchedEvent state:SyncConnected type:NodeDataChanged path:/clusterstate.json, has occurred - updating... (live nodes size: 2)
[junit4:junit4]   2> 5450 T1520 oascc.ZkStateReader$2.process A cluster state change: WatchedEvent state:SyncConnected type:NodeDataChanged path:/clusterstate.json, has occurred - updating... (live nodes size: 2)
[junit4:junit4]   2> 6376 T1540 oasc.CoreContainer.registerCore registering core: collection1
[junit4:junit4]   2> 6376 T1540 oasc.ZkController.register Register replica - core:collection1 address:http://127.0.0.1:16126/s/t collection:collection1 shard:shard1
[junit4:junit4]   2> 6377 T1540 oascc.SolrZkClient.makePath makePath: /collections/collection1/leader_elect/shard1/election
[junit4:junit4]   2> 6394 T1503 oazs.PrepRequestProcessor.pRequest Got user-level KeeperException when processing sessionid:0x13c7223ca470006 type:delete cxid:0x43 zxid:0x5a txntype:-1 reqpath:n/a Error Path:/solr/collections/collection1/leaders Error:KeeperErrorCode = NoNode for /solr/collections/collection1/leaders
[junit4:junit4]   2> 6395 T1540 oasc.ShardLeaderElectionContext.runLeaderProcess Running the leader process.
[junit4:junit4]   2> 6396 T1503 oazs.PrepRequestProcessor.pRequest Got user-level KeeperException when processing sessionid:0x13c7223ca470006 type:create cxid:0x44 zxid:0x5b txntype:-1 reqpath:n/a Error Path:/solr/overseer Error:KeeperErrorCode = NodeExists for /solr/overseer
[junit4:junit4]   2> 6398 T1540 oasc.ShardLeaderElectionContext.waitForReplicasToComeUp Enough replicas found to continue.
[junit4:junit4]   2> 6398 T1540 oasc.ShardLeaderElectionContext.runLeaderProcess I may be the new leader - try and sync
[junit4:junit4]   2> 6398 T1540 oasc.SyncStrategy.sync Sync replicas to http://127.0.0.1:16126/s/t/collection1/
[junit4:junit4]   2> 6398 T1540 oasc.SyncStrategy.syncReplicas Sync Success - now sync replicas to me
[junit4:junit4]   2> 6398 T1540 oasc.SyncStrategy.syncToMe http://127.0.0.1:16126/s/t/collection1/ has no replicas
[junit4:junit4]   2> 6399 T1540 oasc.ShardLeaderElectionContext.runLeaderProcess I am the new leader: http://127.0.0.1:16126/s/t/collection1/
[junit4:junit4]   2> 6399 T1540 oascc.SolrZkClient.makePath makePath: /collections/collection1/leaders/shard1
[junit4:junit4]   2> 6402 T1503 oazs.PrepRequestProcessor.pRequest Got user-level KeeperException when processing sessionid:0x13c7223ca470006 type:create cxid:0x4e zxid:0x5f txntype:-1 reqpath:n/a Error Path:/solr/overseer Error:KeeperErrorCode = NodeExists for /solr/overseer
[junit4:junit4]   2> 6963 T1521 oascc.ZkStateReader.updateClusterState Updating cloud state from ZooKeeper... 
[junit4:junit4]   2> 6982 T1526 oascc.ZkStateReader$2.process A cluster state change: WatchedEvent state:SyncConnected type:NodeDataChanged path:/clusterstate.json, has occurred - updating... (live nodes size: 2)
[junit4:junit4]   2> 6982 T1520 oascc.ZkStateReader$2.process A cluster state change: WatchedEvent state:SyncConnected type:NodeDataChanged path:/clusterstate.json, has occurred - updating... (live nodes size: 2)
[junit4:junit4]   2> 6982 T1539 oascc.ZkStateReader$2.process A cluster state change: WatchedEvent state:SyncConnected type:NodeDataChanged path:/clusterstate.json, has occurred - updating... (live nodes size: 2)
[junit4:junit4]   2> 7016 T1540 oasc.ZkController.register We are http://127.0.0.1:16126/s/t/collection1/ and leader is http://127.0.0.1:16126/s/t/collection1/
[junit4:junit4]   2> 7016 T1540 oasc.ZkController.register No LogReplay needed for core=collection1 baseURL=http://127.0.0.1:16126/s/t
[junit4:junit4]   2> 7016 T1540 oasc.ZkController.checkRecovery I am the leader, no recovery necessary
[junit4:junit4]   2> 7016 T1540 oasc.ZkController.publish publishing core=collection1 state=active
[junit4:junit4]   2> 7017 T1540 oasc.ZkController.publish numShards not found on descriptor - reading it from system property
[junit4:junit4]   2> 7018 T1540 oascc.ZkStateReader.updateClusterState Updating cloud state from ZooKeeper... 
[junit4:junit4]   2> 7019 T1498 oass.SolrDispatchFilter.init user.dir=/usr/home/hudson/hudson-slave/workspace/Lucene-Solr-Tests-trunk-Java6/solr/build/solr-core/test/J0
[junit4:junit4]   2> 7020 T1498 oass.SolrDispatchFilter.init SolrDispatchFilter.init() done
[junit4:junit4]   2> 7020 T1498 oascsi.HttpClientUtil.createClient Creating new http client, config:maxConnections=128&maxConnectionsPerHost=32&followRedirects=false
[junit4:junit4]   2> 7193 T1498 oejs.Server.doStart jetty-8.1.8.v20121106
[junit4:junit4]   2> 7196 T1498 oejs.AbstractConnector.doStart Started SocketConnector@127.0.0.1:59228
[junit4:junit4]   2> 7197 T1498 oass.SolrDispatchFilter.init SolrDispatchFilter.init()
[junit4:junit4]   2> 7197 T1498 oasc.SolrResourceLoader.locateSolrHome JNDI not configured for solr (NoInitialContextEx)
[junit4:junit4]   2> 7197 T1498 oasc.SolrResourceLoader.locateSolrHome using system property solr.solr.home: /usr/home/hudson/hudson-slave/workspace/Lucene-Solr-Tests-trunk-Java6/solr/build/solr-core/test/J0/./org.apache.solr.cloud.SyncSliceTest-jetty2-1359124620727
[junit4:junit4]   2> 7197 T1498 oasc.CoreContainer$Initializer.initialize looking for solr.xml: /usr/home/hudson/hudson-slave/workspace/Lucene-Solr-Tests-trunk-Java6/solr/build/solr-core/test/J0/./org.apache.solr.cloud.SyncSliceTest-jetty2-1359124620727/solr.xml
[junit4:junit4]   2> 7198 T1498 oasc.CoreContainer.<init> New CoreContainer 689665327
[junit4:junit4]   2> 7198 T1498 oasc.CoreContainer.load Loading CoreContainer using Solr Home: '/usr/home/hudson/hudson-slave/workspace/Lucene-Solr-Tests-trunk-Java6/solr/build/solr-core/test/J0/./org.apache.solr.cloud.SyncSliceTest-jetty2-1359124620727/'
[junit4:junit4]   2> 7198 T1498 oasc.SolrResourceLoader.<init> new SolrResourceLoader for directory: '/usr/home/hudson/hudson-slave/workspace/Lucene-Solr-Tests-trunk-Java6/solr/build/solr-core/test/J0/./org.apache.solr.cloud.SyncSliceTest-jetty2-1359124620727/'
[junit4:junit4]   2> 7227 T1498 oashc.HttpShardHandlerFactory.getParameter Setting socketTimeout to: 60000
[junit4:junit4]   2> 7228 T1498 oashc.HttpShardHandlerFactory.getParameter Setting urlScheme to: http://
[junit4:junit4]   2> 7228 T1498 oashc.HttpShardHandlerFactory.getParameter Setting connTimeout to: 15000
[junit4:junit4]   2> 7228 T1498 oashc.HttpShardHandlerFactory.getParameter Setting maxConnectionsPerHost to: 20
[junit4:junit4]   2> 7228 T1498 oashc.HttpShardHandlerFactory.getParameter Setting corePoolSize to: 0
[junit4:junit4]   2> 7229 T1498 oashc.HttpShardHandlerFactory.getParameter Setting maximumPoolSize to: 2147483647
[junit4:junit4]   2> 7229 T1498 oashc.HttpShardHandlerFactory.getParameter Setting maxThreadIdleTime to: 5
[junit4:junit4]   2> 7229 T1498 oashc.HttpShardHandlerFactory.getParameter Setting sizeOfQueue to: -1
[junit4:junit4]   2> 7230 T1498 oashc.HttpShardHandlerFactory.getParameter Setting fairnessPolicy to: false
[junit4:junit4]   2> 7230 T1498 oascsi.HttpClientUtil.createClient Creating new http client, config:maxConnectionsPerHost=20&maxConnections=10000&socketTimeout=60000&connTimeout=15000&retry=false
[junit4:junit4]   2> 7243 T1498 oasc.CoreContainer.load Registering Log Listener
[junit4:junit4]   2> 7255 T1498 oasc.CoreContainer.initZooKeeper Zookeeper client=127.0.0.1:38917/solr
[junit4:junit4]   2> 7256 T1498 oasc.ZkController.checkChrootPath zkHost includes chroot
[junit4:junit4]   2> 7256 T1498 oaz.ZooKeeper.<init> Initiating client connection, connectString=127.0.0.1:38917 sessionTimeout=60000 watcher=org.apache.solr.common.cloud.ConnectionManager@561832ba
[junit4:junit4]   2> 7257 T1498 oascc.ConnectionManager.waitForConnected Waiting for client to connect to ZooKeeper
[junit4:junit4]   2> 7257 T1551 oaz.ClientCnxn$SendThread.logStartConnect Opening socket connection to server localhost/127.0.0.1:38917. Will not attempt to authenticate using SASL (access denied (javax.security.auth.AuthPermission getLoginConfiguration))
[junit4:junit4]   2> 7258 T1551 oaz.ClientCnxn$SendThread.primeConnection Socket connection established to localhost/127.0.0.1:38917, initiating session
[junit4:junit4]   2> 7259 T1500 oazs.NIOServerCnxnFactory.run Accepted socket connection from /140.211.11.196:45546
[junit4:junit4]   2> 7259 T1500 oazs.ZooKeeperServer.processConnectRequest Client attempting to establish new session at /140.211.11.196:45546
[junit4:junit4]   2> 7261 T1502 oazs.ZooKeeperServer.finishSessionInit Established session 0x13c7223ca470007 with negotiated timeout 20000 for client /140.211.11.196:45546
[junit4:junit4]   2> 7261 T1551 oaz.ClientCnxn$SendThread.onConnected Session establishment complete on server localhost/127.0.0.1:38917, sessionid = 0x13c7223ca470007, negotiated timeout = 20000
[junit4:junit4]   2> 7261 T1552 oascc.ConnectionManager.process Watcher org.apache.solr.common.cloud.ConnectionManager@561832ba name:ZooKeeperConnection Watcher:127.0.0.1:38917 got event WatchedEvent state:SyncConnected type:None path:null path:null type:None
[junit4:junit4]   2> 7261 T1498 oascc.ConnectionManager.waitForConnected Client is connected to ZooKeeper
[junit4:junit4]   2> 7262 T1503 oazs.PrepRequestProcessor.pRequest2Txn Processed session termination for sessionid: 0x13c7223ca470007
[junit4:junit4]   2> 7277 T1552 oaz.ClientCnxn$EventThread.run EventThread shut down
[junit4:junit4]   2> 7277 T1500 oazs.NIOServerCnxn.closeSock Closed socket connection for client /140.211.11.196:45546 which had sessionid 0x13c7223ca470007
[junit4:junit4]   2> 7277 T1498 oaz.ZooKeeper.close Session: 0x13c7223ca470007 closed
[junit4:junit4]   2> 7278 T1498 oascsi.HttpClientUtil.createClient Creating new http client, config:maxConnections=500&maxConnectionsPerHost=16&socketTimeout=60000&connTimeout=15000
[junit4:junit4]   2> 7287 T1498 oaz.ZooKeeper.<init> Initiating client connection, connectString=127.0.0.1:38917/solr sessionTimeout=30000 watcher=org.apache.solr.common.cloud.ConnectionManager@633e01a
[junit4:junit4]   2> 7288 T1498 oascc.ConnectionManager.waitForConnected Waiting for client to connect to ZooKeeper
[junit4:junit4]   2> 7288 T1553 oaz.ClientCnxn$SendThread.logStartConnect Opening socket connection to server localhost/127.0.0.1:38917. Will not attempt to authenticate using SASL (access denied (javax.security.auth.AuthPermission getLoginConfiguration))
[junit4:junit4]   2> 7289 T1553 oaz.ClientCnxn$SendThread.primeConnection Socket connection established to localhost/127.0.0.1:38917, initiating session
[junit4:junit4]   2> 7289 T1500 oazs.NIOServerCnxnFactory.run Accepted socket connection from /140.211.11.196:26258
[junit4:junit4]   2> 7289 T1500 oazs.ZooKeeperServer.processConnectRequest Client attempting to establish new session at /140.211.11.196:26258
[junit4:junit4]   2> 7291 T1502 oazs.ZooKeeperServer.finishSessionInit Established session 0x13c7223ca470008 with negotiated timeout 20000 for client /140.211.11.196:26258
[junit4:junit4]   2> 7291 T1553 oaz.ClientCnxn$SendThread.onConnected Session establishment complete on server localhost/127.0.0.1:38917, sessionid = 0x13c7223ca470008, negotiated timeout = 20000
[junit4:junit4]   2> 7291 T1554 oascc.ConnectionManager.process Watcher org.apache.solr.common.cloud.ConnectionManager@633e01a name:ZooKeeperConnection Watcher:127.0.0.1:38917/solr got event WatchedEvent state:SyncConnected type:None path:null path:null type:None
[junit4:junit4]   2> 7291 T1498 oascc.ConnectionManager.waitForConnected Client is connected to ZooKeeper
[junit4:junit4]   2> 7292 T1503 oazs.PrepRequestProcessor.pRequest Got user-level KeeperException when processing sessionid:0x13c7223ca470008 type:create cxid:0x1 zxid:0x6c txntype:-1 reqpath:n/a Error Path:/solr/overseer Error:KeeperErrorCode = NodeExists for /solr/overseer
[junit4:junit4]   2> 7294 T1503 oazs.PrepRequestProcessor.pRequest Got user-level KeeperException when processing sessionid:0x13c7223ca470008 type:create cxid:0x2 zxid:0x6d txntype:-1 reqpath:n/a Error Path:/solr/overseer Error:KeeperErrorCode = NodeExists for /solr/overseer
[junit4:junit4]   2> 7301 T1498 oasc.ZkController.createEphemeralLiveNode Register node as live in ZooKeeper:/live_nodes/127.0.0.1:59228_s%2Ft
[junit4:junit4]   2> 7302 T1503 oazs.PrepRequestProcessor.pRequest Got user-level KeeperException when processing sessionid:0x13c7223ca470008 type:delete cxid:0x4 zxid:0x6e txntype:-1 reqpath:n/a Error Path:/solr/live_nodes/127.0.0.1:59228_s%2Ft Error:KeeperErrorCode = NoNode for /solr/live_nodes/127.0.0.1:59228_s%2Ft
[junit4:junit4]   2> 7302 T1498 oascc.SolrZkClient.makePath makePath: /live_nodes/127.0.0.1:59228_s%2Ft
[junit4:junit4]   2> 7305 T1539 oascc.ZkStateReader$2.process A cluster state change: WatchedEvent state:SyncConnected type:NodeChildrenChanged path:/live_nodes, has occurred - updating... (live nodes size: 2)
[junit4:junit4]   2> 7305 T1526 oascc.ZkStateReader$3.process Updating live nodes... (3)
[junit4:junit4]   2> 7305 T1526 oascc.ZkStateReader$2.process A cluster state change: WatchedEvent state:SyncConnected type:NodeChildrenChanged path:/live_nodes, has occurred - updating... (live nodes size: 3)
[junit4:junit4]   2> 7305 T1520 oascc.ZkStateReader$3.process Updating live nodes... (3)
[junit4:junit4]   2> 7306 T1520 oascc.ZkStateReader$2.process A cluster state change: WatchedEvent state:SyncConnected type:NodeChildrenChanged path:/live_nodes, has occurred - updating... (live nodes size: 3)
[junit4:junit4]   2> 7306 T1539 oascc.ZkStateReader$3.process Updating live nodes... (3)
[junit4:junit4]   2> 7314 T1498 oascc.ZkStateReader.createClusterStateWatchersAndUpdate Updating cluster state from ZooKeeper... 
[junit4:junit4]   2> 7321 T1555 oasc.CoreContainer.create Creating SolrCore 'collection1' using instanceDir: /usr/home/hudson/hudson-slave/workspace/Lucene-Solr-Tests-trunk-Java6/solr/build/solr-core/test/J0/./org.apache.solr.cloud.SyncSliceTest-jetty2-1359124620727/collection1
[junit4:junit4]   2> 7321 T1555 oasc.ZkController.createCollectionZkNode Check for collection zkNode:collection1
[junit4:junit4]   2> 7322 T1555 oasc.ZkController.createCollectionZkNode Collection zkNode exists
[junit4:junit4]   2> 7322 T1555 oasc.ZkController.readConfigName Load collection config from:/collections/collection1
[junit4:junit4]   2> 7323 T1555 oasc.SolrResourceLoader.<init> new SolrResourceLoader for directory: '/usr/home/hudson/hudson-slave/workspace/Lucene-Solr-Tests-trunk-Java6/solr/build/solr-core/test/J0/./org.apache.solr.cloud.SyncSliceTest-jetty2-1359124620727/collection1/'
[junit4:junit4]   2> 7324 T1555 oasc.SolrResourceLoader.replaceClassLoader Adding 'file:/usr/home/hudson/hudson-slave/workspace/Lucene-Solr-Tests-trunk-Java6/solr/build/solr-core/test/J0/org.apache.solr.cloud.SyncSliceTest-jetty2-1359124620727/collection1/lib/README' to classloader
[junit4:junit4]   2> 7324 T1555 oasc.SolrResourceLoader.replaceClassLoader Adding 'file:/usr/home/hudson/hudson-slave/workspace/Lucene-Solr-Tests-trunk-Java6/solr/build/solr-core/test/J0/org.apache.solr.cloud.SyncSliceTest-jetty2-1359124620727/collection1/lib/classes/' to classloader
[junit4:junit4]   2> 7360 T1555 oasc.SolrConfig.<init> Using Lucene MatchVersion: LUCENE_50
[junit4:junit4]   2> 7424 T1555 oasc.SolrConfig.<init> Loaded SolrConfig: solrconfig.xml
[junit4:junit4]   2> 7525 T1555 oass.IndexSchema.readSchema Reading Solr Schema
[junit4:junit4]   2> 7529 T1555 oass.IndexSchema.readSchema Schema name=test
[junit4:junit4]   2> 7957 T1555 oass.OpenExchangeRatesOrgProvider.init Initialized with rates=open-exchange-rates.json, refreshInterval=1440.
[junit4:junit4]   2> 7967 T1555 oass.IndexSchema.readSchema default search field in schema is text
[junit4:junit4]   2> 7970 T1555 oass.IndexSchema.readSchema unique key field: id
[junit4:junit4]   2> 7981 T1555 oass.FileExchangeRateProvider.reload Reloading exchange rates from file currency.xml
[junit4:junit4]   2> 7989 T1555 oass.FileExchangeRateProvider.reload Reloading exchange rates from file currency.xml
[junit4:junit4]   2> 7994 T1555 oass.OpenExchangeRatesOrgProvider.reload Reloading exchange rates from open-exchange-rates.json
[junit4:junit4]   2> 7995 T1555 oass.OpenExchangeRatesOrgProvider.reload Reloading exchange rates from open-exchange-rates.json
[junit4:junit4]   2> 7996 T1555 oasc.SolrCore.<init> [collection1] Opening new SolrCore at /usr/home/hudson/hudson-slave/workspace/Lucene-Solr-Tests-trunk-Java6/solr/build/solr-core/test/J0/./org.apache.solr.cloud.SyncSliceTest-jetty2-1359124620727/collection1/, dataDir=./org.apache.solr.cloud.SyncSliceTest-1359124613698/jetty2/
[junit4:junit4]   2> 7996 T1555 oasc.JmxMonitoredMap.<init> JMX monitoring is enabled. Adding Solr mbeans to JMX Server: com.sun.jmx.mbeanserver.JmxMBeanServer@10cbd8dc
[junit4:junit4]   2> 7996 T1555 oasc.SolrCore.initDirectoryFactory solr.NRTCachingDirectoryFactory
[junit4:junit4]   2> 7997 T1555 oasc.CachingDirectoryFactory.get return new directory for /usr/home/hudson/hudson-slave/workspace/Lucene-Solr-Tests-trunk-Java6/solr/build/solr-core/test/J0/./org.apache.solr.cloud.SyncSliceTest-1359124613698/jetty2 forceNew:false
[junit4:junit4]   2> 7997 T1555 oasc.CachingDirectoryFactory.close Releasing directory:/usr/home/hudson/hudson-slave/workspace/Lucene-Solr-Tests-trunk-Java6/solr/build/solr-core/test/J0/./org.apache.solr.cloud.SyncSliceTest-1359124613698/jetty2
[junit4:junit4]   2> 7997 T1555 oasc.SolrCore.getNewIndexDir New index directory detected: old=null new=./org.apache.solr.cloud.SyncSliceTest-1359124613698/jetty2/index/
[junit4:junit4]   2> 7998 T1555 oasc.SolrCore.initIndex WARNING [collection1] Solr index directory './org.apache.solr.cloud.SyncSliceTest-1359124613698/jetty2/index' doesn't exist. Creating new index...
[junit4:junit4]   2> 7998 T1555 oasc.CachingDirectoryFactory.get return new directory for /usr/home/hudson/hudson-slave/workspace/Lucene-Solr-Tests-trunk-Java6/solr/build/solr-core/test/J0/./org.apache.solr.cloud.SyncSliceTest-1359124613698/jetty2/index forceNew:false
[junit4:junit4]   2> 8003 T1555 oasc.SolrDeletionPolicy.onCommit SolrDeletionPolicy.onCommit: commits:num=1
[junit4:junit4]   2> 		commit{dir=RateLimitedDirectoryWrapper(NRTCachingDirectory(org.apache.lucene.store.NIOFSDirectory@/usr/home/hudson/hudson-slave/workspace/Lucene-Solr-Tests-trunk-Java6/solr/build/solr-core/test/J0/org.apache.solr.cloud.SyncSliceTest-1359124613698/jetty2/index lockFactory=org.apache.lucene.store.NativeFSLockFactory@2a769a55; maxCacheMB=48.0 maxMergeSizeMB=4.0)),segFN=segments_1,generation=1,filenames=[segments_1]
[junit4:junit4]   2> 8003 T1555 oasc.SolrDeletionPolicy.updateCommits newest commit = 1[segments_1]
[junit4:junit4]   2> 8004 T1555 oasc.CachingDirectoryFactory.close Releasing directory:/usr/home/hudson/hudson-slave/workspace/Lucene-Solr-Tests-trunk-Java6/solr/build/solr-core/test/J0/./org.apache.solr.cloud.SyncSliceTest-1359124613698/jetty2/index
[junit4:junit4]   2> 8004 T1555 oasc.SolrCore.initWriters created xml: solr.XMLResponseWriter
[junit4:junit4]   2> 8005 T1555 oasup.UpdateRequestProcessorChain.init inserting DistributedUpdateProcessorFactory into updateRequestProcessorChain "dedupe"
[junit4:junit4]   2> 8006 T1555 oasup.UpdateRequestProcessorChain.init inserting DistributedUpdateProcessorFactory into updateRequestProcessorChain "dedupe-allfields"
[junit4:junit4]   2> 8006 T1555 oasup.UpdateRequestProcessorChain.init inserting DistributedUpdateProcessorFactory into updateRequestProcessorChain "stored_sig"
[junit4:junit4]   2> 8006 T1555 oasup.UpdateRequestProcessorChain.init inserting DistributedUpdateProcessorFactory into updateRequestProcessorChain "uniq-fields"
[junit4:junit4]   2> 8006 T1555 oasup.UpdateRequestProcessorChain.init inserting DistributedUpdateProcessorFactory into updateRequestProcessorChain "distrib-dup-test-chain-implicit"
[junit4:junit4]   2> 8006 T1555 oasc.RequestHandlers.initHandlersFromConfig adding lazy requestHandler: solr.ReplicationHandler
[junit4:junit4]   2> 8007 T1555 oasc.RequestHandlers.initHandlersFromConfig created /replication: solr.ReplicationHandler
[junit4:junit4]   2> 8007 T1555 oasc.RequestHandlers.initHandlersFromConfig created standard: solr.StandardRequestHandler
[junit4:junit4]   2> 8007 T1555 oasc.RequestHandlers.initHandlersFromConfig created /get: solr.RealTimeGetHandler
[junit4:junit4]   2> 8008 T1555 oasc.RequestHandlers.initHandlersFromConfig created dismax: solr.SearchHandler
[junit4:junit4]   2> 8008 T1555 oasc.RequestHandlers.initHandlersFromConfig created mock: org.apache.solr.core.MockQuerySenderListenerReqHandler
[junit4:junit4]   2> 8008 T1555 oasc.RequestHandlers.initHandlersFromConfig created /admin/: org.apache.solr.handler.admin.AdminHandlers
[junit4:junit4]   2> 8009 T1555 oasc.RequestHandlers.initHandlersFromConfig created defaults: solr.StandardRequestHandler
[junit4:junit4]   2> 8009 T1555 oasc.RequestHandlers.initHandlersFromConfig adding lazy requestHandler: solr.StandardRequestHandler
[junit4:junit4]   2> 8009 T1555 oasc.RequestHandlers.initHandlersFromConfig created lazy: solr.StandardRequestHandler
[junit4:junit4]   2> 8009 T1555 oasc.RequestHandlers.initHandlersFromConfig created /update: solr.UpdateRequestHandler
[junit4:junit4]   2> 8009 T1555 oasc.RequestHandlers.initHandlersFromConfig created /terms: org.apache.solr.handler.component.SearchHandler
[junit4:junit4]   2> 8010 T1555 oasc.RequestHandlers.initHandlersFromConfig created spellCheckCompRH: org.apache.solr.handler.component.SearchHandler
[junit4:junit4]   2> 8010 T1555 oasc.RequestHandlers.initHandlersFromConfig created spellCheckCompRH_Direct: org.apache.solr.handler.component.SearchHandler
[junit4:junit4]   2> 8010 T1555 oasc.RequestHandlers.initHandlersFromConfig created spellCheckWithWordbreak: org.apache.solr.handler.component.SearchHandler
[junit4:junit4]   2> 8011 T1555 oasc.RequestHandlers.initHandlersFromConfig created spellCheckWithWordbreak_Direct: org.apache.solr.handler.component.SearchHandler
[junit4:junit4]   2> 8011 T1555 oasc.RequestHandlers.initHandlersFromConfig created spellCheckCompRH1: org.apache.solr.handler.component.SearchHandler
[junit4:junit4]   2> 8011 T1555 oasc.RequestHandlers.initHandlersFromConfig created mltrh: org.apache.solr.handler.component.SearchHandler
[junit4:junit4]   2> 8012 T1555 oasc.RequestHandlers.initHandlersFromConfig created tvrh: org.apache.solr.handler.component.SearchHandler
[junit4:junit4]   2> 8012 T1555 oasc.RequestHandlers.initHandlersFromConfig created /mlt: solr.MoreLikeThisHandler
[junit4:junit4]   2> 8012 T1555 oasc.RequestHandlers.initHandlersFromConfig created /debug/dump: solr.DumpRequestHandler
[junit4:junit4]   2> 8017 T1555 oashl.XMLLoader.init xsltCacheLifetimeSeconds=60
[junit4:junit4]   2> 8020 T1555 oasc.SolrCore.initDeprecatedSupport WARNING solrconfig.xml uses deprecated <admin/gettableFiles>, Please update your config to use the ShowFileRequestHandler.
[junit4:junit4]   2> 8021 T1555 oasc.SolrCore.initDeprecatedSupport WARNING adding ShowFileRequestHandler with hidden files: [SCHEMA.XML, OLD_SYNONYMS.TXT, STOPWORDS.TXT, PROTWORDS.TXT, OPEN-EXCHANGE-RATES.JSON, SYNONYMS.TXT, CURRENCY.XML, MAPPING-ISOLATIN1ACCENT.TXT]
[junit4:junit4]   2> 8023 T1555 oasc.CachingDirectoryFactory.close Releasing directory:/usr/home/hudson/hudson-slave/workspace/Lucene-Solr-Tests-trunk-Java6/solr/build/solr-core/test/J0/./org.apache.solr.cloud.SyncSliceTest-1359124613698/jetty2
[junit4:junit4]   2> 8024 T1555 oass.SolrIndexSearcher.<init> Opening Searcher@6312ff56 main
[junit4:junit4]   2> 8025 T1555 oasu.CommitTracker.<init> Hard AutoCommit: disabled
[junit4:junit4]   2> 8025 T1555 oasu.CommitTracker.<init> Soft AutoCommit: disabled
[junit4:junit4]   2> 8025 T1555 oashc.SpellCheckComponent.inform Initializing spell checkers
[junit4:junit4]   2> 8030 T1555 oass.DirectSolrSpellChecker.init init: {name=direct,classname=DirectSolrSpellChecker,field=lowerfilt,minQueryLength=3}
[junit4:junit4]   2> 8071 T1556 oasc.SolrCore.registerSearcher [collection1] Registered new searcher Searcher@6312ff56 main{StandardDirectoryReader(segments_1:1)}
[junit4:junit4]   2> 8074 T1555 oasc.ZkController.publish publishing core=collection1 state=down
[junit4:junit4]   2> 8074 T1555 oasc.ZkController.publish numShards not found on descriptor - reading it from system property
[junit4:junit4]   2> 8493 T1521 oascc.ZkStateReader.updateClusterState Updating cloud state from ZooKeeper... 
[junit4:junit4]   2> 8494 T1521 oasc.Overseer$ClusterStateUpdater.updateState Update state numShards=1 message={
[junit4:junit4]   2> 	  "operation":"state",
[junit4:junit4]   2> 	  "numShards":"1",
[junit4:junit4]   2> 	  "shard":"shard1",
[junit4:junit4]   2> 	  "roles":null,
[junit4:junit4]   2> 	  "state":"active",
[junit4:junit4]   2> 	  "core":"collection1",
[junit4:junit4]   2> 	  "collection":"collection1",
[junit4:junit4]   2> 	  "node_name":"127.0.0.1:16126_s%2Ft",
[junit4:junit4]   2> 	  "base_url":"http://127.0.0.1:16126/s/t"}
[junit4:junit4]   2> 8498 T1521 oasc.Overseer$ClusterStateUpdater.updateState Update state numShards=1 message={
[junit4:junit4]   2> 	  "operation":"state",
[junit4:junit4]   2> 	  "numShards":"1",
[junit4:junit4]   2> 	  "shard":null,
[junit4:junit4]   2> 	  "roles":null,
[junit4:junit4]   2> 	  "state":"down",
[junit4:junit4]   2> 	  "core":"collection1",
[junit4:junit4]   2> 	  "collection":"collection1",
[junit4:junit4]   2> 	  "node_name":"127.0.0.1:59228_s%2Ft",
[junit4:junit4]   2> 	  "base_url":"http://127.0.0.1:59228/s/t"}
[junit4:junit4]   2> 8498 T1521 oasc.Overseer$ClusterStateUpdater.updateState Collection already exists with numShards=1
[junit4:junit4]   2> 8498 T1521 oasc.Overseer$ClusterStateUpdater.updateState Assigning new node to shard shard=shard1
[junit4:junit4]   2> 8513 T1539 oascc.ZkStateReader$2.process A cluster state change: WatchedEvent state:SyncConnected type:NodeDataChanged path:/clusterstate.json, has occurred - updating... (live nodes size: 3)
[junit4:junit4]   2> 8513 T1526 oascc.ZkStateReader$2.process A cluster state change: WatchedEvent state:SyncConnected type:NodeDataChanged path:/clusterstate.json, has occurred - updating... (live nodes size: 3)
[junit4:junit4]   2> 8513 T1520 oascc.ZkStateReader$2.process A cluster state change: WatchedEvent state:SyncConnected type:NodeDataChanged path:/clusterstate.json, has occurred - updating... (live nodes size: 3)
[junit4:junit4]   2> 8513 T1554 oascc.ZkStateReader$2.process A cluster state change: WatchedEvent state:SyncConnected type:NodeDataChanged path:/clusterstate.json, has occurred - updating... (live nodes size: 3)
[junit4:junit4]   2> 9077 T1555 oasc.CoreContainer.registerCore registering core: collection1
[junit4:junit4]   2> 9077 T1555 oasc.ZkController.register Register replica - core:collection1 address:http://127.0.0.1:59228/s/t collection:collection1 shard:shard1
[junit4:junit4]   2> 9084 T1555 oasc.ZkController.register We are http://127.0.0.1:59228/s/t/collection1/ and leader is http://127.0.0.1:16126/s/t/collection1/
[junit4:junit4]   2> 9084 T1555 oasc.ZkController.register No LogReplay needed for core=collection1 baseURL=http://127.0.0.1:59228/s/t
[junit4:junit4]   2> 9084 T1555 oasc.ZkController.checkRecovery Core needs to recover:collection1
[junit4:junit4]   2> 9084 T1555 oasu.DefaultSolrCoreState.doRecovery Running recovery - first canceling any ongoing recovery
[junit4:junit4]   2> ASYNC  NEW_CORE C161 name=collection1 org.apache.solr.core.SolrCore@25749f0c url=http://127.0.0.1:59228/s/t/collection1 node=127.0.0.1:59228_s%2Ft C161_STATE=coll:collection1 core:collection1 props:{shard=null, roles=null, state=down, core=collection1, collection=collection1, node_name=127.0.0.1:59228_s%2Ft, base_url=http://127.0.0.1:59228/s/t}
[junit4:junit4]   2> 9085 T1557 C161 P59228 oasc.RecoveryStrategy.run Starting recovery process.  core=collection1 recoveringAfterStartup=true
[junit4:junit4]   2> 9085 T1557 C161 P59228 oasc.RecoveryStrategy.doRecovery ###### startupVersions=[]
[junit4:junit4]   2> 9085 T1557 C161 P59228 oasc.ZkController.publish publishing core=collection1 state=recovering
[junit4:junit4]   2> 9086 T1557 C161 P59228 oasc.ZkController.publish numShards not found on descriptor - reading it from system property
[junit4:junit4]   2> 9086 T1555 oascc.ZkStateReader.updateClusterState Updating cloud state from ZooKeeper... 
[junit4:junit4]   2> 9087 T1557 C161 P59228 oascsi.HttpClientUtil.createClient Creating new http client, config:maxConnections=128&maxConnectionsPerHost=32&followRedirects=false
[junit4:junit4]   2> 9087 T1498 oass.SolrDispatchFilter.init user.dir=/usr/home/hudson/hudson-slave/workspace/Lucene-Solr-Tests-trunk-Java6/solr/build/solr-core/test/J0
[junit4:junit4]   2> 9088 T1498 oass.SolrDispatchFilter.init SolrDispatchFilter.init() done
[junit4:junit4]   2> 9089 T1498 oascsi.HttpClientUtil.createClient Creating new http client, config:maxConnections=128&maxConnectionsPerHost=32&followRedirects=false
[junit4:junit4]   2> 9263 T1498 oejs.Server.doStart jetty-8.1.8.v20121106
[junit4:junit4]   2> 9266 T1498 oejs.AbstractConnector.doStart Started SocketConnector@127.0.0.1:26267
[junit4:junit4]   2> 9267 T1498 oass.SolrDispatchFilter.init SolrDispatchFilter.init()
[junit4:junit4]   2> 9267 T1498 oasc.SolrResourceLoader.locateSolrHome JNDI not configured for solr (NoInitialContextEx)
[junit4:junit4]   2> 9268 T1498 oasc.SolrResourceLoader.locateSolrHome using system property solr.solr.home: /usr/home/hudson/hudson-slave/workspace/Lucene-Solr-Tests-trunk-Java6/solr/build/solr-core/test/J0/./org.apache.solr.cloud.SyncSliceTest-jetty3-1359124622798
[junit4:junit4]   2> 9268 T1498 oasc.CoreContainer$Initializer.initialize looking for solr.xml: /usr/home/hudson/hudson-slave/workspace/Lucene-Solr-Tests-trunk-Java6/solr/build/solr-core/test/J0/./org.apache.solr.cloud.SyncSliceTest-jetty3-1359124622798/solr.xml
[junit4:junit4]   2> 9268 T1498 oasc.CoreContainer.<init> New CoreContainer 1796804187
[junit4:junit4]   2> 9269 T1498 oasc.CoreContainer.load Loading CoreContainer using Solr Home: '/usr/home/hudson/hudson-slave/workspace/Lucene-Solr-Tests-trunk-Java6/solr/build/solr-core/test/J0/./org.apache.solr.cloud.SyncSliceTest-jetty3-1359124622798/'
[junit4:junit4]   2> 9269 T1498 oasc.SolrResourceLoader.<init> new SolrResourceLoader for directory: '/usr/home/hudson/hudson-slave/workspace/Lucene-Solr-Tests-trunk-Java6/solr/build/solr-core/test/J0/./org.apache.solr.cloud.SyncSliceTest-jetty3-1359124622798/'
[junit4:junit4]   2> 9312 T1498 oashc.HttpShardHandlerFactory.getParameter Setting socketTimeout to: 60000
[junit4:junit4]   2> 9313 T1498 oashc.HttpShardHandlerFactory.getParameter Setting urlScheme to: http://
[junit4:junit4]   2> 9313 T1498 oashc.HttpShardHandlerFactory.getParameter Setting connTimeout to: 15000
[junit4:junit4]   2> 9314 T1498 oashc.HttpShardHandlerFactory.getParameter Setting maxConnectionsPerHost to: 20
[junit4:junit4]   2> 9314 T1498 oashc.HttpShardHandlerFactory.getParameter Setting corePoolSize to: 0
[junit4:junit4]   2> 9315 T1498 oashc.HttpShardHandlerFactory.getParameter Setting maximumPoolSize to: 2147483647
[junit4:junit4]   2> 9315 T1498 oashc.HttpShardHandlerFactory.getParameter Setting maxThreadIdleTime to: 5
[junit4:junit4]   2> 9315 T1498 oashc.HttpShardHandlerFactory.getParameter Setting sizeOfQueue to: -1
[junit4:junit4]   2> 9316 T1498 oashc.HttpShardHandlerFactory.getParameter Setting fairnessPolicy to: false
[junit4:junit4]   2> 9316 T1498 oascsi.HttpClientUtil.createClient Creating new http client, config:maxConnectionsPerHost=20&maxConnections=10000&socketTimeout=60000&connTimeout=15000&retry=false
[junit4:junit4]   2> 9337 T1498 oasc.CoreContainer.load Registering Log Listener
[junit4:junit4]   2> 9357 T1498 oasc.CoreContainer.initZooKeeper Zookeeper client=127.0.0.1:38917/solr
[junit4:junit4]   2> 9358 T1498 oasc.ZkController.checkChrootPath zkHost includes chroot
[junit4:junit4]   2> 9358 T1498 oaz.ZooKeeper.<init> Initiating client connection, connectString=127.0.0.1:38917 sessionTimeout=60000 watcher=org.apache.solr.common.cloud.ConnectionManager@3dff82ab
[junit4:junit4]   2> 9360 T1498 oascc.ConnectionManager.waitForConnected Waiting for client to connect to ZooKeeper
[junit4:junit4]   2> 9360 T1567 oaz.ClientCnxn$SendThread.logStartConnect Opening socket connection to server localhost/127.0.0.1:38917. Will not attempt to authenticate using SASL (access denied (javax.security.auth.AuthPermission getLoginConfiguration))
[junit4:junit4]   2> 9361 T1567 oaz.ClientCnxn$SendThread.primeConnection Socket connection established to localhost/127.0.0.1:38917, initiating session
[junit4:junit4]   2> 9361 T1500 oazs.NIOServerCnxnFactory.run Accepted socket connection from /140.211.11.196:52321
[junit4:junit4]   2> 9361 T1500 oazs.ZooKeeperServer.processConnectRequest Client attempting to establish new session at /140.211.11.196:52321
[junit4:junit4]   2> 9364 T1502 oazs.ZooKeeperServer.finishSessionInit Established session 0x13c7223ca470009 with negotiated timeout 20000 for client /140.211.11.196:52321
[junit4:junit4]   2> 9364 T1567 oaz.ClientCnxn$SendThread.onConnected Session establishment complete on server localhost/127.0.0.1:38917, sessionid = 0x13c7223ca470009, negotiated timeout = 20000
[junit4:junit4]   2> 9364 T1568 oascc.ConnectionManager.process Watcher org.apache.solr.common.cloud.ConnectionManager@3dff82ab name:ZooKeeperConnection Watcher:127.0.0.1:38917 got event WatchedEvent state:SyncConnected type:None path:null path:null type:None
[junit4:junit4]   2> 9364 T1498 oascc.ConnectionManager.waitForConnected Client is connected to ZooKeeper
[junit4:junit4]   2> 9366 T1503 oazs.PrepRequestProcessor.pRequest2Txn Processed session termination for sessionid: 0x13c7223ca470009
[junit4:junit4]   2> 9382 T1568 oaz.ClientCnxn$EventThread.run EventThread shut down
[junit4:junit4]   2> 9382 T1500 oazs.NIOServerCnxn.closeSock Closed socket connection for client /140.211.11.196:52321 which had sessionid 0x13c7223ca470009
[junit4:junit4]   2> 9382 T1498 oaz.ZooKeeper.close Session: 0x13c7223ca470009 closed
[junit4:junit4]   2> 9383 T1498 oascsi.HttpClientUtil.createClient Creating new http client, config:maxConnections=500&maxConnectionsPerHost=16&socketTimeout=60000&connTimeout=15000
[junit4:junit4]   2> 9392 T1498 oaz.ZooKeeper.<init> Initiating client connection, connectString=127.0.0.1:38917/solr sessionTimeout=30000 watcher=org.apache.solr.common.cloud.ConnectionManager@1ea25a22
[junit4:junit4]   2> 9393 T1498 oascc.ConnectionManager.waitForConnected Waiting for client to connect to ZooKeeper
[junit4:junit4]   2> 9394 T1569 oaz.ClientCnxn$SendThread.logStartConnect Opening socket connection to server localhost/127.0.0.1:38917. Will not attempt to authenticate using SASL (access denied (javax.security.auth.AuthPermission getLoginConfiguration))
[junit4:junit4]   2> 9394 T1569 oaz.ClientCnxn$SendThread.primeConnection Socket connection established to localhost/127.0.0.1:38917, initiating session
[junit4:junit4]   2> 9394 T1500 oazs.NIOServerCnxnFactory.run Accepted socket connection from /140.211.11.196:26677
[junit4:junit4]   2> 9395 T1500 oazs.ZooKeeperServer.processConnectRequest Client attempting to establish new session at /140.211.11.196:26677
[junit4:junit4]   2> 9396 T1502 oazs.ZooKeeperServer.finishSessionInit Established session 0x13c7223ca47000a with negotiated timeout 20000 for client /140.211.11.196:26677
[junit4:junit4]   2> 9396 T1569 oaz.ClientCnxn$SendThread.onConnected Session establishment complete on server localhost/127.0.0.1:38917, sessionid = 0x13c7223ca47000a, negotiated timeout = 20000
[junit4:junit4]   2> 9396 T1570 oascc.ConnectionManager.process Watcher org.apache.solr.common.cloud.ConnectionManager@1ea25a22 name:ZooKeeperConnection Watcher:127.0.0.1:38917/solr got event WatchedEvent state:SyncConnected type:None path:null path:null type:None
[junit4:junit4]   2> 9397 T1498 oascc.ConnectionManager.waitForConnected Client is connected to ZooKeeper
[junit4:junit4]   2> 9398 T1503 oazs.PrepRequestProcessor.pRequest Got user-level KeeperException when processing sessionid:0x13c7223ca47000a type:create cxid:0x1 zxid:0x7e txntype:-1 reqpath:n/a Error Path:/solr/overseer Error:KeeperErrorCode = NodeExists for /solr/overseer
[junit4:junit4]   2> 9399 T1503 oazs.PrepRequestProcessor.pRequest Got user-level KeeperException when processing sessionid:0x13c7223ca47000a type:create cxid:0x2 zxid:0x7f txntype:-1 reqpath:n/a Error Path:/solr/overseer Error:KeeperErrorCode = NodeExists for /solr/overseer
[junit4:junit4]   2> 9401 T1498 oasc.ZkController.createEphemeralLiveNode Register node as live in ZooKeeper:/live_nodes/127.0.0.1:26267_s%2Ft
[junit4:junit4]   2> 9401 T1503 oazs.PrepRequestProcessor.pRequest Got user-level KeeperException when processing sessionid:0x13c7223ca47000a type:delete cxid:0x4 zxid:0x80 txntype:-1 reqpath:n/a Error Path:/solr/live_nodes/127.0.0.1:26267_s%2Ft Error:KeeperErrorCode = NoNode for /solr/live_nodes/127.0.0.1:26267_s%2Ft
[junit4:junit4]   2> 9410 T1498 oascc.SolrZkClient.makePath makePath: /live_nodes/127.0.0.1:26267_s%2Ft
[junit4:junit4]   2> 9413 T1539 oascc.ZkStateReader$2.process A cluster state change: WatchedEvent state:SyncConnected type:NodeChildrenChanged path:/live_nodes, has occurred - updating... (live nodes size: 3)
[junit4:junit4]   2> 9413 T1526 oascc.ZkStateReader$3.process Updating live nodes... (4)
[junit4:junit4]   2> 9413 T1554 oascc.ZkStateReader$3.process Updating live nodes... (4)
[junit4:junit4]   2> 9413 T1520 oascc.ZkStateReader$3.process Updating live nodes... (4)
[junit4:junit4]   2> 9413 T1526 oascc.ZkStateReader$2.process A cluster state change: WatchedEvent state:SyncConnected type:NodeChildrenChanged path:/live_nodes, has occurred - updating... (live nodes size: 4)
[junit4:junit4]   2> 9413 T1520 oascc.ZkStateReader$2.process A cluster state change: WatchedEvent state:SyncConnected type:NodeChildrenChanged path:/live_nodes, has occurred - updating... (live nodes size: 4)
[junit4:junit4]   2> 9414 T1554 oascc.ZkStateReader$2.process A cluster state change: WatchedEvent state:SyncConnected type:NodeChildrenChanged path:/live_nodes, has occurred - updating... (live nodes size: 4)
[junit4:junit4]   2> 9416 T1539 oascc.ZkStateReader$3.process Updating live nodes... (4)
[junit4:junit4]   2> 9417 T1498 oascc.ZkStateReader.createClusterStateWatchersAndUpdate Updating cluster state from ZooKeeper... 
[junit4:junit4]   2> 9424 T1571 oasc.CoreContainer.create Creating SolrCore 'collection1' using instanceDir: /usr/home/hudson/hudson-slave/workspace/Lucene-Solr-Tests-trunk-Java6/solr/build/solr-core/test/J0/./org.apache.solr.cloud.SyncSliceTest-jetty3-1359124622798/collection1
[junit4:junit4]   2> 9424 T1571 oasc.ZkController.createCollectionZkNode Check for collection zkNode:collection1
[junit4:junit4]   2> 9424 T1571 oasc.ZkController.createCollectionZkNode Collection zkNode exists
[junit4:junit4]   2> 9425 T1571 oasc.ZkController.readConfigName Load collection config from:/collections/collection1
[junit4:junit4]   2> 9426 T1571 oasc.SolrResourceLoader.<init> new SolrResourceLoader for directory: '/usr/home/hudson/hudson-slave/workspace/Lucene-Solr-Tests-trunk-Java6/solr/build/solr-core/test/J0/./org.apache.solr.cloud.SyncSliceTest-jetty3-1359124622798/collection1/'
[junit4:junit4]   2> 9427 T1571 oasc.SolrResourceLoader.replaceClassLoader Adding 'file:/usr/home/hudson/hudson-slave/workspace/Lucene-Solr-Tests-trunk-Java6/solr/build/solr-core/test/J0/org.apache.solr.cloud.SyncSliceTest-jetty3-1359124622798/collection1/lib/README' to classloader
[junit4:junit4]   2> 9428 T1571 oasc.SolrResourceLoader.replaceClassLoader Adding 'file:/usr/home/hudson/hudson-slave/workspace/Lucene-Solr-Tests-trunk-Java6/solr/build/solr-core/test/J0/org.apache.solr.cloud.SyncSliceTest-jetty3-1359124622798/collection1/lib/classes/' to classloader
[junit4:junit4]   2> 9482 T1571 oasc.SolrConfig.<init> Using Lucene MatchVersion: LUCENE_50
[junit4:junit4]   2> 9557 T1571 oasc.SolrConfig.<init> Loaded SolrConfig: solrconfig.xml
[junit4:junit4]   2> 9658 T1571 oass.IndexSchema.readSchema Reading Solr Schema
[junit4:junit4]   2> 9664 T1571 oass.IndexSchema.readSchema Schema name=test
[junit4:junit4]   2> 10029 T1521 oascc.ZkStateReader.updateClusterState Updating cloud state from ZooKeeper... 
[junit4:junit4]   2> 10029 T1521 oasc.Overseer$ClusterStateUpdater.updateState Update state numShards=1 message={
[junit4:junit4]   2> 	  "operation":"state",
[junit4:junit4]   2> 	  "numShards":"1",
[junit4:junit4]   2> 	  "shard":"shard1",
[junit4:junit4]   2> 	  "roles":null,
[junit4:junit4]   2> 	  "state":"recovering",
[junit4:junit4]   2> 	  "core":"collection1",
[junit4:junit4]   2> 	  "collection":"collection1",
[junit4:junit4]   2> 	  "node_name":"127.0.0.1:59228_s%2Ft",
[junit4:junit4]   2> 	  "base_url":"http://127.0.0.1:59228/s/t"}
[junit4:junit4]   2> 10037 T1520 oascc.ZkStateReader$2.process A cluster state change: WatchedEvent state:SyncConnected type:NodeDataChanged path:/clusterstate.json, has occurred - updating... (live nodes size: 4)
[junit4:junit4]   2> 10037 T1570 oascc.ZkStateReader$2.process A cluster state change: WatchedEvent state:SyncConnected type:NodeDataChanged path:/clusterstate.json, has occurred - updating... (live nodes size: 4)
[junit4:junit4]   2> 10037 T1539 oascc.ZkStateReader$2.process A cluster state change: WatchedEvent state:SyncConnected type:NodeDataChanged path:/clusterstate.json, has occurred - updating... (live nodes size: 4)
[junit4:junit4]   2> 10037 T1554 oascc.ZkStateReader$2.process A cluster state change: WatchedEvent state:SyncConnected type:NodeDataChanged path:/clusterstate.json, has occurred - updating... (live nodes size: 4)
[junit4:junit4]   2> 10037 T1526 oascc.ZkStateReader$2.process A cluster state change: WatchedEvent state:SyncConnected type:NodeDataChanged path:/clusterstate.json, has occurred - updating... (live nodes size: 4)
[junit4:junit4]   2> 10262 T1571 oass.OpenExchangeRatesOrgProvider.init Initialized with rates=open-exchange-rates.json, refreshInterval=1440.
[junit4:junit4]   2> 10270 T1571 oass.IndexSchema.readSchema default search field in schema is text
[junit4:junit4]   2> 10273 T1571 oass.IndexSchema.readSchema unique key field: id
[junit4:junit4]   2> 10283 T1571 oass.FileExchangeRateProvider.reload Reloading exchange rates from file currency.xml
[junit4:junit4]   2> 10286 T1571 oass.FileExchangeRateProvider.reload Reloading exchange rates from file currency.xml
[junit4:junit4]   2> 10289 T1571 oass.OpenExchangeRatesOrgProvider.reload Reloading exchange rates from open-exchange-rates.json
[junit4:junit4]   2> 10290 T1571 oass.OpenExchangeRatesOrgProvider.reload Reloading exchange rates from open-exchange-rates.json
[junit4:junit4]   2> 10291 T1571 oasc.SolrCore.<init> [collection1] Opening new SolrCore at /usr/home/hudson/hudson-slave/workspace/Lucene-Solr-Tests-trunk-Java6/solr/build/solr-core/test/J0/./org.apache.solr.cloud.SyncSliceTest-jetty3-1359124622798/collection1/, dataDir=./org.apache.solr.cloud.SyncSliceTest-1359124613698/jetty3/
[junit4:junit4]   2> 10291 T1571 oasc.JmxMonitoredMap.<init> JMX monitoring is enabled. Adding Solr mbeans to JMX Server: com.sun.jmx.mbeanserver.JmxMBeanServer@10cbd8dc
[junit4:junit4]   2> 10292 T1571 oasc.SolrCore.initDirectoryFactory solr.NRTCachingDirectoryFactory
[junit4:junit4]   2> 10292 T1571 oasc.CachingDirectoryFactory.get return new directory for /usr/home/hudson/hudson-slave/workspace/Lucene-Solr-Tests-trunk-Java6/solr/build/solr-core/test/J0/./org.apache.solr.cloud.SyncSliceTest-1359124613698/jetty3 forceNew:false
[junit4:junit4]   2> 10293 T1571 oasc.CachingDirectoryFactory.close Releasing directory:/usr/home/hudson/hudson-slave/workspace/Lucene-Solr-Tests-trunk-Java6/solr/build/solr-core/test/J0/./org.apache.solr.cloud.SyncSliceTest-1359124613698/jetty3
[junit4:junit4]   2> 10293 T1571 oasc.SolrCore.getNewIndexDir New index directory detected: old=null new=./org.apache.solr.cloud.SyncSliceTest-1359124613698/jetty3/index/
[junit4:junit4]   2> 10293 T1571 oasc.SolrCore.initIndex WARNING [collection1] Solr index directory './org.apache.solr.cloud.SyncSliceTest-1359124613698/jetty3/index' doesn't exist. Creating new index...
[junit4:junit4]   2> 10294 T1571 oasc.CachingDirectoryFactory.get return new directory for /usr/home/hudson/hudson-slave/workspace/Lucene-Solr-Tests-trunk-Java6/solr/build/solr-core/test/J0/./org.apache.solr.cloud.SyncSliceTest-1359124613698/jetty3/index forceNew:false
[junit4:junit4]   2> 10298 T1571 oasc.SolrDeletionPolicy.onCommit SolrDeletionPolicy.onCommit: commits:num=1
[junit4:junit4]   2> 		commit{dir=RateLimitedDirectoryWrapper(NRTCachingDirectory(org.apache.lucene.store.NIOFSDirectory@/usr/home/hudson/hudson-slave/workspace/Lucene-Solr-Tests-trunk-Java6/solr/build/solr-core/test/J0/org.apache.solr.cloud.SyncSliceTest-1359124613698/jetty3/index lockFactory=org.apache.lucene.store.NativeFSLockFactory@15855338; maxCacheMB=48.0 maxMergeSizeMB=4.0)),segFN=segments_1,generation=1,filenames=[segments_1]
[junit4:junit4]   2> 10298 T1571 oasc.SolrDeletionPolicy.updateCommits newest commit = 1[segments_1]
[junit4:junit4]   2> 10299 T1571 oasc.CachingDirectoryFactory.close Releasing directory:/usr/home/hudson/hudson-slave/workspace/Lucene-Solr-Tests-trunk-Java6/solr/build/solr-core/test/J0/./org.apache.solr.cloud.SyncSliceTest-1359124613698/jetty3/index
[junit4:junit4]   2> 10299 T1571 oasc.SolrCore.initWriters created xml: solr.XMLResponseWriter
[junit4:junit4]   2> 10301 T1571 oasup.UpdateRequestProcessorChain.init inserting DistributedUpdateProcessorFactory into updateRequestProcessorChain "dedupe"
[junit4:junit4]   2> 10301 T1571 oasup.UpdateRequestProcessorChain.init inserting DistributedUpdateProcessorFactory into updateRequestProcessorChain "dedupe-allfields"
[junit4:junit4]   2> 10301 T1571 oasup.UpdateRequestProcessorChain.init inserting DistributedUpdateProcessorFactory into updateRequestProcessorChain "stored_sig"
[junit4:junit4]   2> 10301 T1571 oasup.UpdateRequestProcessorChain.init inserting DistributedUpdateProcessorFactory into updateRequestProcessorChain "uniq-fields"
[junit4:junit4]   2> 10301 T1571 oasup.UpdateRequestProcessorChain.init inserting DistributedUpdateProcessorFactory into updateRequestProcessorChain "distrib-dup-test-chain-implicit"
[junit4:junit4]   2> 10302 T1571 oasc.RequestHandlers.initHandlersFromConfig adding lazy requestHandler: solr.ReplicationHandler
[junit4:junit4]   2> 10302 T1571 oasc.RequestHandlers.initHandlersFromConfig created /replication: solr.ReplicationHandler
[junit4:junit4]   2> 10302 T1571 oasc.RequestHandlers.initHandlersFromConfig created standard: solr.StandardRequestHandler
[junit4:junit4]   2> 10303 T1571 oasc.RequestHandlers.initHandlersFromConfig created /get: solr.RealTimeGetHandler
[junit4:junit4]   2> 10303 T1571 oasc.RequestHandlers.initHandlersFromConfig created dismax: solr.SearchHandler
[junit4:junit4]   2> 10303 T1571 oasc.RequestHandlers.initHandlersFromConfig created mock: org.apache.solr.core.MockQuerySenderListenerReqHandler
[junit4:junit4]   2> 10303 T1571 oasc.RequestHandlers.initHandlersFromConfig created /admin/: org.apache.solr.handler.admin.AdminHandlers
[junit4:junit4]   2> 10304 T1571 oasc.RequestHandlers.initHandlersFromConfig created defaults: solr.StandardRequestHandler
[junit4:junit4]   2> 10304 T1571 oasc.RequestHandlers.initHandlersFromConfig adding lazy requestHandler: solr.StandardRequestHandler
[junit4:junit4]   2> 10304 T1571 oasc.RequestHandlers.initHandlersFromConfig created lazy: solr.StandardRequestHandler
[junit4:junit4]   2> 10304 T1571 oasc.RequestHandlers.initHandlersFromConfig created /update: solr.UpdateRequestHandler
[junit4:junit4]   2> 10305 T1571 oasc.RequestHandlers.initHandlersFromConfig created /terms: org.apache.solr.handler.component.SearchHandler
[junit4:junit4]   2> 10305 T1571 oasc.RequestHandlers.initHandlersFromConfig created spellCheckCompRH: org.apache.solr.handler.component.SearchHandler
[junit4:junit4]   2> 10305 T1571 oasc.RequestHandlers.initHandlersFromConfig created spellCheckCompRH_Direct: org.apache.solr.handler.component.SearchHandler
[junit4:junit4]   2> 10306 T1571 oasc.RequestHandlers.initHandlersFromConfig created spellCheckWithWordbreak: org.apache.solr.handler.component.SearchHandler
[junit4:junit4]   2> 10306 T1571 oasc.RequestHandlers.initHandlersFromConfig created spellCheckWithWordbreak_Direct: org.apache.solr.handler.component.SearchHandler
[junit4:junit4]   2> 10306 T1571 oasc.RequestHandlers.initHandlersFromConfig created spellCheckCompRH1: org.apache.solr.handler.component.SearchHandler
[junit4:junit4]   2> 10307 T1571 oasc.RequestHandlers.initHandlersFromConfig created mltrh: org.apache.solr.handler.component.SearchHandler
[junit4:junit4]   2> 10307 T1571 oasc.RequestHandlers.initHandlersFromConfig created tvrh: org.apache.solr.handler.component.SearchHandler
[junit4:junit4]   2> 10307 T1571 oasc.RequestHandlers.initHandlersFromConfig created /mlt: solr.MoreLikeThisHandler
[junit4:junit4]   2> 10307 T1571 oasc.RequestHandlers.initHandlersFromConfig created /debug/dump: solr.DumpRequestHandler
[junit4:junit4]   2> 10314 T1571 oashl.XMLLoader.init xsltCacheLifetimeSeconds=60
[junit4:junit4]   2> 10319 T1571 oasc.SolrCore.initDeprecatedSupport WARNING solrconfig.xml uses deprecated <admin/gettableFiles>, Please update your config to use the ShowFileRequestHandler.
[junit4:junit4]   2> 10320 T1571 oasc.SolrCore.initDeprecatedSupport WARNING adding ShowFileRequestHandler with hidden files: [SCHEMA.XML, OLD_SYNONYMS.TXT, STOPWORDS.TXT, PROTWORDS.TXT, OPEN-EXCHANGE-RATES.JSON, SYNONYMS.TXT, CURRENCY.XML, MAPPING-ISOLATIN1ACCENT.TXT]
[junit4:junit4]   2> 10321 T1571 oasc.CachingDirectoryFactory.close Releasing directory:/usr/home/hudson/hudson-slave/workspace/Lucene-Solr-Tests-trunk-Java6/solr/build/solr-core/test/J0/./org.apache.solr.cloud.SyncSliceTest-1359124613698/jetty3
[junit4:junit4]   2> 10323 T1571 oass.SolrIndexSearcher.<init> Opening Searcher@50935a37 main
[junit4:junit4]   2> 10323 T1571 oasu.CommitTracker.<init> Hard AutoCommit: disabled
[junit4:junit4]   2> 10323 T1571 oasu.CommitTracker.<init> Soft AutoCommit: disabled
[junit4:junit4]   2> 10324 T1571 oashc.SpellCheckComponent.inform Initializing spell checkers
[junit4:junit4]   2> 10342 T1571 oass.DirectSolrSpellChecker.init init: {name=direct,classname=DirectSolrSpellChecker,field=lowerfilt,minQueryLength=3}
[junit4:junit4]   2> 10392 T1572 oasc.SolrCore.registerSearcher [collection1] Registered new searcher Searcher@50935a37 main{StandardDirectoryReader(segments_1:1)}
[junit4:junit4]   2> 10394 T1571 oasc.ZkController.publish publishing core=collection1 state=down
[junit4:junit4]   2> 10395 T1571 oasc.ZkController.publish numShards not found on descriptor - reading it from system property
[junit4:junit4]   2> 11542 T1521 oascc.ZkStateReader.updateClusterState Updating cloud state from ZooKeeper... 
[junit4:junit4]   2> 11543 T1521 oasc.Overseer$ClusterStateUpdater.updateState Update state numShards=1 message={
[junit4:junit4]   2> 	  "operation":"state",
[junit4:junit4]   2> 	  "numShards":"1",
[junit4:junit4]   2> 	  "shard":null,
[junit4:junit4]   2> 	  "roles":null,
[junit4:junit4]   2> 	  "state":"down",
[junit4:junit4]   2> 	  "core":"collection1",
[junit4:junit4]   2> 	  "collection":"collection1",
[junit4:junit4]   2> 	  "node_name":"127.0.0.1:26267_s%2Ft",
[junit4:junit4]   2> 	  "base_url":"http://127.0.0.1:26267/s/t"}
[junit4:junit4]   2> 11543 T1521 oasc.Overseer$ClusterStateUpdater.updateState Collection already exists with numShards=1
[junit4:junit4]   2> 11544 T1521 oasc.Overseer$ClusterStateUpdater.updateState Assigning new node to shard shard=shard1
[junit4:junit4]   2> 11555 T1520 oascc.ZkStateReader$2.process A cluster state change: WatchedEvent state:SyncConnected type:NodeDataChanged path:/clusterstate.json, has occurred - updating... (live nodes size: 4)
[junit4:junit4]   2> 11555 T1570 oascc.ZkStateReader$2.process A cluster state change: WatchedEvent state:SyncConnected type:NodeDataChanged path:/clusterstate.json, has occurred - updating... (live nodes size: 4)
[junit4:junit4]   2> 11555 T1539 oascc.ZkStateReader$2.process A cluster state change: WatchedEvent state:SyncConnected type:NodeDataChanged path:/clusterstate.json, has occurred - updating... (live nodes size: 4)
[junit4:junit4]   2> 11555 T1554 oascc.ZkStateReader$2.process A cluster state change: WatchedEvent state:SyncConnected type:NodeDataChanged path:/clusterstate.json, has occurred - updating... (live nodes size: 4)
[junit4:junit4]   2> 11555 T1526 oascc.ZkStateReader$2.process A cluster state change: WatchedEvent state:SyncConnected type:NodeDataChanged path:/clusterstate.json, has occurred - updating... (live nodes size: 4)
[junit4:junit4]   2>  C161_STATE=coll:collection1 core:collection1 props:{shard=shard1, roles=null, state=recovering, core=collection1, collection=collection1, node_name=127.0.0.1:59228_s%2Ft, base_url=http://127.0.0.1:59228/s/t}
[junit4:junit4]   2> 12106 T1557 C161 P59228 oasc.RecoveryStrategy.doRecovery Attempting to PeerSync from http://127.0.0.1:16126/s/t/collection1/ core=collection1 - recoveringAfterStartup=true
[junit4:junit4]   2> 12106 T1557 C161 P59228 oasu.PeerSync.sync PeerSync: core=collection1 url=http://127.0.0.1:59228/s/t START replicas=[http://127.0.0.1:16126/s/t/collection1/] nUpdates=100
[junit4:junit4]   2> 12106 T1557 C161 P59228 oasu.PeerSync.sync WARNING no frame of reference to tell of we've missed updates
[junit4:junit4]   2> 12107 T1557 C161 P59228 oasc.RecoveryStrategy.doRecovery PeerSync Recovery was not successful - trying replication. core=collection1
[junit4:junit4]   2> 12107 T1557 C161 P59228 oasc.RecoveryStrategy.doRecovery Starting Replication Recovery. core=collection1
[junit4:junit4]   2> 12107 T1557 C161 P59228 oasc.RecoveryStrategy.doRecovery Begin buffering updates. core=collection1
[junit4:junit4]   2> 12107 T1557 C161 P59228 oasu.UpdateLog.bufferUpdates Starting to buffer updates. FSUpdateLog{state=ACTIVE, tlog=null}
[junit4:junit4]   2> 12107 T1557 C161 P59228 oasc.RecoveryStrategy.replicate Attempting to replicate from http://127.0.0.1:16126/s/t/collection1/. core=collection1
[junit4:junit4]   2> 12108 T1557 C161 P59228 oascsi.HttpClientUtil.createClient Creating new http client, config:maxConnections=128&maxConnectionsPerHost=32&followRedirects=false
[junit4:junit4]   2> ASYNC  NEW_CORE C162 name=collection1 org.apache.solr.core.SolrCore@674e0581 url=http://127.0.0.1:16126/s/t/collection1 node=127.0.0.1:16126_s%2Ft C162_STATE=coll:collection1 core:collection1 props:{shard=shard1, roles=null, state=active, core=collection1, collection=collection1, node_name=127.0.0.1:16126_s%2Ft, base_url=http://127.0.0.1:16126/s/t, leader=true}
[junit4:junit4]   2> 12118 T1530 C162 P16126 REQ /get {getVersions=100&distrib=false&wt=javabin&qt=/get&version=2} status=0 QTime=0 
[junit4:junit4]   2> 12120 T1531 C162 P16126 oasu.DirectUpdateHandler2.commit start commit{,optimize=false,openSearcher=false,waitSearcher=true,expungeDeletes=false,softCommit=false}
[junit4:junit4]   2> 12120 T1531 C162 P16126 oasc.CachingDirectoryFactory.close Releasing directory:/usr/home/hudson/hudson-slave/workspace/Lucene-Solr-Tests-trunk-Java6/solr/build/solr-core/test/J0/./org.apache.solr.cloud.SyncSliceTest-1359124613698/jetty1
[junit4:junit4]   2> 12123 T1531 C162 P16126 oasc.SolrDeletionPolicy.onInit SolrDeletionPolicy.onInit: commits:num=1
[junit4:junit4]   2> 		commit{dir=RateLimitedDirectoryWrapper(NRTCachingDirectory(org.apache.lucene.store.NIOFSDirectory@/usr/home/hudson/hudson-slave/workspace/Lucene-Solr-Tests-trunk-Java6/solr/build/solr-core/test/J0/org.apache.solr.cloud.SyncSliceTest-1359124613698/jetty1/index lockFactory=org.apache.lucene.store.NativeFSLockFactory@46214457; maxCacheMB=48.0 maxMergeSizeMB=4.0)),segFN=segments_1,generation=1,filenames=[segments_1]
[junit4:junit4]   2> 12123 T1531 C162 P16126 oasc.SolrDeletionPolicy.updateCommits newest commit = 1[segments_1]
[junit4:junit4]   2> 12138 T1531 C162 P16126 oasc.SolrDeletionPolicy.onCommit SolrDeletionPolicy.onCommit: commits:num=2
[junit4:junit4]   2> 		commit{dir=RateLimitedDirectoryWrapper(NRTCachingDirectory(org.apache.lucene.store.NIOFSDirectory@/usr/home/hudson/hudson-slave/workspace/Lucene-Solr-Tests-trunk-Java6/solr/build/solr-core/test/J0/org.apache.solr.cloud.SyncSliceTest-1359124613698/jetty1/index lockFactory=org.apache.lucene.store.NativeFSLockFactory@46214457; maxCacheMB=48.0 maxMergeSizeMB=4.0)),segFN=segments_1,generation=1,filenames=[segments_1]
[junit4:junit4]   2> 		commit{dir=RateLimitedDirectoryWrapper(NRTCachingDirectory(org.apache.lucene.store.NIOFSDirectory@/usr/home/hudson/hudson-slave/workspace/Lucene-Solr-Tests-trunk-Java6/solr/build/solr-core/test/J0/org.apache.solr.cloud.SyncSliceTest-1359124613698/jetty1/index lockFactory=org.apache.lucene.store.NativeFSLockFactory@46214457; maxCacheMB=48.0 maxMergeSizeMB=4.0)),segFN=segments_2,generation=2,filenames=[segments_2]
[junit4:junit4]   2> 12138 T1531 C162 P16126 oasc.SolrDeletionPolicy.updateCommits newest commit = 2[segments_2]
[junit4:junit4]   2> 12139 T1531 C162 P16126 oasc.CachingDirectoryFactory.close Releasing directory:/usr/home/hudson/hudson-slave/workspace/Lucene-Solr-Tests-trunk-Java6/solr/build/solr-core/test/J0/./org.apache.solr.cloud.SyncSliceTest-1359124613698/jetty1
[junit4:junit4]   2> 12139 T1531 C162 P16126 oass.SolrIndexSearcher.<init> Opening Searcher@4cbf45af realtime
[junit4:junit4]   2> 12139 T1531 C162 P16126 oasu.DirectUpdateHandler2.commit end_commit_flush
[junit4:junit4]   2> 12139 T1531 C162 P16126 /update {waitSearcher=true&openSearcher=false&commit=true&wt=javabin&commit_end_point=true&version=2&softCommit=false} {commit=} 0 20
[junit4:junit4]   2> 12140 T1557 C161 P59228 oash.ReplicationHandler.inform Commits will be reserved for  10000
[junit4:junit4]   2> 12140 T1557 C161 P59228 oash.SnapPuller.<init>  No value set for 'pollInterval'. Timer Task not started.
[junit4:junit4]   2> 12142 T1532 C162 P16126 oash.ReplicationHandler.inform Commits will be reserved for  10000
[junit4:junit4]   2> 12142 T1532 C162 P16126 REQ /replication {command=indexversion&qt=/replication&wt=javabin&version=2} status=0 QTime=1 
[junit4:junit4]   2> 12142 T1557 C161 P59228 oash.SnapPuller.fetchLatestIndex Master's generation: 2
[junit4:junit4]   2> 12142 T1557 C161 P59228 oash.SnapPuller.fetchLatestIndex Slave's generation: 1
[junit4:junit4]   2> 12142 T1557 C161 P59228 oash.SnapPuller.fetchLatestIndex Starting replication process
[junit4:junit4]   2> 12145 T1532 C162 P16126 oasc.CachingDirectoryFactory.close Releasing directory:/usr/home/hudson/hudson-slave/workspace/Lucene-Solr-Tests-trunk-Java6/solr/build/solr-core/test/J0/./org.apache.solr.cloud.SyncSliceTest-1359124613698/jetty1
[junit4:junit4]   2> 12145 T1532 C162 P16126 oasc.CachingDirectoryFactory.close Releasing directory:/usr/home/hudson/hudson-slave/workspace/Lucene-Solr-Tests-trunk-Java6/solr/build/solr-core/test/J0/./org.apache.solr.cloud.SyncSliceTest-1359124613698/jetty1/index
[junit4:junit4]   2> 12146 T1532 C162 P16126 REQ /replication {command=filelist&qt=/replication&wt=javabin&generation=2&version=2} status=0 QTime=1 
[junit4:junit4]   2> 12146 T1557 C161 P59228 oash.SnapPuller.fetchLatestIndex Number of files in latest index in master: 1
[junit4:junit4]   2> 12147 T1557 C161 P59228 oasc.CachingDirectoryFactory.get return new directory for /usr/home/hudson/hudson-slave/workspace/Lucene-Solr-Tests-trunk-Java6/solr/build/solr-core/test/J0/./org.apache.solr.cloud.SyncSliceTest-1359124613698/jetty2/index.20130126033705839 forceNew:false
[junit4:junit4]   2> 12147 T1557 C161 P59228 oasc.CachingDirectoryFactory.close Releasing directory:/usr/home/hudson/hudson-slave/workspace/Lucene-Solr-Tests-trunk-Java6/solr/build/solr-core/test/J0/./org.apache.solr.cloud.SyncSliceTest-1359124613698/jetty2
[junit4:junit4]   2> 12147 T1557 C161 P59228 oash.SnapPuller.fetchLatestIndex Starting download to RateLimitedDirectoryWrapper(NRTCachingDirectory(org.apache.lucene.store.NIOFSDirectory@/usr/home/hudson/hudson-slave/workspace/Lucene-Solr-Tests-trunk-Java6/solr/build/solr-core/test/J0/org.apache.solr.cloud.SyncSliceTest-1359124613698/jetty2/index.20130126033705839 lockFactory=org.apache.lucene.store.NativeFSLockFactory@54112a0a; maxCacheMB=48.0 maxMergeSizeMB=4.0)) fullCopy=true
[junit4:junit4]   2> 12150 T1532 C162 P16126 REQ /replication {file=segments_2&command=filecontent&checksum=true&wt=filestream&qt=/replication&generation=2} status=0 QTime=0 
[junit4:junit4]   2> 12151 T1557 C161 P59228 oasc.CachingDirectoryFactory.close Releasing directory:/usr/home/hudson/hudson-slave/workspace/Lucene-Solr-Tests-trunk-Java6/solr/build/solr-core/test/J0/./org.apache.solr.cloud.SyncSliceTest-1359124613698/jetty2/index
[junit4:junit4]   2> 12152 T1557 C161 P59228 oash.SnapPuller.fetchLatestIndex Total time taken for download : 0 secs
[junit4:junit4]   2> 12152 T1557 C161 P59228 oash.SnapPuller.modifyIndexProps New index installed. Updating index properties... index=index.20130126033705839
[junit4:junit4]   2> 12153 T1557 C161 P59228 oasc.CachingDirectoryFactory.close Releasing directory:/usr/home/hudson/hudson-slave/workspace/Lucene-Solr-Tests-trunk-Java6/solr/build/solr-core/test/J0/./org.apache.solr.cloud.SyncSliceTest-1359124613698/jetty2
[junit4:junit4]   2> 12154 T1557 C161 P59228 oasc.CachingDirectoryFactory.close Releasing directory:/usr/home/hudson/hudson-slave/workspace/Lucene-Solr-Tests-trunk-Java6/solr/build/solr-core/test/J0/./org.apache.solr.cloud.SyncSliceTest-1359124613698/jetty2
[junit4:junit4]   2> 12154 T1557 C161 P59228 oasc.SolrCore.getNewIndexDir New index directory detected: old=./org.apache.solr.cloud.SyncSliceTest-1359124613698/jetty2/index/ new=./org.apache.solr.cloud.SyncSliceTest-1359124613698/jetty2/index.20130126033705839
[junit4:junit4]   2> 12157 T1557 C161 P59228 oasc.SolrDeletionPolicy.onInit SolrDeletionPolicy.onInit: commits:num=1
[junit4:junit4]   2> 		commit{dir=RateLimitedDirectoryWrapper(NRTCachingDirectory(org.apache.lucene.store.NIOFSDirectory@/usr/home/hudson/hudson-slave/workspace/Lucene-Solr-Tests-trunk-Java6/solr/build/solr-core/test/J0/org.apache.solr.cloud.SyncSliceTest-1359124613698/jetty2/index.20130126033705839 lockFactory=org.apache.lucene.store.NativeFSLockFactory@54112a0a; maxCacheMB=48.0 maxMergeSizeMB=4.0)),segFN=segments_2,generation=2,filenames=[segments_2]
[junit4:junit4]   2> 12158 T1557 C161 P59228 oasc.SolrDeletionPolicy.updateCommits newest commit = 2[segments_2]
[junit4:junit4]   2> 12159 T1557 C161 P59228 oasc.CachingDirectoryFactory.close Releasing directory:/usr/home/hudson/hudson-slave/workspace/Lucene-Solr-Tests-trunk-Java6/solr/build/solr-core/test/J0/./org.apache.solr.cloud.SyncSliceTest-1359124613698/jetty2
[junit4:junit4]   2> 12159 T1557 C161 P59228 oasu.DefaultSolrCoreState.newIndexWriter Creating new IndexWriter...
[junit4:junit4]   2> 12159 T1557 C161 P59228 oasu.DefaultSolrCoreState.newIndexWriter Waiting until IndexWriter is unused... core=collection1
[junit4:junit4]   2> 12160 T1557 C161 P59228 oasu.DefaultSolrCoreState.newIndexWriter Rollback old IndexWriter... core=collection1
[junit4:junit4]   2> 12160 T1557 C161 P59228 oasc.CachingDirectoryFactory.close Releasing directory:/usr/home/hudson/hudson-slave/workspace/Lucene-Solr-Tests-trunk-Java6/solr/build/solr-core/test/J0/./org.apache.solr.cloud.SyncSliceTest-1359124613698/jetty2/index.20130126033705839
[junit4:junit4]   2> 12161 T1557 C161 P59228 oasc.CachingDirectoryFactory.close Releasing directory:/usr/home/hudson/hudson-slave/workspace/Lucene-Solr-Tests-trunk-Java6/solr/build/solr-core/test/J0/./org.apache.solr.cloud.SyncSliceTest-1359124613698/jetty2
[junit4:junit4]   2> 12164 T1557 C161 P59228 oasc.SolrDeletionPolicy.onInit SolrDeletionPolicy.onInit: commits:num=1
[junit4:junit4]   2> 		commit{dir=RateLimitedDirectoryWrapper(NRTCachingDirectory(org.apache.lucene.store.NIOFSDirectory@/usr/home/hudson/hudson-slave/workspace/Lucene-Solr-Tests-trunk-Java6/solr/build/solr-core/test/J0/org.apache.solr.cloud.SyncSliceTest-1359124613698/jetty2/index.20130126033705839 lockFactory=org.apache.lucene.store.NativeFSLockFactory@54112a0a; maxCacheMB=48.0 maxMergeSizeMB=4.0)),segFN=segments_2,generation=2,filenames=[segments_2]
[junit4:junit4]   2> 12164 T1557 C161 P59228 oasc.SolrDeletionPolicy.updateCommits newest commit = 2[segments_2]
[junit4:junit4]   2> 12164 T1557 C161 P59228 oasu.DefaultSolrCoreState.newIndexWriter New IndexWriter is ready to be used.
[junit4:junit4]   2> 12165 T1557 C161 P59228 oasc.CachingDirectoryFactory.close Releasing directory:/usr/home/hudson/hudson-slave/workspace/Lucene-Solr-Tests-trunk-Java6/solr/build/solr-core/test/J0/./org.apache.solr.cloud.SyncSliceTest-1359124613698/jetty2
[junit4:junit4]   2> 12165 T1557 C161 P59228 oass.SolrIndexSearcher.<init> Opening Searcher@56784481 main
[junit4:junit4]   2> 12166 T1556 oasc.SolrCore.registerSearcher [collection1] Registered new searcher Searcher@56784481 main{StandardDirectoryReader(segments_2:1:nrt)}
[junit4:junit4]   2> 12167 T1556 oasc.CachingDirectoryFactory.close Releasing directory:/usr/home/hudson/hudson-slave/workspace/Lucene-Solr-Tests-trunk-Java6/solr/build/solr-core/test/J0/./org.apache.solr.cloud.SyncSliceTest-1359124613698/jetty2/index
[junit4:junit4]   2> 12167 T1557 C161 P59228 oasu.DirectUpdateHandler2.commit start commit{,optimize=false,openSearcher=false,waitSearcher=false,expungeDeletes=false,softCommit=false}
[junit4:junit4]   2> 12170 T1557 C161 P59228 oasc.SolrDeletionPolicy.onCommit SolrDeletionPolicy.onCommit: commits:num=2
[junit4:junit4]   2> 		commit{dir=RateLimitedDirectoryWrapper(NRTCachingDirectory(org.apache.lucene.store.NIOFSDirectory@/usr/home/hudson/hudson-slave/workspace/Lucene-Solr-Tests-trunk-Java6/solr/build/solr-core/test/J0/org.apache.solr.cloud.SyncSliceTest-1359124613698/jetty2/index.20130126033705839 lockFactory=org.apache.lucene.store.NativeFSLockFactory@54112a0a; maxCacheMB=48.0 maxMergeSizeMB=4.0)),segFN=segments_2,generation=2,filenames=[segments_2]
[junit4:junit4]   2> 		commit{dir=RateLimitedDirectoryWrapper(NRTCachingDirectory(org.apache.lucene.store.NIOFSDirectory@/usr/home/hudson/hudson-slave/workspace/Lucene-Solr-Tests-trunk-Java6/solr/build/solr-core/test/J0/org.apache.solr.cloud.SyncSliceTest-1359124613698/jetty2/index.20130126033705839 lockFactory=org.apache.lucene.store.NativeFSLockFactory@54112a0a; maxCacheMB=48.0 maxMergeSizeMB=4.0)),segFN=segments_3,generation=3,filenames=[segments_3]
[junit4:junit4]   2> 12171 T1557 C161 P59228 oasc.SolrDeletionPolicy.updateCommits newest commit = 3[segments_3]
[junit4:junit4]   2> 12172 T1557 C161 P59228 oasc.CachingDirectoryFactory.close Releasing directory:/usr/home/hudson/hudson-slave/workspace/Lucene-Solr-Tests-trunk-Java6/solr/build/solr-core/test/J0/./org.apache.solr.cloud.SyncSliceTest-1359124613698/jetty2
[junit4:junit4]   2> 12172 T1557 C161 P59228 oasu.DirectUpdateHandler2.commit end_commit_flush
[junit4:junit4]   2> 12172 T1557 C161 P59228 oasc.CachingDirectoryFactory.close Releasing directory:/usr/home/hudson/hudson-slave/workspace/Lucene-Solr-Tests-trunk-Java6/solr/build/solr-core/test/J0/./org.apache.solr.cloud.SyncSliceTest-1359124613698/jetty2/index.20130126033705839
[junit4:junit4]   2> 12172 T1557 C161 P59228 oasc.CachingDirectoryFactory.close Releasing directory:/usr/home/hudson/hudson-slave/workspace/Lucene-Solr-Tests-trunk-Java6/solr/build/solr-core/test/J0/./org.apache.solr.cloud.SyncSliceTest-1359124613698/jetty2/index
[junit4:junit4]   2> 12173 T1557 C161 P59228 oasc.RecoveryStrategy.replay No replay needed. core=collection1
[junit4:junit4]   2> 12173 T1557 C161 P59228 oasc.RecoveryStrategy.doRecovery Replication Recovery was successful - registering as Active. core=collection1
[junit4:junit4]   2> 12173 T1557 C161 P59228 oasc.ZkController.publish publishing core=collection1 state=active
[junit4:junit4]   2> 12173 T1557 C161 P59228 oasc.ZkController.publish numShards not found on descriptor - reading it from system property
[junit4:junit4]   2> 12181 T1557 C161 P59228 oasc.RecoveryStrategy.doRecovery Finished recovery process. core=collection1
[junit4:junit4]   2> 12403 T1571 oasc.CoreContainer.registerCore registering core: collection1
[junit4:junit4]   2> 12403 T1571 oasc.ZkController.register Register replica - core:collection1 address:http://127.0.0.1:26267/s/t collection:collection1 shard:shard1
[junit4:junit4]   2> 12406 T1571 oasc.ZkController.register We are http://127.0.0.1:26267/s/t/collection1/ and leader is http://127.0.0.1:16126/s/t/collection1/
[junit4:junit4]   2> 12406 T1571 oasc.ZkController.register No LogReplay needed for core=collection1 baseURL=http://127.0.0.1:26267/s/t
[junit4:junit4]   2> 12406 T1571 oasc.ZkController.checkRecovery Core needs to recover:collection1
[junit4:junit4]   2> 12406 T1571 oasu.DefaultSolrCoreState.doRecovery Running recovery - first canceling any ongoing recovery
[junit4:junit4]   2> ASYNC  NEW_CORE C163 name=collection1 org.apache.solr.core.SolrCore@73172383 url=http://127.0.0.1:26267/s/t/collection1 node=127.0.0.1:26267_s%2Ft C163_STATE=coll:collection1 core:collection1 props:{shard=null, roles=null, state=down, core=collection1, collection=collection1, node_name=127.0.0.1:26267_s%2Ft, base_url=http://127.0.0.1:26267/s/t}
[junit4:junit4]   2> 12407 T1575 C163 P26267 oasc.RecoveryStrategy.run Starting recovery process.  core=collection1 recoveringAfterStartup=true
[junit4:junit4]   2> 12407 T1575 C163 P26267 oasc.RecoveryStrategy.doRecovery ###### startupVersions=[]
[junit4:junit4]   2> 12407 T1571 oascc.ZkStateReader.updateClusterState Updating cloud state from ZooKeeper... 
[junit4:junit4]   2> 12407 T1575 C163 P26267 oasc.ZkController.publish publishing core=collection1 state=recovering
[junit4:junit4]   2> 12407 T1575 C163 P26267 oasc.ZkController.publish numShards not found on descriptor - reading it from system property
[junit4:junit4]   2> 12408 T1498 oass.SolrDispatchFilter.init user.dir=/usr/home/hudson/hudson-slave/workspace/Lucene-Solr-Tests-trunk-Java6/solr/build/solr-core/test/J0
[junit4:junit4]   2> 12408 T1498 oass.SolrDispatchFilter.init SolrDispatchFilter.init() done
[junit4:junit4]   2> 12409 T1575 C163 P26267 oascsi.HttpClientUtil.createClient Creating new http client, config:maxConnections=128&maxConnectionsPerHost=32&followRedirects=false
[junit4:junit4]   2> 12409 T1498 oascsi.HttpClientUtil.createClient Creating new http client, config:maxConnections=128&maxConnectionsPerHost=32&followRedirects=false
[junit4:junit4]   2> 12541 T1498 oejs.Server.doStart jetty-8.1.8.v20121106
[junit4:junit4]   2> 12543 T1498 oejs.AbstractConnector.doStart Started SocketConnector@127.0.0.1:40908
[junit4:junit4]   2> 12544 T1498 oass.SolrDispatchFilter.init SolrDispatchFilter.init()
[junit4:junit4]   2> 12544 T1498 oasc.SolrResourceLoader.locateSolrHome JNDI not configured for solr (NoInitialContextEx)
[junit4:junit4]   2> 12544 T1498 oasc.SolrResourceLoader.locateSolrHome using system property solr.solr.home: /usr/home/hudson/hudson-slave/workspace/Lucene-Solr-Tests-trunk-Java6/solr/build/solr-core/test/J0/./org.apache.solr.cloud.SyncSliceTest-jetty4-1359124626114
[junit4:junit4]   2> 12545 T1498 oasc.CoreContainer$Initializer.initialize looking for solr.xml: /usr/home/hudson/hudson-slave/workspace/Lucene-Solr-Tests-trunk-Java6/solr/build/solr-core/test/J0/./org.apache.solr.cloud.SyncSliceTest-jetty4-1359124626114/solr.xml
[junit4:junit4]   2> 12545 T1498 oasc.CoreContainer.<init> New CoreContainer 415812917
[junit4:junit4]   2> 12545 T1498 oasc.CoreContainer.load Loading CoreContainer using Solr Home: '/usr/home/hudson/hudson-slave/workspace/Lucene-Solr-Tests-trunk-Java6/solr/build/solr-core/test/J0/./org.apache.solr.cloud.SyncSliceTest-jetty4-1359124626114/'
[junit4:junit4]   2> 12545 T1498 oasc.SolrResourceLoader.<init> new SolrResourceLoader for directory: '/usr/home/hudson/hudson-slave/workspace/Lucene-Solr-Tests-trunk-Java6/solr/build/solr-core/test/J0/./org.apache.solr.cloud.SyncSliceTest-jetty4-1359124626114/'
[junit4:junit4]   2> 12577 T1498 oashc.HttpShardHandlerFactory.getParameter Setting socketTimeout to: 60000
[junit4:junit4]   2> 12577 T1498 oashc.HttpShardHandlerFactory.getParameter Setting urlScheme to: http://
[junit4:junit4]   2> 12578 T1498 oashc.HttpShardHandlerFactory.getParameter Setting connTimeout to: 15000
[junit4:junit4]   2> 12578 T1498 oashc.HttpShardHandlerFactory.getParameter Setting maxConnectionsPerHost to: 20
[junit4:junit4]   2> 12578 T1498 oashc.HttpShardHandlerFactory.getParameter Setting corePoolSize to: 0
[junit4:junit4]   2> 12579 T1498 oashc.HttpShardHandlerFactory.getParameter Setting maximumPoolSize to: 2147483647
[junit4:junit4]   2> 12579 T1498 oashc.HttpShardHandlerFactory.getParameter Setting maxThreadIdleTime to: 5
[junit4:junit4]   2> 12579 T1498 oashc.HttpShardHandlerFactory.getParameter Setting sizeOfQueue to: -1
[junit4:junit4]   2> 12579 T1498 oashc.HttpShardHandlerFactory.getParameter Setting fairnessPolicy to: false
[junit4:junit4]   2> 12580 T1498 oascsi.HttpClientUtil.createClient Creating new http client, config:maxConnectionsPerHost=20&maxConnections=10000&socketTimeout=60000&connTimeout=15000&retry=false
[junit4:junit4]   2> 12594 T1498 oasc.CoreContainer.load Registering Log Listener
[junit4:junit4]   2> 12607 T1498 oasc.CoreContainer.initZooKeeper Zookeeper client=127.0.0.1:38917/solr
[junit4:junit4]   2> 12608 T1498 oasc.ZkController.checkChrootPath zkHost includes chroot
[junit4:junit4]   2> 12608 T1498 oaz.ZooKeeper.<init> Initiating client connection, connectString=127.0.0.1:38917 sessionTimeout=60000 watcher=org.apache.solr.common.cloud.ConnectionManager@3117c5ac
[junit4:junit4]   2> 12609 T1498 oascc.ConnectionManager.waitForConnected Waiting for client to connect to ZooKeeper
[junit4:junit4]   2> 12609 T1585 oaz.ClientCnxn$SendThread.logStartConnect Opening socket connection to server localhost/127.0.0.1:38917. Will not attempt to authenticate using SASL (access denied (javax.security.auth.AuthPermission getLoginConfiguration))
[junit4:junit4]   2> 12610 T1585 oaz.ClientCnxn$SendThread.primeConnection Socket connection established to localhost/127.0.0.1:38917, initiating session
[junit4:junit4]   2> 12610 T1500 oazs.NIOServerCnxnFactory.run Accepted socket connection from /140.211.11.196:62545
[junit4:junit4]   2> 12611 T1500 oazs.ZooKeeperServer.processConnectRequest Client attempting to establish new session at /140.211.11.196:62545
[junit4:junit4]   2> 12612 T1502 oazs.ZooKeeperServer.finishSessionInit Established session 0x13c7223ca47000b with negotiated timeout 20000 for client /140.211.11.196:62545
[junit4:junit4]   2> 12612 T1585 oaz.ClientCnxn$SendThread.onConnected Session establishment complete on server localhost/127.0.0.1:38917, sessionid = 0x13c7223ca47000b, negotiated timeout = 20000
[junit4:junit4]   2> 12613 T1586 oascc.ConnectionManager.process Watcher org.apache.solr.common.cloud.ConnectionManager@3117c5ac name:ZooKeeperConnection Watcher:127.0.0.1:38917 got event WatchedEvent state:SyncConnected type:None path:null path:null type:None
[junit4:junit4]   2> 12613 T1498 oascc.ConnectionManager.waitForConnected Client is connected to ZooKeeper
[junit4:junit4]   2> 12614 T1503 oazs.PrepRequestProcessor.pRequest2Txn Processed session termination for sessionid: 0x13c7223ca47000b
[junit4:junit4]   2> 12615 T1586 oaz.ClientCnxn$EventThread.run EventThread shut down
[junit4:junit4]   2> 12615 T1500 oazs.NIOServerCnxn.closeSock Closed socket connection for client /140.211.11.196:62545 which had sessionid 0x13c7223ca47000b
[junit4:junit4]   2> 12615 T1498 oaz.ZooKeeper.close Session: 0x13c7223ca47000b closed
[junit4:junit4]   2> 12616 T1498 oascsi.HttpClientUtil.createClient Creating new http client, config:maxConnections=500&maxConnectionsPerHost=16&socketTimeout=60000&connTimeout=15000
[junit4:junit4]   2> 12623 T1498 oaz.ZooKeeper.<init> Initiating client connection, connectString=127.0.0.1:38917/solr sessionTimeout=30000 watcher=org.apache.solr.common.cloud.ConnectionManager@1008da34
[junit4:junit4]   2> 12624 T1498 oascc.ConnectionManager.waitForConnected Waiting for client to connect to ZooKeeper
[junit4:junit4]   2> 12624 T1587 oaz.ClientCnxn$SendThread.logStartConnect Opening socket connection to server localhost/127.0.0.1:38917. Will not attempt to authenticate using SASL (access denied (javax.security.auth.AuthPermission getLoginConfiguration))
[junit4:junit4]   2> 12624 T1587 oaz.ClientCnxn$SendThread.primeConnection Socket connection established to localhost/127.0.0.1:38917, initiating session
[junit4:junit4]   2> 12624 T1500 oazs.NIOServerCnxnFactory.run Accepted socket connection from /140.211.11.196:58237
[junit4:junit4]   2> 12624 T1500 oazs.ZooKeeperServer.processConnectRequest Client attempting to establish new session at /140.211.11.196:58237
[junit4:junit4]   2> 12626 T1502 oazs.ZooKeeperServer.finishSessionInit Established session 0x13c7223ca47000c with negotiated timeout 20000 for client /140.211.11.196:58237
[junit4:junit4]   2> 12626 T1587 oaz.ClientCnxn$SendThread.onConnected Session establishment complete on server localhost/127.0.0.1:38917, sessionid = 0x13c7223ca47000c, negotiated timeout = 20000
[junit4:junit4]   2> 12626 T1588 oascc.ConnectionManager.process Watcher org.apache.solr.common.cloud.ConnectionManager@1008da34 name:ZooKeeperConnection Watcher:127.0.0.1:38917/solr got event WatchedEvent state:SyncConnected type:None path:null path:null type:None
[junit4:junit4]   2> 12626 T1498 oascc.ConnectionManager.waitForConnected Client is connected to ZooKeeper
[junit4:junit4]   2> 12627 T1503 oazs.PrepRequestProcessor.pRequest Got user-level KeeperException when processing sessionid:0x13c7223ca47000c type:create cxid:0x1 zxid:0x92 txntype:-1 reqpath:n/a Error Path:/solr/overseer Error:KeeperErrorCode = NodeExists for /solr/overseer
[junit4:junit4]   2> 12628 T1503 oazs.PrepRequestProcessor.pRequest Got user-level KeeperException when processing sessionid:0x13c7223ca47000c type:create cxid:0x2 zxid:0x93 txntype:-1 reqpath:n/a Error Path:/solr/overseer Error:KeeperErrorCode = NodeExists for /solr/overseer
[junit4:junit4]   2> 12637 T1498 oasc.ZkController.createEphemeralLiveNode Register node as live in ZooKeeper:/live_nodes/127.0.0.1:40908_s%2Ft
[junit4:junit4]   2> 12638 T1503 oazs.PrepRequestProcessor.pRequest Got user-level KeeperException when processing sessionid:0x13c7223ca47000c type:delete cxid:0x4 zxid:0x94 txntype:-1 reqpath:n/a Error Path:/solr/live_nodes/127.0.0.1:40908_s%2Ft Error:KeeperErrorCode = NoNode for /solr/live_nodes/127.0.0.1:40908_s%2Ft
[junit4:junit4]   2> 12639 T1498 oascc.SolrZkClient.makePath makePath: /live_nodes/127.0.0.1:40908_s%2Ft
[junit4:junit4]   2> 12641 T1539 oascc.ZkStateReader$2.process A cluster state change: WatchedEvent state:SyncConnected type:NodeChildrenChanged path:/live_nodes, has occurred - updating... (live nodes size: 4)
[junit4:junit4]   2> 12642 T1520 oascc.ZkStateReader$3.process Updating live nodes... (5)
[junit4:junit4]   2> 12642 T1554 oascc.ZkStateReader$3.process Updating live nodes... (5)
[junit4:junit4]   2> 12642 T1520 oascc.ZkStateReader$2.process A cluster state change: WatchedEvent state:SyncConnected type:NodeChildrenChanged path:/live_nodes, has occurred - updating... (live nodes size: 5)
[junit4:junit4]   2> 12642 T1570 oascc.ZkStateReader$3.process Updating live nodes... (5)
[junit4:junit4]   2> 12642 T1526 oascc.ZkStateReader$3.process Updating live nodes... (5)
[junit4:junit4]   2> 12642 T1570 oascc.ZkStateReader$2.process A cluster state change: WatchedEvent state:SyncConnected type:NodeChildrenChanged path:/live_nodes, has occurred - updating... (live nodes size: 5)
[junit4:junit4]   2> 12642 T1554 oascc.ZkStateReader$2.process A cluster state change: WatchedEvent state:SyncConnected type:NodeChildrenChanged path:/live_nodes, has occurred - updating... (live nodes size: 5)
[junit4:junit4]   2> 12642 T1526 oascc.ZkStateReader$2.process A cluster state change: WatchedEvent state:SyncConnected type:NodeChildrenChanged path:/live_nodes, has occurred - updating... (live nodes size: 5)
[junit4:junit4]   2> 12643 T1539 oascc.ZkStateReader$3.process Updating live nodes... (5)
[junit4:junit4]   2> 12651 T1498 oascc.ZkStateReader.createClusterStateWatchersAndUpdate Updating cluster state from ZooKeeper... 
[junit4:junit4]   2> 12656 T1589 oasc.CoreContainer.create Creating SolrCore 'collection1' using instanceDir: /usr/home/hudson/hudson-slave/workspace/Lucene-Solr-Tests-trunk-Java6/solr/build/solr-core/test/J0/./org.apache.solr.cloud.SyncSliceTest-jetty4-1359124626114/collection1
[junit4:junit4]   2> 12656 T1589 oasc.ZkController.createCollectionZkNode Check for collection zkNode:collection1
[junit4:junit4]   2> 12657 T1589 oasc.ZkController.createCollectionZkNode Collection zkNode exists
[junit4:junit4]   2> 12657 T1589 oasc.ZkController.readConfigName Load collection config from:/collections/collection1
[junit4:junit4]   2> 12658 T1589 oasc.SolrResourceLoader.<init> new SolrResourceLoader for directory: '/usr/home/hudson/hudson-slave/workspace/Lucene-Solr-Tests-trunk-Java6/solr/build/solr-core/test/J0/./org.apache.solr.cloud.SyncSliceTest-jetty4-1359124626114/collection1/'
[junit4:junit4]   2> 12659 T1589 oasc.SolrResourceLoader.replaceClassLoader Adding 'file:/usr/home/hudson/hudson-slave/workspace/Lucene-Solr-Tests-trunk-Java6/solr/build/solr-core/test/J0/org.apache.solr.cloud.SyncSliceTest-jetty4-1359124626114/collection1/lib/README' to classloader
[junit4:junit4]   2> 12659 T1589 oasc.SolrResourceLoader.replaceClassLoader Adding 'file:/usr/home/hudson/hudson-slave/workspace/Lucene-Solr-Tests-trunk-Java6/solr/build/solr-core/test/J0/org.apache.solr.cloud.SyncSliceTest-jetty4-1359124626114/collection1/lib/classes/' to classloader
[junit4:junit4]   2> 12704 T1589 oasc.SolrConfig.<init> Using Lucene MatchVersion: LUCENE_50
[junit4:junit4]   2> 12780 T1589 oasc.SolrConfig.<init> Loaded SolrConfig: solrconfig.xml
[junit4:junit4]   2> 12881 T1589 oass.IndexSchema.readSchema Reading Solr Schema
[junit4:junit4]   2> 12887 T1589 oass.IndexSchema.readSchema Schema name=test
[junit4:junit4]   2> 13060 T1521 oascc.ZkStateReader.updateClusterState Updating cloud state from ZooKeeper... 
[junit4:junit4]   2> 13060 T1521 oasc.Overseer$ClusterStateUpdater.updateState Update state numShards=1 message={
[junit4:junit4]   2> 	  "operation":"state",
[junit4:junit4]   2> 	  "numShards":"1",
[junit4:junit4]   2> 	  "shard":"shard1",
[junit4:junit4]   2> 	  "roles":null,
[junit4:junit4]   2> 	  "state":"active",
[junit4:junit4]   2> 	  "core":"collection1",
[junit4:junit4]   2> 	  "collection":"collection1",
[junit4:junit4]   2> 	  "node_name":"127.0.0.1:59228_s%2Ft",
[junit4:junit4]   2> 	  "base_url":"http://127.0.0.1:59228/s/t"}
[junit4:junit4]   2> 13064 T1521 oasc.Overseer$ClusterStateUpdater.updateState Update state numShards=1 message={
[junit4:junit4]   2> 	  "operation":"state",
[junit4:junit4]   2> 	  "numShards":"1",
[junit4:junit4]   2> 	  "shard":"shard1",
[junit4:junit4]   2> 	  "roles":null,
[junit4:junit4]   2> 	  "state":"recovering",
[junit4:junit4]   2> 	  "core":"collection1",
[junit4:junit4]   2> 	  "collection":"collection1",
[junit4:junit4]   2> 	  "node_name":"127.0.0.1:26267_s%2Ft",
[junit4:junit4]   2> 	  "base_url":"http://127.0.0.1:26267/s/t"}
[junit4:junit4]   2> 13077 T1588 oascc.ZkStateReader$2.process A cluster state change: WatchedEvent state:SyncConnected type:NodeDataChanged path:/clusterstate.json, has occurred - updating... (live nodes size: 5)
[junit4:junit4]   2> 13077 T1554 oascc.ZkStateReader$2.process A cluster state change: WatchedEvent state:SyncConnected type:NodeDataChanged path:/clusterstate.json, has occurred - updating... (live nodes size: 5)
[junit4:junit4]   2> 13077 T1539 oascc.ZkStateReader$2.process A cluster state change: WatchedEvent state:SyncConnected type:NodeDataChanged path:/clusterstate.json, has occurred - updating... (live nodes size: 5)
[junit4:junit4]   2> 13077 T1570 oascc.ZkStateReader$2.process A cluster state change: WatchedEvent state:SyncConnected type:NodeDataChanged path:/clusterstate.json, has occurred - updating... (live nodes size: 5)
[junit4:junit4]   2> 13077 T1520 oascc.ZkStateReader$2.process A cluster state change: WatchedEvent state:SyncConnected type:NodeDataChanged path:/clusterstate.json, has occurred - updating... (live nodes size: 5)
[junit4:junit4]   2> 13077 T1526 oascc.ZkStateReader$2.process A cluster state change: WatchedEvent state:SyncConnected type:NodeDataChanged path:/clusterstate.json, has occurred - updating... (live nodes size: 5)
[junit4:junit4]   2> 13501 T1589 oass.OpenExchangeRatesOrgProvider.init Initialized with rates=open-exchange-rates.json, refreshInterval=1440.
[junit4:junit4]   2> 13512 T1589 oass.IndexSchema.readSchema default search field in schema is text
[junit4:junit4]   2> 13517 T1589 oass.IndexSchema.readSchema unique key field: id
[junit4:junit4]   2> 13534 T1589 oass.FileExchangeRateProvider.reload Reloading exchange rates from file currency.xml
[junit4:junit4]   2> 13539 T1589 oass.FileExchangeRateProvider.reload Reloading exchange rates from file currency.xml
[junit4:junit4]   2> 13543 T1589 oass.OpenExchangeRatesOrgProvider.reload Reloading exchange rates from open-exchange-rates.json
[junit4:junit4]   2> 13545 T1589 oass.OpenExchangeRatesOrgProvider.reload Reloading exchange rates from open-exchange-rates.json
[junit4:junit4]   2> 13546 T1589 oasc.SolrCore.<init> [collection1] Opening new SolrCore at /usr/home/hudson/hudson-slave/workspace/Lucene-Solr-Tests-trunk-Java6/solr/build/solr-core/test/J0/./org.apache.solr.cloud.SyncSliceTest-jetty4-1359124626114/collection1/, dataDir=./org.apache.solr.cloud.SyncSliceTest-1359124613698/jetty4/
[junit4:junit4]   2> 13546 T1589 oasc.JmxMonitoredMap.<init> JMX monitoring is enabled. Adding Solr mbeans to JMX Server: com.sun.jmx.mbeanserver.JmxMBeanServer@10cbd8dc
[junit4:junit4]   2> 13546 T1589 oasc.SolrCore.initDirectoryFactory solr.NRTCachingDirectoryFactory
[junit4:junit4]   2> 13547 T1589 oasc.CachingDirectoryFactory.get return new directory for /usr/home/hudson/hudson-slave/workspace/Lucene-Solr-Tests-trunk-Java6/solr/build/solr-core/test/J0/./org.apache.solr.cloud.SyncSliceTest-1359124613698/jetty4 forceNew:false
[junit4:junit4]   2> 13548 T1589 oasc.CachingDirectoryFactory.close Releasing directory:/usr/home/hudson/hudson-slave/workspace/Lucene-Solr-Tests-trunk-Java6/solr/build/solr-core/test/J0/./org.apache.solr.cloud.SyncSliceTest-1359124613698/jetty4
[junit4:junit4]   2> 13548 T1589 oasc.SolrCore.getNewIndexDir New index directory detected: old=null new=./org.apache.solr.cloud.SyncSliceTest-1359124613698/jetty4/index/
[junit4:junit4]   2> 13549 T1589 oasc.SolrCore.initIndex WARNING [collection1] Solr index directory './org.apache.solr.cloud.SyncSliceTest-1359124613698/jetty4/index' doesn't exist. Creating new index...
[junit4:junit4]   2> 13549 T1589 oasc.CachingDirectoryFactory.get return new directory for /usr/home/hudson/hudson-slave/workspace/Lucene-Solr-Tests-trunk-Java6/solr/build/solr-core/test/J0/./org.apache.solr.cloud.SyncSliceTest-1359124613698/jetty4/index forceNew:false
[junit4:junit4]   2> 13555 T1589 oasc.SolrDeletionPolicy.onCommit SolrDeletionPolicy.onCommit: commits:num=1
[junit4:junit4]   2> 		commit{dir=RateLimitedDirectoryWrapper(NRTCachingDirectory(org.apache.lucene.store.NIOFSDirectory@/usr/home/hudson/hudson-slave/workspace/Lucene-Solr-Tests-trunk-Java6/solr/build/solr-core/test/J0/org.apache.solr.cloud.SyncSliceTest-1359124613698/jetty4/index lockFactory=org.apache.lucene.store.NativeFSLockFactory@7ea86100; maxCacheMB=48.0 maxMergeSizeMB=4.0)),segFN=segments_1,generation=1,filenames=[segments_1]
[junit4:junit4]   2> 13555 T1589 oasc.SolrDeletionPolicy.updateCommits newest commit = 1[segments_1]
[junit4:junit4]   2> 13556 T1589 oasc.CachingDirectoryFactory.close Releasing directory:/usr/home/hudson/hudson-slave/workspace/Lucene-Solr-Tests-trunk-Java6/solr/build/solr-core/test/J0/./org.apache.solr.cloud.SyncSliceTest-1359124613698/jetty4/index
[junit4:junit4]   2> 13557 T1589 oasc.SolrCore.initWriters created xml: solr.XMLResponseWriter
[junit4:junit4]   2> 13558 T1589 oasup.UpdateRequestProcessorChain.init inserting DistributedUpdateProcessorFactory into updateRequestProcessorChain "dedupe"
[junit4:junit4]   2> 13559 T1589 oasup.UpdateRequestProcessorChain.init inserting DistributedUpdateProcessorFactory into updateRequestProcessorChain "dedupe-allfields"
[junit4:junit4]   2> 13559 T1589 oasup.UpdateRequestProcessorChain.init inserting DistributedUpdateProcessorFactory into updateRequestProcessorChain "stored_sig"
[junit4:junit4]   2> 13559 T1589 oasup.UpdateRequestProcessorChain.init inserting DistributedUpdateProcessorFactory into updateRequestProcessorChain "uniq-fields"
[junit4:junit4]   2> 13560 T1589 oasup.UpdateRequestProcessorChain.init inserting DistributedUpdateProcessorFactory into updateRequestProcessorChain "distrib-dup-test-chain-implicit"
[junit4:junit4]   2> 13560 T1589 oasc.RequestHandlers.initHandlersFromConfig adding lazy requestHandler: solr.ReplicationHandler
[junit4:junit4]   2> 13560 T1589 oasc.RequestHandlers.initHandlersFromConfig created /replication: solr.ReplicationHandler
[junit4:junit4]   2> 13561 T1589 oasc.RequestHandlers.initHandlersFromConfig created standard: solr.StandardRequestHandler
[junit4:junit4]   2> 13561 T1589 oasc.RequestHandlers.initHandlersFromConfig created /get: solr.RealTimeGetHandler
[junit4:junit4]   2> 13562 T1589 oasc.RequestHandlers.initHandlersFromConfig created dismax: solr.SearchHandler
[junit4:junit4]   2> 13562 T1589 oasc.RequestHandlers.initHandlersFromConfig created mock: org.apache.solr.core.MockQuerySenderListenerReqHandler
[junit4:junit4]   2> 13563 T1589 oasc.RequestHandlers.initHandlersFromConfig created /admin/: org.apache.solr.handler.admin.AdminHandlers
[junit4:junit4]   2> 13563 T1589 oasc.RequestHandlers.initHandlersFromConfig created defaults: solr.StandardRequestHandler
[junit4:junit4]   2> 13563 T1589 oasc.RequestHandlers.initHandlersFromConfig adding lazy requestHandler: solr.StandardRequestHandler
[junit4:junit4]   2> 13563 T1589 oasc.RequestHandlers.initHandlersFromConfig created lazy: solr.StandardRequestHandler
[junit4:junit4]   2> 13564 T1589 oasc.RequestHandlers.initHandlersFromConfig created /update: solr.UpdateRequestHandler
[junit4:junit4]   2> 13564 T1589 oasc.RequestHandlers.initHandlersFromConfig created /terms: org.apache.solr.handler.component.SearchHandler
[junit4:junit4]   2> 13565 T1589 oasc.RequestHandlers.initHandlersFromConfig created spellCheckCompRH: org.apache.solr.handler.component.SearchHandler
[junit4:junit4]   2> 13565 T1589 oasc.RequestHandlers.initHandlersFromConfig created spellCheckCompRH_Direct: org.apache.solr.handler.component.SearchHandler
[junit4:junit4]   2> 13566 T1589 oasc.RequestHandlers.initHandlersFromConfig created spellCheckWithWordbreak: org.apache.solr.handler.component.SearchHandler
[junit4:junit4]   2> 13566 T1589 oasc.RequestHandlers.initHandlersFromConfig created spellCheckWithWordbreak_Direct: org.apache.solr.handler.component.SearchHandler
[junit4:junit4]   2> 13567 T1589 oasc.RequestHandlers.initHandlersFromConfig created spellCheckCompRH1: org.apache.solr.handler.component.SearchHandler
[junit4:junit4]   2> 13567 T1589 oasc.RequestHandlers.initHandlersFromConfig created mltrh: org.apache.solr.handler.component.SearchHandler
[junit4:junit4]   2> 13568 T1589 oasc.RequestHandlers.initHandlersFromConfig created tvrh: org.apache.solr.handler.component.SearchHandler
[junit4:junit4]   2> 13568 T1589 oasc.RequestHandlers.initHandlersFromConfig created /mlt: solr.MoreLikeThisHandler
[junit4:junit4]   2> 13576 T1589 oasc.RequestHandlers.initHandlersFromConfig created /debug/dump: solr.DumpRequestHandler
[junit4:junit4]   2> 13587 T1589 oashl.XMLLoader.init xsltCacheLifetimeSeconds=60
[junit4:junit4]   2> 13592 T1589 oasc.SolrCore.initDeprecatedSupport WARNING solrconfig.xml uses deprecated <admin/gettableFiles>, Please update your config to use the ShowFileRequestHandler.
[junit4:junit4]   2> 13594 T1589 oasc.SolrCore.initDeprecatedSupport WARNING adding ShowFileRequestHandler with hidden files: [SCHEMA.XML, OLD_SYNONYMS.TXT, STOPWORDS.TXT, PROTWORDS.TXT, OPEN-EXCHANGE-RATES.JSON, SYNONYMS.TXT, CURRENCY.XML, MAPPING-ISOLATIN1ACCENT.TXT]
[junit4:junit4]   2> 13596 T1589 oasc.CachingDirectoryFactory.close Releasing directory:/usr/home/hudson/hudson-slave/workspace/Lucene-Solr-Tests-trunk-Java6/solr/build/solr-core/test/J0/./org.apache.solr.cloud.SyncSliceTest-1359124613698/jetty4
[junit4:junit4]   2> 13598 T1589 oass.SolrIndexSearcher.<init> Opening Searcher@46ffc795 main
[junit4:junit4]   2> 13599 T1589 oasu.CommitTracker.<init> Hard AutoCommit: disabled
[junit4:junit4]   2> 13599 T1589 oasu.CommitTracker.<init> Soft AutoCommit: disabled
[junit4:junit4]   2> 13600 T1589 oashc.SpellCheckComponent.inform Initializing spell checkers
[junit4:junit4]   2> 13629 T1589 oass.DirectSolrSpellChecker.init init: {name=direct,classname=DirectSolrSpellChecker,field=lowerfilt,minQueryLength=3}
[junit4:junit4]   2> 13864 T1590 oasc.SolrCore.registerSearcher [collection1] Registered new searcher Searcher@46ffc795 main{StandardDirectoryReader(segments_1:1)}
[junit4:junit4]   2> 13868 T1589 oasc.ZkController.publish publishing core=collection1 state=down
[junit4:junit4]   2> 13868 T1589 oasc.ZkController.publish numShards not found on descriptor - reading it from system property
[junit4:junit4]   2> 14590 T1521 oascc.ZkStateReader.updateClusterState Updating cloud state from ZooKeeper... 
[junit4:junit4]   2> 14591 T1521 oasc.Overseer$ClusterStateUpdater.updateState Update state numShards=1 message={
[junit4:junit4]   2> 	  "operation":"state",
[junit4:junit4]   2> 	  "numShards":"1",
[junit4:junit4]   2> 	  "shard":null,
[junit4:junit4]   2> 	  "roles":null,
[junit4:junit4]   2> 	  "state":"down",
[junit4:junit4]   2> 	  "core":"collection1",
[junit4:junit4]   2> 	  "collection":"collection1",
[junit4:junit4]   2> 	  "node_name":"127.0.0.1:40908_s%2Ft",
[junit4:junit4]   2> 	  "base_url":"http://127.0.0.1:40908/s/t"}
[junit4:junit4]   2> 14591 T1521 oasc.Overseer$ClusterStateUpdater.updateState Collection already exists with numShards=1
[junit4:junit4]   2> 14592 T1521 oasc.Overseer$ClusterStateUpdater.updateState Assigning new node to shard shard=shard1
[junit4:junit4]   2> 14634 T1520 oascc.ZkStateReader$2.process A cluster state change: WatchedEvent state:SyncConnected type:NodeDataChanged path:/clusterstate.json, has occurred - updating... (live nodes size: 5)
[junit4:junit4]   2> 14634 T1539 oascc.ZkStateReader$2.process A cluster state change: WatchedEvent state:SyncConnected type:NodeDataChanged path:/clusterstate.json, has occurred - updating... (live nodes size: 5)
[junit4:junit4]   2> 14634 T1554 oascc.ZkStateReader$2.process A cluster state change: WatchedEvent state:SyncConnected type:NodeDataChanged path:/clusterstate.json, has occurred - updating... (live nodes size: 5)
[junit4:junit4]   2> 14634 T1588 oascc.ZkStateReader$2.process A cluster state change: WatchedEvent state:SyncConnected type:NodeDataChanged path:/clusterstate.json, has occurred - updating... (live nodes size: 5)
[junit4:junit4]   2> 14634 T1570 oascc.ZkStateReader$2.process A cluster state change: WatchedEvent state:SyncConnected type:NodeDataChanged path:/clusterstate.json, has occurred - updating... (live nodes size: 5)
[junit4:junit4]   2> 14634 T1526 oascc.ZkStateReader$2.process A cluster state change: WatchedEvent state:SyncConnected type:NodeDataChanged path:/clusterstate.json, has occurred - updating... (live nodes size: 5)
[junit4:junit4]   2> 14871 T1589 oasc.CoreContainer.registerCore registering core: collection1
[junit4:junit4]   2> 14871 T1589 oasc.ZkController.register Register replica - core:collection1 address:http://127.0.0.1:40908/s/t collection:collection1 shard:shard1
[junit4:junit4]   2> 14874 T1589 oasc.ZkController.register We are http://127.0.0.1:40908/s/t/collection1/ and leader is http://127.0.0.1:16126/s/t/collection1/
[junit4:junit4]   2> 14875 T1589 oasc.ZkController.register No LogReplay needed for core=collection1 baseURL=http://127.0.0.1:40908/s/t
[junit4:junit4]   2> 14875 T1589 oasc.ZkController.checkRecovery Core needs to recover:collection1
[junit4:junit4]   2> 14875 T1589 oasu.DefaultSolrCoreState.doRecovery Running recovery - first canceling any ongoing recovery
[junit4:junit4]   2> ASYNC  NEW_CORE C164 name=collection1 org.apache.solr.core.SolrCore@1e697ad2 url=http://127.0.0.1:40908/s/t/collection1 node=127.0.0.1:40908_s%2Ft C164_STATE=coll:collection1 core:collection1 props:{shard=null, roles=null, state=down, core=collection1, collection=collection1, node_name=127.0.0.1:40908_s%2Ft, base_url=http://127.0.0.1:40908/s/t}
[junit4:junit4]   2> 14875 T1591 C164 P40908 oasc.RecoveryStrategy.run Starting recovery process.  core=collection1 recoveringAfterStartup=true
[junit4:junit4]   2> 14876 T1591 C164 P40908 oasc.RecoveryStrategy.doRecovery ###### startupVersions=[]
[junit4:junit4]   2> 14876 T1589 oascc.ZkStateReader.updateClusterState Updating cloud state from ZooKeeper... 
[junit4:junit4]   2> 14876 T1591 C164 P40908 oasc.ZkController.publish publishing core=collection1 state=recovering
[junit4:junit4]   2> 14876 T1591 C164 P40908 oasc.ZkController.publish numShards not found on descriptor - reading it from system property
[junit4:junit4]   2> 14876 T1498 oass.SolrDispatchFilter.init user.dir=/usr/home/hudson/hudson-slave/workspace/Lucene-Solr-Tests-trunk-Java6/solr/build/solr-core/test/J0
[junit4:junit4]   2> 14877 T1591 C164 P40908 oascsi.HttpClientUtil.createClient Creating new http client, config:maxConnections=128&maxConnectionsPerHost=32&followRedirects=false
[junit4:junit4]   2> 14877 T1498 oass.SolrDispatchFilter.init SolrDispatchFilter.init() done
[junit4:junit4]   2> 14878 T1498 oascsi.HttpClientUtil.createClient Creating new http client, config:maxConnections=128&maxConnectionsPerHost=32&followRedirects=false
[junit4:junit4]   2> 14894 T1498 oascc.ZkStateReader.updateClusterState Updating cloud state from ZooKeeper... 
[junit4:junit4]   2> 14896 T1498 oasc.AbstractFullDistribZkTestBase.waitForThingsToLevelOut Wait for recoveries to finish - wait 15 for each attempt
[junit4:junit4]   2> 14896 T1498 oasc.AbstractDistribZkTestBase.waitForRecoveriesToFinish Wait for recoveries to finish - collection: collection1 failOnTimeout:true timeout (sec):15
[junit4:junit4]   2> 14897 T1498 oascc.ZkStateReader.updateClusterState Updating cloud state from ZooKeeper... 
[junit4:junit4]   2>  C163_STATE=coll:collection1 core:collection1 props:{shard=shard1, roles=null, state=recovering, core=collection1, collection=collection1, node_name=127.0.0.1:26267_s%2Ft, base_url=http://127.0.0.1:26267/s/t}
[junit4:junit4]   2> 15424 T1575 C163 P26267 oasc.RecoveryStrategy.doRecovery Attempting to PeerSync from http://127.0.0.1:16126/s/t/collection1/ core=collection1 - recoveringAfterStartup=true
[junit4:junit4]   2> 15424 T1575 C163 P26267 oasu.PeerSync.sync PeerSync: core=collection1 url=http://127.0.0.1:26267/s/t START replicas=[http://127.0.0.1:16126/s/t/collection1/] nUpdates=100
[junit4:junit4]   2> 15425 T1575 C163 P26267 oasu.PeerSync.sync WARNING no frame of reference to tell of we've missed updates
[junit4:junit4]   2> 15426 T1575 C163 P26267 oasc.RecoveryStrategy.doRecovery PeerSync Recovery was not successful - trying replication. core=collection1
[junit4:junit4]   2> 15426 T1575 C163 P26267 oasc.RecoveryStrategy.doRecovery Starting Replication Recovery. core=collection1
[junit4:junit4]   2> 15426 T1575 C163 P26267 oasc.RecoveryStrategy.doRecovery Begin buffering updates. core=collection1
[junit4:junit4]   2> 15426 T1575 C163 P26267 oasu.UpdateLog.bufferUpdates Starting to buffer updates. FSUpdateLog{state=ACTIVE, tlog=null}
[junit4:junit4]   2> 15426 T1575 C163 P26267 oasc.RecoveryStrategy.replicate Attempting to replicate from http://127.0.0.1:16126/s/t/collection1/. core=collection1
[junit4:junit4]   2> 15426 T1575 C163 P26267 oascsi.HttpClientUtil.createClient Creating new http client, config:maxConnections=128&maxConnectionsPerHost=32&followRedirects=false
[junit4:junit4]   2> 15428 T1530 C162 P16126 REQ /get {getVersions=100&distrib=false&wt=javabin&qt=/get&version=2} status=0 QTime=0 
[junit4:junit4]   2> 15438 T1535 C162 P16126 oasu.DirectUpdateHandler2.commit start commit{,optimize=false,openSearcher=false,waitSearcher=true,expungeDeletes=false,softCommit=false}
[junit4:junit4]   2> 15472 T1535 C162 P16126 oasc.SolrDeletionPolicy.onCommit SolrDeletionPolicy.onCommit: commits:num=2
[junit4:junit4]   2> 		commit{dir=RateLimitedDirectoryWrapper(NRTCachingDirectory(org.apache.lucene.store.NIOFSDirectory@/usr/home/hudson/hudson-slave/workspace/Lucene-Solr-Tests-trunk-Java6/solr/build/solr-core/test/J0/org.apache.solr.cloud.SyncSliceTest-1359124613698/jetty1/index lockFactory=org.apache.lucene.store.NativeFSLockFactory@46214457; maxCacheMB=48.0 maxMergeSizeMB=4.0)),segFN=segments_2,generation=2,filenames=[segments_2]
[junit4:junit4]   2> 		commit{dir=RateLimitedDirectoryWrapper(NRTCachingDirectory(org.apache.lucene.store.NIOFSDirectory@/usr/home/hudson/hudson-slave/workspace/Lucene-Solr-Tests-trunk-Java6/solr/build/solr-core/test/J0/org.apache.solr.cloud.SyncSliceTest-1359124613698/jetty1/index lockFactory=org.apache.lucene.store.NativeFSLockFactory@46214457; maxCacheMB=48.0 maxMergeSizeMB=4.0)),segFN=segments_3,generation=3,filenames=[segments_3]
[junit4:junit4]   2> 15473 T1535 C162 P16126 oasc.SolrDeletionPolicy.updateCommits newest commit = 3[segments_3]
[junit4:junit4]   2> 15474 T1535 C162 P16126 oasc.CachingDirectoryFactory.close Releasing directory:/usr/home/hudson/hudson-slave/workspace/Lucene-Solr-Tests-trunk-Java6/solr/build/solr-core/test/J0/./org.apache.solr.cloud.SyncSliceTest-1359124613698/jetty1
[junit4:junit4]   2> 15474 T1535 C162 P16126 oasu.DirectUpdateHandler2.commit end_commit_flush
[junit4:junit4]   2> 15475 T1535 C162 P16126 /update {waitSearcher=true&openSearcher=false&commit=true&wt=javabin&commit_end_point=true&version=2&softCommit=false} {commit=} 0 37
[junit4:junit4]   2> 15476 T1575 C163 P26267 oash.ReplicationHandler.inform Commits will be reserved for  10000
[junit4:junit4]   2> 15476 T1575 C163 P26267 oash.SnapPuller.<init>  No value set for 'pollInterval'. Timer Task not started.
[junit4:junit4]   2> 15479 T1532 C162 P16126 REQ /replication {command=indexversion&qt=/replication&wt=javabin&version=2} status=0 QTime=0 
[junit4:junit4]   2> 15480 T1575 C163 P26267 oash.SnapPuller.fetchLatestIndex Master's generation: 3
[junit4:junit4]   2> 15480 T1575 C163 P26267 oash.SnapPuller.fetchLatestIndex Slave's generation: 1
[junit4:junit4]   2> 15480 T1575 C163 P26267 oash.SnapPuller.fetchLatestIndex Starting replication process
[junit4:junit4]   2> 15483 T1532 C162 P16126 oasc.CachingDirectoryFactory.close Releasing directory:/usr/home/hudson/hudson-slave/workspace/Lucene-Solr-Tests-trunk-Java6/solr/build/solr-core/test/J0/./org.apache.solr.cloud.SyncSliceTest-1359124613698/jetty1
[junit4:junit4]   2> 15484 T1532 C162 P16126 oasc.CachingDirectoryFactory.close Releasing directory:/usr/home/hudson/hudson-slave/workspace/Lucene-Solr-Tests-trunk-Java6/solr/build/solr-core/test/J0/./org.apache.solr.cloud.SyncSliceTest-1359124613698/jetty1/index
[junit4:junit4]   2> 15485 T1532 C162 P16126 REQ /replication {command=filelist&qt=/replication&wt=javabin&generation=3&version=2} status=0 QTime=2 
[junit4:junit4]   2> 15486 T1575 C163 P26267 oash.SnapPuller.fetchLatestIndex Number of files in latest index in master: 1
[junit4:junit4]   2> 15486 T1575 C163 P26267 oasc.CachingDirectoryFactory.get return new directory for /usr/home/hudson/hudson-slave/workspace/Lucene-Solr-Tests-trunk-Java6/solr/build/solr-core/test/J0/./org.apache.solr.cloud.SyncSliceTest-1359124613698/jetty3/index.20130126033709179 forceNew:false
[junit4:junit4]   2> 15487 T1575 C163 P26267 oasc.CachingDirectoryFactory.close Releasing directory:/usr/home/hudson/hudson-slave/workspace/Lucene-Solr-Tests-trunk-Java6/solr/build/solr-core/test/J0/./org.apache.solr.cloud.SyncSliceTest-1359124613698/jetty3
[junit4:junit4]   2> 15487 T1575 C163 P26267 oash.SnapPuller.fetchLatestIndex Starting download to RateLimitedDirectoryWrapper(NRTCachingDirectory(org.apache.lucene.store.NIOFSDirectory@/usr/home/hudson/hudson-slave/workspace/Lucene-Solr-Tests-trunk-Java6/solr/build/solr-core/test/J0/org.apache.solr.cloud.SyncSliceTest-1359124613698/jetty3/index.20130126033709179 lockFactory=org.apache.lucene.store.NativeFSLockFactory@4660ba8c; maxCacheMB=48.0 maxMergeSizeMB=4.0)) fullCopy=true
[junit4:junit4]   2> 15490 T1532 C162 P16126 REQ /replication {file=segments_3&command=filecontent&checksum=true&wt=filestream&qt=/replication&generation=3} status=0 QTime=0 
[junit4:junit4]   2> 15492 T1575 C163 P26267 oasc.CachingDirectoryFactory.close Releasing directory:/usr/home/hudson/hudson-slave/workspace/Lucene-Solr-Tests-trunk-Java6/solr/build/solr-core/test/J0/./org.apache.solr.cloud.SyncSliceTest-1359124613698/jetty3/index
[junit4:junit4]   2> 15492 T1575 C163 P26267 oash.SnapPuller.fetchLatestIndex Total time taken for download : 0 secs
[junit4:junit4]   2> 15493 T1575 C163 P26267 oash.SnapPuller.modifyIndexProps New index installed. Updating index properties... index=index.20130126033709179
[junit4:junit4]   2> 15494 T1575 C163 P26267 oasc.CachingDirectoryFactory.close Releasing directory:/usr/home/hudson/hudson-slave/workspace/Lucene-Solr-Tests-trunk-Java6/solr/build/solr-core/test/J0/./org.apache.solr.cloud.SyncSliceTest-1359124613698/jetty3
[junit4:junit4]   2> 15494 T1575 C163 P26267 oasc.CachingDirectoryFactory.close Releasing directory:/usr/home/hudson/hudson-slave/workspace/Lucene-Solr-Tests-trunk-Java6/solr/build/solr-core/test/J0/./org.apache.solr.cloud.SyncSliceTest-1359124613698/jetty3
[junit4:junit4]   2> 15495 T1575 C163 P26267 oasc.SolrCore.getNewIndexDir New index directory detected: old=./org.apache.solr.cloud.SyncSliceTest-1359124613698/jetty3/index/ new=./org.apache.solr.cloud.SyncSliceTest-1359124613698/jetty3/index.20130126033709179
[junit4:junit4]   2> 15498 T1575 C163 P26267 oasc.SolrDeletionPolicy.onInit SolrDeletionPolicy.onInit: commits:num=1
[junit4:junit4]   2> 		commit{dir=RateLimitedDirectoryWrapper(NRTCachingDirectory(org.apache.lucene.store.NIOFSDirectory@/usr/home/hudson/hudson-slave/workspace/Lucene-Solr-Tests-trunk-Java6/solr/build/solr-core/test/J0/org.apache.solr.cloud.SyncSliceTest-1359124613698/jetty3/index.20130126033709179 lockFactory=org.apache.lucene.store.NativeFSLockFactory@4660ba8c; maxCacheMB=48.0 maxMergeSizeMB=4.0)),segFN=segments_3,generation=3,filenames=[segments_3]
[junit4:junit4]   2> 15498 T1575 C163 P26267 oasc.SolrDeletionPolicy.updateCommits newest commit = 3[segments_3]
[junit4:junit4]   2> 15500 T1575 C163 P26267 oasc.CachingDirectoryFactory.close Releasing directory:/usr/home/hudson/hudson-slave/workspace/Lucene-Solr-Tests-trunk-Java6/solr/build/solr-core/test/J0/./org.apache.solr.cloud.SyncSliceTest-1359124613698/jetty3
[junit4:junit4]   2> 15500 T1575 C163 P26267 oasu.DefaultSolrCoreState.newIndexWriter Creating new IndexWriter...
[junit4:junit4]   2> 15500 T1575 C163 P26267 oasu.DefaultSolrCoreState.newIndexWriter Waiting until IndexWriter is unused... core=collection1
[junit4:junit4]   2> 15500 T1575 C163 P26267 oasu.DefaultSolrCoreState.newIndexWriter Rollback old IndexWriter... core=collection1
[junit4:junit4]   2> 15501 T1575 C163 P26267 oasc.CachingDirectoryFactory.close Releasing directory:/usr/home/hudson/hudson-slave/workspace/Lucene-Solr-Tests-trunk-Java6/solr/build/solr-core/test/J0/./org.apache.solr.cloud.SyncSliceTest-1359124613698/jetty3/index.20130126033709179
[junit4:junit4]   2> 15501 T1575 C163 P26267 oasc.CachingDirectoryFactory.close Releasing directory:/usr/home/hudson/hudson-slave/workspace/Lucene-Solr-Tests-trunk-Java6/solr/build/solr-core/test/J0/./org.apache.solr.cloud.SyncSliceTest-1359124613698/jetty3
[junit4:junit4]   2> 15504 T1575 C163 P26267 oasc.SolrDeletionPolicy.onInit SolrDeletionPolicy.onInit: commits:num=1
[junit4:junit4]   2> 		commit{dir=RateLimitedDirectoryWrapper(NRTCachingDirectory(org.apache.lucene.store.NIOFSDirectory@/usr/home/hudson/hudson-slave/workspace/Lucene-Solr-Tests-trunk-Java6/solr/build/solr-core/test/J0/org.apache.solr.cloud.SyncSliceTest-1359124613698/jetty3/index.20130126033709179 lockFactory=org.apache.lucene.store.NativeFSLockFactory@4660ba8c; maxCacheMB=48.0 maxMergeSizeMB=4.0)),segFN=segments_3,generation=3,filenames=[segments_3]
[junit4:junit4]   2> 15505 T1575 C163 P26267 oasc.SolrDeletionPolicy.updateCommits newest commit = 3[segments_3]
[junit4:junit4]   2> 15505 T1575 C163 P26267 oasu.DefaultSolrCoreState.newIndexWriter New IndexWriter is ready to be used.
[junit4:junit4]   2> 15505 T1575 C163 P26267 oasc.CachingDirectoryFactory.close Releasing directory:/usr/home/hudson/hudson-slave/workspace/Lucene-Solr-Tests-trunk-Java6/solr/build/solr-core/test/J0/./org.apache.solr.cloud.SyncSliceTest-1359124613698/jetty3
[junit4:junit4]   2> 15506 T1575 C163 P26267 oass.SolrIndexSearcher.<init> Opening Searcher@6cc3881f main
[junit4:junit4]   2> 15507 T1572 oasc.SolrCore.registerSearcher [collection1] Registered new searcher Searcher@6cc3881f main{StandardDirectoryReader(segments_3:1:nrt)}
[junit4:junit4]   2> 15507 T1572 oasc.CachingDirectoryFactory.close Releasing directory:/usr/home/hudson/hudson-slave/workspace/Lucene-Solr-Tests-trunk-Java6/solr/build/solr-core/test/J0/./org.apache.solr.cloud.SyncSliceTest-1359124613698/jetty3/index
[junit4:junit4]   2> 15507 T1575 C163 P26267 oasu.DirectUpdateHandler2.commit start commit{,optimize=false,openSearcher=false,waitSearcher=false,expungeDeletes=false,softCommit=false}
[junit4:junit4]   2> 15511 T1575 C163 P26267 oasc.SolrDeletionPolicy.onCommit SolrDeletionPolicy.onCommit: commits:num=2
[junit4:junit4]   2> 		commit{dir=RateLimitedDirectoryWrapper(NRTCachingDirectory(org.apache.lucene.store.NIOFSDirectory@/usr/home/hudson/hudson-slave/workspace/Lucene-Solr-Tests-trunk-Java6/solr/build/solr-core/test/J0/org.apache.solr.cloud.SyncSliceTest-1359124613698/jetty3/index.20130126033709179 lockFactory=org.apache.lucene.store.NativeFSLockFactory@4660ba8c; maxCacheMB=48.0 maxMergeSizeMB=4.0)),segFN=segments_3,generation=3,filenames=[segments_3]
[junit4:junit4]   2> 		commit{dir=RateLimitedDirectoryWrapper(NRTCachingDirectory(org.apache.lucene.store.NIOFSDirectory@/usr/home/hudson/hudson-slave/workspace/Lucene-Solr-Tests-trunk-Java6/solr/build/solr-core/test/J0/org.apache.solr.cloud.SyncSliceTest-1359124613698/jetty3/index.20130126033709179 lockFactory=org.apache.lucene.store.NativeFSLockFactory@4660ba8c; maxCacheMB=48.0 maxMergeSizeMB=4.0)),segFN=segments_4,generation=4,filenames=[segments_4]
[junit4:junit4]   2> 15511 T1575 C163 P26267 oasc.SolrDeletionPolicy.updateCommits newest commit = 4[segments_4]
[junit4:junit4]   2> 15512 T1575 C163 P26267 oasc.CachingDirectoryFactory.close Releasing directory:/usr/home/hudson/hudson-slave/workspace/Lucene-Solr-Tests-trunk-Java6/solr/build/solr-core/test/J0/./org.apache.solr.cloud.SyncSliceTest-1359124613698/jetty3
[junit4:junit4]   2> 15512 T1575 C163 P26267 oasu.DirectUpdateHandler2.commit end_commit_flush
[junit4:junit4]   2> 15513 T1575 C163 P26267 oasc.CachingDirectoryFactory.close Releasing directory:/usr/home/hudson/hudson-slave/workspace/Lucene-Solr-Tests-trunk-Java6/solr/build/solr-core/test/J0/./org.apache.solr.cloud.SyncSliceTest-1359124613698/jetty3/index.20130126033709179
[junit4:junit4]   2> 15513 T1575 C163 P26267 oasc.CachingDirectoryFactory.close Releasing directory:/usr/home/hudson/hudson-slave/workspace/Lucene-Solr-Tests-trunk-Java6/solr/build/solr-core/test/J0/./org.apache.solr.cloud.SyncSliceTest-1359124613698/jetty3/index
[junit4:junit4]   2> 15513 T1575 C163 P26267 oasc.RecoveryStrategy.replay No replay needed. core=collection1
[junit4:junit4]   2> 15513 T1575 C163 P26267 oasc.RecoveryStrategy.doRecovery Replication Recovery was successful - registering as Active. core=collection1
[junit4:junit4]   2> 15513 T1575 C163 P26267 oasc.ZkController.publish publishing core=collection1 state=active
[junit4:junit4]   2> 15513 T1575 C163 P26267 oasc.ZkController.publish numShards not found on descriptor - reading it from system property
[junit4:junit4]   2> 15515 T1575 C163 P26267 oasc.RecoveryStrategy.doRecovery Finished recovery process. core=collection1
[junit4:junit4]   2> 15898 T1498 oascc.ZkStateReader.updateClusterState Updating cloud state from ZooKeeper... 
[junit4:junit4]   2> 16142 T1521 oascc.ZkStateReader.updateClusterState Updating cloud state from ZooKeeper... 
[junit4:junit4]   2> 16143 T1521 oasc.Overseer$ClusterStateUpdater.updateState Update state numShards=1 message={
[junit4:junit4]   2> 	  "operation":"state",
[junit4:junit4]   2> 	  "numShards":"1",
[junit4:junit4]   2> 	  "shard":"shard1",
[junit4:junit4]   2> 	  "roles":null,
[junit4:junit4]   2> 	  "state":"recovering",
[junit4:junit4]   2> 	  "core":"collection1",
[junit4:junit4]   2> 	  "collection":"collection1",
[junit4:junit4]   2> 	  "node_name":"127.0.0.1:40908_s%2Ft",
[junit4:junit4]   2> 	  "base_url":"http://127.0.0.1:40908/s/t"}
[junit4:junit4]   2> 16158 T1521 oasc.Overseer$ClusterStateUpdater.updateState Update state numShards=1 message={
[junit4:junit4]   2> 	  "operation":"state",
[junit4:junit4]   2> 	  "numShards":"1",
[junit4:junit4]   2> 	  "shard":"shard1",
[junit4:junit4]   2> 	  "roles":null,
[junit4:junit4]   2> 	  "state":"active",
[junit4:junit4]   2> 	  "core":"collection1",
[junit4:junit4]   2> 	  "collection":"collection1",
[junit4:junit4]   2> 	  "node_name":"127.0.0.1:26267_s%2Ft",
[junit4:junit4]   2> 	  "base_url":"http://127.0.0.1:26267/s/t"}
[junit4:junit4]   2> 16169 T1539 oascc.ZkStateReader$2.process A cluster state change: WatchedEvent state:SyncConnected type:NodeDataChanged path:/clusterstate.json, has occurred - updating... (live nodes size: 5)
[junit4:junit4]   2> 16169 T1520 oascc.ZkStateReader$2.process A cluster state change: WatchedEvent state:SyncConnected type:NodeDataChanged path:/clusterstate.json, has occurred - updating... (live nodes size: 5)
[junit4:junit4]   2> 16169 T1526 oascc.ZkStateReader$2.process A cluster state change: WatchedEvent state:SyncConnected type:NodeDataChanged path:/clusterstate.json, has occurred - updating... (live nodes size: 5)
[junit4:junit4]   2> 16169 T1554 oascc.ZkStateReader$2.process A cluster state change: WatchedEvent state:SyncConnected type:NodeDataChanged path:/clusterstate.json, has occurred - updating... (live nodes size: 5)
[junit4:junit4]   2> 16170 T1588 oascc.ZkStateReader$2.process A cluster state change: WatchedEvent state:SyncConnected type:NodeDataChanged path:/clusterstate.json, has occurred - updating... (live nodes size: 5)
[junit4:junit4]   2> 16170 T1570 oascc.ZkStateReader$2.process A cluster state change: WatchedEvent state:SyncConnected type:NodeDataChanged path:/clusterstate.json, has occurred - updating... (live nodes size: 5)
[junit4:junit4]   2> 16900 T1498 oascc.ZkStateReader.updateClusterState Updating cloud state from ZooKeeper... 
[junit4:junit4]   2> 17902 T1498 oascc.ZkStateReader.updateClusterState Updating cloud state from ZooKeeper... 
[junit4:junit4]   2>  C164_STATE=coll:collection1 core:collection1 props:{shard=shard1, roles=null, state=recovering, core=collection1, collection=collection1, node_name=127.0.0.1:40908_s%2Ft, base_url=http://127.0.0.1:40908/s/t}
[junit4:junit4]   2> 18898 T1591 C164 P40908 oasc.RecoveryStrategy.doRecovery Attempting to PeerSync from http://127.0.0.1:16126/s/t/collection1/ core=collection1 - recoveringAfterStartup=true
[junit4:junit4]   2> 18898 T1591 C164 P40908 oasu.PeerSync.sync PeerSync: core=collection1 url=http://127.0.0.1:40908/s/t START replicas=[http://127.0.0.1:16126/s/t/collection1/] nUpdates=100
[junit4:junit4]   2> 18899 T1591 C164 P40908 oasu.PeerSync.sync WARNING no frame of reference to tell of we've missed updates
[junit4:junit4]   2> 18899 T1591 C164 P40908 oasc.RecoveryStrategy.doRecovery PeerSync Recovery was not successful - trying replication. core=collection1
[junit4:junit4]   2> 18899 T1591 C164 P40908 oasc.RecoveryStrategy.doRecovery Starting Replication Recovery. core=collection1
[junit4:junit4]   2> 18899 T1591 C164 P40908 oasc.RecoveryStrategy.doRecovery Begin buffering updates. core=collection1
[junit4:junit4]   2> 18899 T1591 C164 P40908 oasu.UpdateLog.bufferUpdates Starting to buffer updates. FSUpdateLog{state=ACTIVE, tlog=null}
[junit4:junit4]   2> 18899 T1591 C164 P40908 oasc.RecoveryStrategy.replicate Attempting to replicate from http://127.0.0.1:16126/s/t/collection1/. core=collection1
[junit4:junit4]   2> 18899 T1591 C164 P40908 oascsi.HttpClientUtil.createClient Creating new http client, config:maxConnections=128&maxConnectionsPerHost=32&followRedirects=false
[junit4:junit4]   2> 18901 T1530 C162 P16126 REQ /get {getVersions=100&distrib=false&wt=javabin&qt=/get&version=2} status=0 QTime=0 
[junit4:junit4]   2> 18904 T1498 oascc.ZkStateReader.updateClusterState Updating cloud state from ZooKeeper... 
[junit4:junit4]   2> 18917 T1529 C162 P16126 oasu.DirectUpdateHandler2.commit start commit{,optimize=false,openSearcher=false,waitSearcher=true,expungeDeletes=false,softCommit=false}
[junit4:junit4]   2> 18923 T1529 C162 P16126 oasc.SolrDeletionPolicy.onCommit SolrDeletionPolicy.onCommit: commits:num=3
[junit4:junit4]   2> 		commit{dir=RateLimitedDirectoryWrapper(NRTCachingDirectory(org.apache.lucene.store.NIOFSDirectory@/usr/home/hudson/hudson-slave/workspace/Lucene-Solr-Tests-trunk-Java6/solr/build/solr-core/test/J0/org.apache.solr.cloud.SyncSliceTest-1359124613698/jetty1/index lockFactory=org.apache.lucene.store.NativeFSLockFactory@46214457; maxCacheMB=48.0 maxMergeSizeMB=4.0)),segFN=segments_2,generation=2,filenames=[segments_2]
[junit4:junit4]   2> 		commit{dir=RateLimitedDirectoryWrapper(NRTCachingDirectory(org.apache.lucene.store.NIOFSDirectory@/usr/home/hudson/hudson-slave/workspace/Lucene-Solr-Tests-trunk-Java6/solr/build/solr-core/test/J0/org.apache.solr.cloud.SyncSliceTest-1359124613698/jetty1/index lockFactory=org.apache.lucene.store.NativeFSLockFactory@46214457; maxCacheMB=48.0 maxMergeSizeMB=4.0)),segFN=segments_3,generation=3,filenames=[segments_3]
[junit4:junit4]   2> 		commit{dir=RateLimitedDirectoryWrapper(NRTCachingDirectory(org.apache.lucene.store.NIOFSDirectory@/usr/home/hudson/hudson-slave/workspace/Lucene-Solr-Tests-trunk-Java6/solr/build/solr-core/test/J0/org.apache.solr.cloud.SyncSliceTest-1359124613698/jetty1/index lockFactory=org.apache.lucene.store.NativeFSLockFactory@46214457; maxCacheMB=48.0 maxMergeSizeMB=4.0)),segFN=segments_4,generation=4,filenames=[segments_4]
[junit4:junit4]   2> 18924 T1529 C162 P16126 oasc.SolrDeletionPolicy.updateCommits newest commit = 4[segments_4]
[junit4:junit4]   2> 18925 T1529 C162 P16126 oasc.CachingDirectoryFactory.close Releasing directory:/usr/home/hudson/hudson-slave/workspace/Lucene-Solr-Tests-trunk-Java6/solr/build/solr-core/test/J0/./org.apache.solr.cloud.SyncSliceTest-1359124613698/jetty1
[junit4:junit4]   2> 18926 T1529 C162 P16126 oasu.DirectUpdateHandler2.commit end_commit_flush
[junit4:junit4]   2> 18926 T1529 C162 P16126 /update {waitSearcher=true&openSearcher=false&commit=true&wt=javabin&commit_end_point=true&version=2&softCommit=false} {commit=} 0 10
[junit4:junit4]   2> 18927 T1591 C164 P40908 oash.ReplicationHandler.inform Commits will be reserved for  10000
[junit4:junit4]   2> 18928 T1591 C164 P40908 oash.SnapPuller.<init>  No value set for 'pollInterval'. Timer Task not started.
[junit4:junit4]   2> 18930 T1532 C162 P16126 REQ /replication {command=indexversion&qt=/replication&wt=javabin&version=2} status=0 QTime=0 
[junit4:junit4]   2> 18931 T1591 C164 P40908 oash.SnapPuller.fetchLatestIndex Master's generation: 4
[junit4:junit4]   2> 18932 T1591 C164 P40908 oash.SnapPuller.fetchLatestIndex Slave's generation: 1
[junit4:junit4]   2> 18932 T1591 C164 P40908 oash.SnapPuller.fetchLatestIndex Starting replication process
[junit4:junit4]   2> 18934 T1532 C162 P16126 oasc.CachingDirectoryFactory.close Releasing directory:/usr/home/hudson/hudson-slave/workspace/Lucene-Solr-Tests-trunk-Java6/solr/build/solr-core/test/J0/./org.apache.solr.cloud.SyncSliceTest-1359124613698/jetty1
[junit4:junit4]   2> 18935 T1532 C162 P16126 oasc.CachingDirectoryFactory.close Releasing directory:/usr/home/hudson/hudson-slave/workspace/Lucene-Solr-Tests-trunk-Java6/solr/build/solr-core/test/J0/./org.apache.solr.cloud.SyncSliceTest-1359124613698/jetty1/index
[junit4:junit4]   2> 18936 T1532 C162 P16126 REQ /replication {command=filelist&qt=/replication&wt=javabin&generation=4&version=2} status=0 QTime=2 
[junit4:junit4]   2> 18937 T1591 C164 P40908 oash.SnapPuller.fetchLatestIndex Number of files in latest index in master: 1
[junit4:junit4]   2> 18938 T1591 C164 P40908 oasc.CachingDirectoryFactory.get return new directory for /usr/home/hudson/hudson-slave/workspace/Lucene-Solr-Tests-trunk-Java6/solr/build/solr-core/test/J0/./org.apache.solr.cloud.SyncSliceTest-1359124613698/jetty4/index.20130126033712630 forceNew:false
[junit4:junit4]   2> 18938 T1591 C164 P40908 oasc.CachingDirectoryFactory.close Releasing directory:/usr/home/hudson/hudson-slave/workspace/Lucene-Solr-Tests-trunk-Java6/solr/build/solr-core/test/J0/./org.apache.solr.cloud.SyncSliceTest-1359124613698/jetty4
[junit4:junit4]   2> 18939 T1591 C164 P40908 oash.SnapPuller.fetchLatestIndex Starting download to RateLimitedDirectoryWrapper(NRTCachingDirectory(org.apache.lucene.store.NIOFSDirectory@/usr/home/hudson/hudson-slave/workspace/Lucene-Solr-Tests-trunk-Java6/solr/build/solr-core/test/J0/org.apache.solr.cloud.SyncSliceTest-1359124613698/jetty4/index.20130126033712630 lockFactory=org.apache.lucene.store.NativeFSLockFactory@4775940e; maxCacheMB=48.0 maxMergeSizeMB=4.0)) fullCopy=true
[junit4:junit4]   2> 18942 T1532 C162 P16126 REQ /replication {file=segments_4&command=filecontent&checksum=true&wt=filestream&qt=/replication&generation=4} status=0 QTime=0 
[junit4:junit4]   2> 18944 T1591 C164 P40908 oasc.CachingDirectoryFactory.close Releasing directory:/usr/home/hudson/hudson-slave/workspace/Lucene-Solr-Tests-trunk-Java6/solr/build/solr-core/test/J0/./org.apache.solr.cloud.SyncSliceTest-1359124613698/jetty4/index
[junit4:junit4]   2> 18944 T1591 C164 P40908 oash.SnapPuller.fetchLatestIndex Total time taken for download : 0 secs
[junit4:junit4]   2> 18945 T1591 C164 P40908 oash.SnapPuller.modifyIndexProps New index installed. Updating index properties... index=index.20130126033712630
[junit4:junit4]   2> 18947 T1591 C164 P40908 oasc.CachingDirectoryFactory.close Releasing directory:/usr/home/hudson/hudson-slave/workspace/Lucene-Solr-Tests-trunk-Java6/solr/build/solr-core/test/J0/./org.apache.solr.cloud.SyncSliceTest-1359124613698/jetty4
[junit4:junit4]   2> 18947 T1591 C164 P40908 oasc.CachingDirectoryFactory.close Releasing directory:/usr/home/hudson/hudson-slave/workspace/Lucene-Solr-Tests-trunk-Java6/solr/build/solr-core/test/J0/./org.apache.solr.cloud.SyncSliceTest-1359124613698/jetty4
[junit4:junit4]   2> 18947 T1591 C164 P40908 oasc.SolrCore.getNewIndexDir New index directory detected: old=./org.apache.solr.cloud.SyncSliceTest-1359124613698/jetty4/index/ new=./org.apache.solr.cloud.SyncSliceTest-1359124613698/jetty4/index.20130126033712630
[junit4:junit4]   2> 18951 T1591 C164 P40908 oasc.SolrDeletionPolicy.onInit SolrDeletionPolicy.onInit: commits:num=1
[junit4:junit4]   2> 		commit{dir=RateLimitedDirectoryWrapper(NRTCachingDirectory(org.apache.lucene.store.NIOFSDirectory@/usr/home/hudson/hudson-slave/workspace/Lucene-Solr-Tests-trunk-Java6/solr/build/solr-core/test/J0/org.apache.solr.cloud.SyncSliceTest-1359124613698/jetty4/index.20130126033712630 lockFactory=org.apache.lucene.store.NativeFSLockFactory@4775940e; maxCacheMB=48.0 maxMergeSizeMB=4.0)),segFN=segments_4,generation=4,filenames=[segments_4]
[junit4:junit4]   2> 18952 T1591 C164 P40908 oasc.SolrDeletionPolicy.updateCommits newest commit = 4[segments_4]
[junit4:junit4]   2> 18953 T1591 C164 P40908 oasc.CachingDirectoryFactory.close Releasing directory:/usr/home/hudson/hudson-slave/workspace/Lucene-Solr-Tests-trunk-Java6/solr/build/solr-core/test/J0/./org.apache.solr.cloud.SyncSliceTest-1359124613698/jetty4
[junit4:junit4]   2> 18953 T1591 C164 P40908 oasu.DefaultSolrCoreState.newIndexWriter Creating new IndexWriter...
[junit4:junit4]   2> 18953 T1591 C164 P40908 oasu.DefaultSolrCoreState.newIndexWriter Waiting until IndexWriter is unused... core=collection1
[junit4:junit4]   2> 18953 T1591 C164 P40908 oasu.DefaultSolrCoreState.newIndexWriter Rollback old IndexWriter... core=collection1
[junit4:junit4]   2> 18954 T1591 C164 P40908 oasc.CachingDirectoryFactory.close Releasing directory:/usr/home/hudson/hudson-slave/workspace/Lucene-Solr-Tests-trunk-Java6/solr/build/solr-core/test/J0/./org.apache.solr.cloud.SyncSliceTest-1359124613698/jetty4/index.20130126033712630
[junit4:junit4]   2> 18955 T1591 C164 P40908 oasc.CachingDirectoryFactory.close Releasing directory:/usr/home/hudson/hudson-slave/workspace/Lucene-Solr-Tests-trunk-Java6/solr/build/solr-core/test/J0/./org.apache.solr.cloud.SyncSliceTest-1359124613698/jetty4
[junit4:junit4]   2> 18958 T1591 C164 P40908 oasc.SolrDeletionPolicy.onInit SolrDeletionPolicy.onInit: commits:num=1
[junit4:junit4]   2> 		commit{dir=RateLimitedDirectoryWrapper(NRTCachingDirectory(org.apache.lucene.store.NIOFSDirectory@/usr/home/hudson/hudson-slave/workspace/Lucene-Solr-Tests-trunk-Java6/solr/build/solr-core/test/J0/org.apache.solr.cloud.SyncSliceTest-1359124613698/jetty4/index.20130126033712630 lockFactory=org.apache.lucene.store.NativeFSLockFactory@4775940e; maxCacheMB=48.0 maxMergeSizeMB=4.0)),segFN=segments_4,generation=4,filenames=[segments_4]
[junit4:junit4]   2> 18959 T1591 C164 P40908 oasc.SolrDeletionPolicy.updateCommits newest commit = 4[segments_4]
[junit4:junit4]   2> 18959 T1591 C164 P40908 oasu.DefaultSolrCoreState.newIndexWriter New IndexWriter is ready to be used.
[junit4:junit4]   2> 18959 T1591 C164 P40908 oasc.CachingDirectoryFactory.close Releasing directory:/usr/home/hudson/hudson-slave/workspace/Luce

[...truncated too long message...]

tartConnect Opening socket connection to server localhost/127.0.0.1:38917. Will not attempt to authenticate using SASL (access denied (javax.security.auth.AuthPermission getLoginConfiguration))
[junit4:junit4]   2> 164720 T1588 oaz.ClientCnxn$EventThread.run EventThread shut down
[junit4:junit4]   2> 164720 T1498 oaz.ZooKeeper.close Session: 0x13c7223ca47000c closed
[junit4:junit4]   2> 164722 T1498 oejsh.ContextHandler.doStop stopped o.e.j.s.ServletContextHandler{/s/t,null}
[junit4:junit4]   2> 165066 T1498 oas.SolrTestCaseJ4.tearDown ###Ending testDistribSearch
[junit4:junit4]   1> client port:0.0.0.0/0.0.0.0:0
[junit4:junit4]   2> NOTE: reproduce with: ant test  -Dtestcase=SyncSliceTest -Dtests.method=testDistribSearch -Dtests.seed=AB6038BC5D4C511F -Dtests.multiplier=3 -Dtests.slow=true -Dtests.locale=ro_RO -Dtests.timezone=Pacific/Apia -Dtests.file.encoding=US-ASCII
[junit4:junit4] FAILURE  165s J0 | SyncSliceTest.testDistribSearch <<<
[junit4:junit4]    > Throwable #1: java.lang.AssertionError: shard1 should have just been set up to be inconsistent - but it's still consistent
[junit4:junit4]    > 	at __randomizedtesting.SeedInfo.seed([AB6038BC5D4C511F:2A86B6A42A133123]:0)
[junit4:junit4]    > 	at org.junit.Assert.fail(Assert.java:93)
[junit4:junit4]    > 	at org.junit.Assert.assertTrue(Assert.java:43)
[junit4:junit4]    > 	at org.junit.Assert.assertNotNull(Assert.java:526)
[junit4:junit4]    > 	at org.apache.solr.cloud.SyncSliceTest.doTest(SyncSliceTest.java:214)
[junit4:junit4]    > 	at org.apache.solr.BaseDistributedSearchTestCase.testDistribSearch(BaseDistributedSearchTestCase.java:794)
[junit4:junit4]    > 	at sun.reflect.NativeMethodAccessorImpl.invoke0(Native Method)
[junit4:junit4]    > 	at sun.reflect.NativeMethodAccessorImpl.invoke(NativeMethodAccessorImpl.java:57)
[junit4:junit4]    > 	at sun.reflect.DelegatingMethodAccessorImpl.invoke(DelegatingMethodAccessorImpl.java:43)
[junit4:junit4]    > 	at java.lang.reflect.Method.invoke(Method.java:616)
[junit4:junit4]    > 	at com.carrotsearch.randomizedtesting.RandomizedRunner.invoke(RandomizedRunner.java:1559)
[junit4:junit4]    > 	at com.carrotsearch.randomizedtesting.RandomizedRunner.access$600(RandomizedRunner.java:79)
[junit4:junit4]    > 	at com.carrotsearch.randomizedtesting.RandomizedRunner$6.evaluate(RandomizedRunner.java:737)
[junit4:junit4]    > 	at com.carrotsearch.randomizedtesting.RandomizedRunner$7.evaluate(RandomizedRunner.java:773)
[junit4:junit4]    > 	at com.carrotsearch.randomizedtesting.RandomizedRunner$8.evaluate(RandomizedRunner.java:787)
[junit4:junit4]    > 	at com.carrotsearch.randomizedtesting.rules.SystemPropertiesRestoreRule$1.evaluate(SystemPropertiesRestoreRule.java:53)
[junit4:junit4]    > 	at org.apache.lucene.util.TestRuleSetupTeardownChained$1.evaluate(TestRuleSetupTeardownChained.java:50)
[junit4:junit4]    > 	at org.apache.lucene.util.TestRuleFieldCacheSanity$1.evaluate(TestRuleFieldCacheSanity.java:51)
[junit4:junit4]    > 	at org.apache.lucene.util.AbstractBeforeAfterRule$1.evaluate(AbstractBeforeAfterRule.java:46)
[junit4:junit4]    > 	at com.carrotsearch.randomizedtesting.rules.SystemPropertiesInvariantRule$1.evaluate(SystemPropertiesInvariantRule.java:55)
[junit4:junit4]    > 	at org.apache.lucene.util.TestRuleThreadAndTestName$1.evaluate(TestRuleThreadAndTestName.java:49)
[junit4:junit4]    > 	at org.apache.lucene.util.TestRuleIgnoreAfterMaxFailures$1.evaluate(TestRuleIgnoreAfterMaxFailures.java:70)
[junit4:junit4]    > 	at org.apache.lucene.util.TestRuleMarkFailure$1.evaluate(TestRuleMarkFailure.java:48)
[junit4:junit4]    > 	at com.carrotsearch.randomizedtesting.rules.StatementAdapter.evaluate(StatementAdapter.java:36)
[junit4:junit4]    > 	at com.carrotsearch.randomizedtesting.ThreadLeakControl$StatementRunner.run(ThreadLeakControl.java:358)
[junit4:junit4]    > 	at com.carrotsearch.randomizedtesting.ThreadLeakControl.forkTimeoutingTask(ThreadLeakControl.java:782)
[junit4:junit4]    > 	at com.carrotsearch.randomizedtesting.ThreadLeakControl$3.evaluate(ThreadLeakControl.java:442)
[junit4:junit4]    > 	at com.carrotsearch.randomizedtesting.RandomizedRunner.runSingleTest(RandomizedRunner.java:746)
[junit4:junit4]    > 	at com.carrotsearch.randomizedtesting.RandomizedRunner$3.evaluate(RandomizedRunner.java:648)
[junit4:junit4]    > 	at com.carrotsearch.randomizedtesting.RandomizedRunner$4.evaluate(RandomizedRunner.java:682)
[junit4:junit4]    > 	at com.carrotsearch.randomizedtesting.RandomizedRunner$5.evaluate(RandomizedRunner.java:693)
[junit4:junit4]    > 	at com.carrotsearch.randomizedtesting.rules.StatementAdapter.evaluate(StatementAdapter.java:36)
[junit4:junit4]    > 	at com.carrotsearch.randomizedtesting.rules.SystemPropertiesRestoreRule$1.evaluate(SystemPropertiesRestoreRule.java:53)
[junit4:junit4]    > 	at org.apache.lucene.util.AbstractBeforeAfterRule$1.evaluate(AbstractBeforeAfterRule.java:46)
[junit4:junit4]    > 	at org.apache.lucene.util.TestRuleStoreClassName$1.evaluate(TestRuleStoreClassName.java:42)
[junit4:junit4]    > 	at com.carrotsearch.randomizedtesting.rules.SystemPropertiesInvariantRule$1.evaluate(SystemPropertiesInvariantRule.java:55)
[junit4:junit4]    > 	at com.carrotsearch.randomizedtesting.rules.NoShadowingOrOverridesOnMethodsRule$1.evaluate(NoShadowingOrOverridesOnMethodsRule.java:39)
[junit4:junit4]    > 	at com.carrotsearch.randomizedtesting.rules.NoShadowingOrOverridesOnMethodsRule$1.evaluate(NoShadowingOrOverridesOnMethodsRule.java:39)
[junit4:junit4]    > 	at com.carrotsearch.randomizedtesting.rules.StatementAdapter.evaluate(StatementAdapter.java:36)
[junit4:junit4]    > 	at org.apache.lucene.util.TestRuleAssertionsRequired$1.evaluate(TestRuleAssertionsRequired.java:43)
[junit4:junit4]    > 	at org.apache.lucene.util.TestRuleMarkFailure$1.evaluate(TestRuleMarkFailure.java:48)
[junit4:junit4]    > 	at org.apache.lucene.util.TestRuleIgnoreAfterMaxFailures$1.evaluate(TestRuleIgnoreAfterMaxFailures.java:70)
[junit4:junit4]    > 	at org.apache.lucene.util.TestRuleIgnoreTestSuites$1.evaluate(TestRuleIgnoreTestSuites.java:55)
[junit4:junit4]    > 	at com.carrotsearch.randomizedtesting.rules.StatementAdapter.evaluate(StatementAdapter.java:36)
[junit4:junit4]    > 	at com.carrotsearch.randomizedtesting.ThreadLeakControl$StatementRunner.run(ThreadLeakControl.java:358)
[junit4:junit4]    > 	at java.lang.Thread.run(Thread.java:679)
[junit4:junit4]   2> 165099 T1498 oas.SolrTestCaseJ4.deleteCore ###deleteCore
[junit4:junit4]   2> NOTE: test params are: codec=Lucene41: {range_facet_l=PostingsFormat(name=TestBloomFilteredLucene41Postings), text=Lucene41(blocksize=128), _version_=Pulsing41(freqCutoff=18 minBlockSize=67 maxBlockSize=148), rnd_b=Pulsing41(freqCutoff=15 minBlockSize=67 maxBlockSize=148), intDefault=Pulsing41(freqCutoff=18 minBlockSize=67 maxBlockSize=148), id=Pulsing41(freqCutoff=15 minBlockSize=67 maxBlockSize=148), timestamp=PostingsFormat(name=TestBloomFilteredLucene41Postings), a_t=PostingsFormat(name=TestBloomFilteredLucene41Postings), range_facet_sl=Pulsing41(freqCutoff=15 minBlockSize=67 maxBlockSize=148), range_facet_si=PostingsFormat(name=TestBloomFilteredLucene41Postings), other_tl1=Pulsing41(freqCutoff=18 minBlockSize=67 maxBlockSize=148), multiDefault=PostingsFormat(name=TestBloomFilteredLucene41Postings), a_si=Pulsing41(freqCutoff=18 minBlockSize=67 maxBlockSize=148)}, sim=RandomSimilarityProvider(queryNorm=false,coord=crazy): {}, locale=ro_RO, timezone=Pacific/Apia
[junit4:junit4]   2> NOTE: FreeBSD 9.0-RELEASE amd64/Sun Microsystems Inc. 1.6.0_32 (64-bit)/cpus=16,threads=2,free=138136936,total=372572160
[junit4:junit4]   2> NOTE: All tests run in this JVM: [SOLR749Test, TestIndexingPerformance, ChaosMonkeyNothingIsSafeTest, PreAnalyzedFieldTest, TestLMJelinekMercerSimilarityFactory, TestSearchPerf, TestElisionMultitermQuery, JSONWriterTest, SystemInfoHandlerTest, TestPHPSerializedResponseWriter, TestReload, TestFastLRUCache, TestAnalyzedSuggestions, NotRequiredUniqueKeyTest, TestBinaryResponseWriter, SpellCheckComponentTest, ResourceLoaderTest, TestConfig, TestBadConfig, CurrencyFieldTest, AutoCommitTest, TestCollationField, IndexBasedSpellCheckerTest, BasicDistributedZkTest, CoreAdminHandlerTest, TestLazyCores, CSVRequestHandlerTest, DateMathParserTest, TestLFUCache, PluginInfoTest, TestLuceneMatchVersion, UniqFieldsUpdateProcessorFactoryTest, TestFaceting, CacheHeaderTest, RequestHandlersTest, TestLMDirichletSimilarityFactory, FileBasedSpellCheckerTest, BadComponentTest, ShardRoutingCustomTest, SimplePostToolTest, DistributedSpellCheckComponentTest, MoreLikeThisHandlerTest, TestZkChroot, TestPerFieldSimilarity, TestIndexSearcher, CopyFieldTest, CollectionsAPIDistributedZkTest, TestFuzzyAnalyzedSuggestions, TestExtendedDismaxParser, SyncSliceTest]
[junit4:junit4] Completed on J0 in 165.13s, 1 test, 1 failure <<< FAILURES!

[...truncated 109 lines...]
BUILD FAILED
/usr/home/hudson/hudson-slave/workspace/Lucene-Solr-Tests-trunk-Java6/build.xml:346: The following error occurred while executing this line:
/usr/home/hudson/hudson-slave/workspace/Lucene-Solr-Tests-trunk-Java6/build.xml:39: The following error occurred while executing this line:
/usr/home/hudson/hudson-slave/workspace/Lucene-Solr-Tests-trunk-Java6/solr/build.xml:178: The following error occurred while executing this line:
/usr/home/hudson/hudson-slave/workspace/Lucene-Solr-Tests-trunk-Java6/solr/common-build.xml:428: The following error occurred while executing this line:
/usr/home/hudson/hudson-slave/workspace/Lucene-Solr-Tests-trunk-Java6/lucene/common-build.xml:1176: The following error occurred while executing this line:
/usr/home/hudson/hudson-slave/workspace/Lucene-Solr-Tests-trunk-Java6/lucene/common-build.xml:841: There were test failures: 247 suites, 1032 tests, 1 failure, 23 ignored (5 assumptions)

Total time: 34 minutes 51 seconds
Build step 'Invoke Ant' marked build as failure
Archiving artifacts
Recording test results
Email was triggered for: Failure
Sending email for trigger: Failure