You are viewing a plain text version of this content. The canonical link for it is here.
Posted to dev@kafka.apache.org by Apache Jenkins Server <je...@builds.apache.org> on 2020/06/11 19:44:55 UTC
Build failed in Jenkins: kafka-trunk-jdk8 #4638
See <https://builds.apache.org/job/kafka-trunk-jdk8/4638/display/redirect?page=changes>
Changes:
[github] KAFKA-10027: Implement read path for feature versioning system (KIP-584)
------------------------------------------
[...truncated 2.13 MB...]
org.apache.kafka.streams.test.ConsumerRecordFactoryTest > shouldRequireCustomTopicNameIfNotDefaultFactoryTopicNameWithNullKey PASSED
org.apache.kafka.streams.test.ConsumerRecordFactoryTest > shouldCreateConsumerRecord STARTED
org.apache.kafka.streams.test.ConsumerRecordFactoryTest > shouldCreateConsumerRecord PASSED
org.apache.kafka.streams.test.ConsumerRecordFactoryTest > shouldCreateNullKeyConsumerRecord STARTED
org.apache.kafka.streams.test.ConsumerRecordFactoryTest > shouldCreateNullKeyConsumerRecord PASSED
org.apache.kafka.streams.test.ConsumerRecordFactoryTest > shouldCreateConsumerRecordWithOtherTopicName STARTED
org.apache.kafka.streams.test.ConsumerRecordFactoryTest > shouldCreateConsumerRecordWithOtherTopicName PASSED
org.apache.kafka.streams.test.ConsumerRecordFactoryTest > shouldAdvanceTime STARTED
org.apache.kafka.streams.test.ConsumerRecordFactoryTest > shouldAdvanceTime PASSED
org.apache.kafka.streams.test.ConsumerRecordFactoryTest > shouldNotAllowToCreateTopicWithNullTopicNameWithKeyValuePairs STARTED
org.apache.kafka.streams.test.ConsumerRecordFactoryTest > shouldNotAllowToCreateTopicWithNullTopicNameWithKeyValuePairs PASSED
org.apache.kafka.streams.test.ConsumerRecordFactoryTest > shouldRequireCustomTopicNameIfNotDefaultFactoryTopicNameWithKeyValuePairsAndCustomTimestamps STARTED
org.apache.kafka.streams.test.ConsumerRecordFactoryTest > shouldRequireCustomTopicNameIfNotDefaultFactoryTopicNameWithKeyValuePairsAndCustomTimestamps PASSED
org.apache.kafka.streams.test.ConsumerRecordFactoryTest > shouldRequireCustomTopicNameIfNotDefaultFactoryTopicNameWithKeyValuePairs STARTED
org.apache.kafka.streams.test.ConsumerRecordFactoryTest > shouldRequireCustomTopicNameIfNotDefaultFactoryTopicNameWithKeyValuePairs PASSED
org.apache.kafka.streams.test.ConsumerRecordFactoryTest > shouldCreateConsumerRecordWithOtherTopicNameAndTimestamp STARTED
org.apache.kafka.streams.test.ConsumerRecordFactoryTest > shouldCreateConsumerRecordWithOtherTopicNameAndTimestamp PASSED
org.apache.kafka.streams.test.ConsumerRecordFactoryTest > shouldNotAllowToCreateTopicWithNullTopicNameWithKeyValuePairsAndCustomTimestamps STARTED
org.apache.kafka.streams.test.ConsumerRecordFactoryTest > shouldNotAllowToCreateTopicWithNullTopicNameWithKeyValuePairsAndCustomTimestamps PASSED
org.apache.kafka.streams.test.ConsumerRecordFactoryTest > shouldNotAllowToCreateTopicWithNullTopicName STARTED
org.apache.kafka.streams.test.ConsumerRecordFactoryTest > shouldNotAllowToCreateTopicWithNullTopicName PASSED
org.apache.kafka.streams.test.ConsumerRecordFactoryTest > shouldCreateConsumerRecordsFromKeyValuePairsWithCustomTimestampAndIncrementsAndNotAdvanceTime STARTED
org.apache.kafka.streams.test.ConsumerRecordFactoryTest > shouldCreateConsumerRecordsFromKeyValuePairsWithCustomTimestampAndIncrementsAndNotAdvanceTime PASSED
org.apache.kafka.streams.test.ConsumerRecordFactoryTest > shouldCreateNullKeyConsumerRecordWithTimestampWithTimestamp STARTED
org.apache.kafka.streams.test.ConsumerRecordFactoryTest > shouldCreateNullKeyConsumerRecordWithTimestampWithTimestamp PASSED
org.apache.kafka.streams.test.ConsumerRecordFactoryTest > shouldRequireCustomTopicNameIfNotDefaultFactoryTopicNameWithNullKeyAndDefaultTimestamp STARTED
org.apache.kafka.streams.test.ConsumerRecordFactoryTest > shouldRequireCustomTopicNameIfNotDefaultFactoryTopicNameWithNullKeyAndDefaultTimestamp PASSED
org.apache.kafka.streams.test.ConsumerRecordFactoryTest > shouldCreateConsumerRecordsFromKeyValuePairsWithTimestampAndIncrements STARTED
org.apache.kafka.streams.test.ConsumerRecordFactoryTest > shouldCreateConsumerRecordsFromKeyValuePairsWithTimestampAndIncrements PASSED
org.apache.kafka.streams.MockTimeTest > shouldGetNanosAsMillis STARTED
org.apache.kafka.streams.MockTimeTest > shouldGetNanosAsMillis PASSED
org.apache.kafka.streams.MockTimeTest > shouldSetStartTime STARTED
org.apache.kafka.streams.MockTimeTest > shouldSetStartTime PASSED
org.apache.kafka.streams.MockTimeTest > shouldNotAllowNegativeSleep STARTED
org.apache.kafka.streams.MockTimeTest > shouldNotAllowNegativeSleep PASSED
org.apache.kafka.streams.MockTimeTest > shouldAdvanceTimeOnSleep STARTED
org.apache.kafka.streams.MockTimeTest > shouldAdvanceTimeOnSleep PASSED
org.apache.kafka.streams.internals.KeyValueStoreFacadeTest > shouldReturnIsOpen STARTED
org.apache.kafka.streams.internals.KeyValueStoreFacadeTest > shouldReturnIsOpen PASSED
org.apache.kafka.streams.internals.KeyValueStoreFacadeTest > shouldDeleteAndReturnPlainValue STARTED
org.apache.kafka.streams.internals.KeyValueStoreFacadeTest > shouldDeleteAndReturnPlainValue PASSED
org.apache.kafka.streams.internals.KeyValueStoreFacadeTest > shouldReturnName STARTED
org.apache.kafka.streams.internals.KeyValueStoreFacadeTest > shouldReturnName PASSED
org.apache.kafka.streams.internals.KeyValueStoreFacadeTest > shouldPutWithUnknownTimestamp STARTED
org.apache.kafka.streams.internals.KeyValueStoreFacadeTest > shouldPutWithUnknownTimestamp PASSED
org.apache.kafka.streams.internals.KeyValueStoreFacadeTest > shouldPutAllWithUnknownTimestamp STARTED
org.apache.kafka.streams.internals.KeyValueStoreFacadeTest > shouldPutAllWithUnknownTimestamp PASSED
org.apache.kafka.streams.internals.KeyValueStoreFacadeTest > shouldReturnIsPersistent STARTED
org.apache.kafka.streams.internals.KeyValueStoreFacadeTest > shouldReturnIsPersistent PASSED
org.apache.kafka.streams.internals.KeyValueStoreFacadeTest > shouldPutIfAbsentWithUnknownTimestamp STARTED
org.apache.kafka.streams.internals.KeyValueStoreFacadeTest > shouldPutIfAbsentWithUnknownTimestamp PASSED
org.apache.kafka.streams.internals.KeyValueStoreFacadeTest > shouldForwardClose STARTED
org.apache.kafka.streams.internals.KeyValueStoreFacadeTest > shouldForwardClose PASSED
org.apache.kafka.streams.internals.KeyValueStoreFacadeTest > shouldForwardFlush STARTED
org.apache.kafka.streams.internals.KeyValueStoreFacadeTest > shouldForwardFlush PASSED
org.apache.kafka.streams.internals.KeyValueStoreFacadeTest > shouldForwardInit STARTED
org.apache.kafka.streams.internals.KeyValueStoreFacadeTest > shouldForwardInit PASSED
> Task :streams:upgrade-system-tests-21:spotbugsMain NO-SOURCE
> Task :streams:upgrade-system-tests-21:test
> Task :streams:upgrade-system-tests-22:compileJava NO-SOURCE
> Task :streams:upgrade-system-tests-22:processResources NO-SOURCE
> Task :streams:upgrade-system-tests-22:classes UP-TO-DATE
> Task :streams:upgrade-system-tests-22:checkstyleMain NO-SOURCE
> Task :streams:upgrade-system-tests-22:compileTestJava
> Task :streams:upgrade-system-tests-22:processTestResources NO-SOURCE
> Task :streams:upgrade-system-tests-22:testClasses
> Task :streams:upgrade-system-tests-22:checkstyleTest
> Task :streams:upgrade-system-tests-22:spotbugsMain NO-SOURCE
> Task :streams:upgrade-system-tests-22:test
> Task :streams:upgrade-system-tests-23:compileJava NO-SOURCE
> Task :streams:upgrade-system-tests-23:processResources NO-SOURCE
> Task :streams:upgrade-system-tests-23:classes UP-TO-DATE
> Task :streams:upgrade-system-tests-23:checkstyleMain NO-SOURCE
> Task :streams:upgrade-system-tests-23:compileTestJava
> Task :streams:upgrade-system-tests-23:processTestResources NO-SOURCE
> Task :streams:upgrade-system-tests-23:testClasses
> Task :streams:upgrade-system-tests-23:checkstyleTest
> Task :streams:upgrade-system-tests-23:spotbugsMain NO-SOURCE
> Task :streams:upgrade-system-tests-23:test
> Task :streams:upgrade-system-tests-24:compileJava NO-SOURCE
> Task :streams:upgrade-system-tests-24:processResources NO-SOURCE
> Task :streams:upgrade-system-tests-24:classes UP-TO-DATE
> Task :streams:upgrade-system-tests-24:checkstyleMain NO-SOURCE
> Task :streams:upgrade-system-tests-24:compileTestJava
> Task :streams:upgrade-system-tests-24:processTestResources NO-SOURCE
> Task :streams:upgrade-system-tests-24:testClasses
> Task :streams:upgrade-system-tests-24:checkstyleTest
> Task :streams:upgrade-system-tests-24:spotbugsMain NO-SOURCE
> Task :streams:upgrade-system-tests-24:test
> Task :streams:upgrade-system-tests-25:compileJava NO-SOURCE
> Task :streams:upgrade-system-tests-25:processResources NO-SOURCE
> Task :streams:upgrade-system-tests-25:classes UP-TO-DATE
> Task :streams:upgrade-system-tests-25:checkstyleMain NO-SOURCE
> Task :streams:upgrade-system-tests-25:compileTestJava
> Task :streams:upgrade-system-tests-25:processTestResources NO-SOURCE
> Task :streams:upgrade-system-tests-25:testClasses
> Task :streams:upgrade-system-tests-25:checkstyleTest
> Task :streams:upgrade-system-tests-25:spotbugsMain NO-SOURCE
> Task :streams:upgrade-system-tests-25:test
FAILURE: Build completed with 4 failures.
1: Task failed with an exception.
-----------
* What went wrong:
Execution failed for task ':core:test'.
> Process 'Gradle Test Executor 11' finished with non-zero exit value 1
This problem might be caused by incorrect test process configuration.
Please refer to the test execution section in the User Manual at https://docs.gradle.org/6.5/userguide/java_testing.html#sec:test_execution
* Try:
Run with --stacktrace option to get the stack trace. Run with --info or --debug option to get more log output. Run with --scan to get full insights.
==============================================================================
2: Task failed with an exception.
-----------
* What went wrong:
Execution failed for task ':streams:test'.
> Process 'Gradle Test Executor 20' finished with non-zero exit value 1
This problem might be caused by incorrect test process configuration.
Please refer to the test execution section in the User Manual at https://docs.gradle.org/6.5/userguide/java_testing.html#sec:test_execution
* Try:
Run with --stacktrace option to get the stack trace. Run with --info or --debug option to get more log output. Run with --scan to get full insights.
==============================================================================
3: Task failed with an exception.
-----------
* What went wrong:
Execution failed for task ':connect:mirror:test'.
> Process 'Gradle Test Executor 25' finished with non-zero exit value 1
This problem might be caused by incorrect test process configuration.
Please refer to the test execution section in the User Manual at https://docs.gradle.org/6.5/userguide/java_testing.html#sec:test_execution
* Try:
Run with --stacktrace option to get the stack trace. Run with --info or --debug option to get more log output. Run with --scan to get full insights.
==============================================================================
4: Task failed with an exception.
-----------
* What went wrong:
Execution failed for task ':streams:streams-scala:test'.
> Process 'Gradle Test Executor 34' finished with non-zero exit value 1
This problem might be caused by incorrect test process configuration.
Please refer to the test execution section in the User Manual at https://docs.gradle.org/6.5/userguide/java_testing.html#sec:test_execution
* Try:
Run with --stacktrace option to get the stack trace. Run with --info or --debug option to get more log output. Run with --scan to get full insights.
==============================================================================
* Get more help at https://help.gradle.org
Deprecated Gradle features were used in this build, making it incompatible with Gradle 7.0.
Use '--warning-mode all' to show the individual deprecation warnings.
See https://docs.gradle.org/6.5/userguide/command_line_interface.html#sec:command_line_warnings
BUILD FAILED in 29m 24s
215 actionable tasks: 183 executed, 32 up-to-date
Build step 'Execute shell' marked build as failure
[FINDBUGS] Collecting findbugs analysis files...
Setting GRADLE_4_10_3_HOME=/home/jenkins/tools/gradle/4.10.3
[FINDBUGS] Searching for all files in <https://builds.apache.org/job/kafka-trunk-jdk8/ws/> that match the pattern **/build/reports/*bugs/*.xml
[FINDBUGS] Parsing 19 files in <https://builds.apache.org/job/kafka-trunk-jdk8/ws/>
[FINDBUGS] Successfully parsed file <https://builds.apache.org/job/kafka-trunk-jdk8/ws/clients/build/reports/spotbugs/main.xml> with 0 unique warnings and 0 duplicates.
[FINDBUGS] Successfully parsed file <https://builds.apache.org/job/kafka-trunk-jdk8/ws/connect/api/build/reports/spotbugs/main.xml> with 0 unique warnings and 0 duplicates.
[FINDBUGS] Successfully parsed file <https://builds.apache.org/job/kafka-trunk-jdk8/ws/connect/basic-auth-extension/build/reports/spotbugs/main.xml> with 0 unique warnings and 0 duplicates.
[FINDBUGS] Successfully parsed file <https://builds.apache.org/job/kafka-trunk-jdk8/ws/connect/file/build/reports/spotbugs/main.xml> with 0 unique warnings and 0 duplicates.
[FINDBUGS] Successfully parsed file <https://builds.apache.org/job/kafka-trunk-jdk8/ws/connect/json/build/reports/spotbugs/main.xml> with 0 unique warnings and 0 duplicates.
[FINDBUGS] Successfully parsed file <https://builds.apache.org/job/kafka-trunk-jdk8/ws/connect/mirror-client/build/reports/spotbugs/main.xml> with 0 unique warnings and 0 duplicates.
[FINDBUGS] Successfully parsed file <https://builds.apache.org/job/kafka-trunk-jdk8/ws/connect/mirror/build/reports/spotbugs/main.xml> with 0 unique warnings and 0 duplicates.
[FINDBUGS] Successfully parsed file <https://builds.apache.org/job/kafka-trunk-jdk8/ws/connect/runtime/build/reports/spotbugs/main.xml> with 0 unique warnings and 0 duplicates.
[FINDBUGS] Successfully parsed file <https://builds.apache.org/job/kafka-trunk-jdk8/ws/connect/transforms/build/reports/spotbugs/main.xml> with 0 unique warnings and 0 duplicates.
[FINDBUGS] Successfully parsed file <https://builds.apache.org/job/kafka-trunk-jdk8/ws/core/build/reports/spotbugs/main.xml> with 0 unique warnings and 0 duplicates.
[FINDBUGS] Successfully parsed file <https://builds.apache.org/job/kafka-trunk-jdk8/ws/examples/build/reports/spotbugs/main.xml> with 0 unique warnings and 0 duplicates.
[FINDBUGS] Successfully parsed file <https://builds.apache.org/job/kafka-trunk-jdk8/ws/generator/build/reports/spotbugs/main.xml> with 0 unique warnings and 0 duplicates.
[FINDBUGS] Successfully parsed file <https://builds.apache.org/job/kafka-trunk-jdk8/ws/jmh-benchmarks/build/reports/spotbugs/main.xml> with 0 unique warnings and 0 duplicates.
[FINDBUGS] Successfully parsed file <https://builds.apache.org/job/kafka-trunk-jdk8/ws/log4j-appender/build/reports/spotbugs/main.xml> with 0 unique warnings and 0 duplicates.
[FINDBUGS] Successfully parsed file <https://builds.apache.org/job/kafka-trunk-jdk8/ws/streams/build/reports/spotbugs/main.xml> with 0 unique warnings and 0 duplicates.
[FINDBUGS] Successfully parsed file <https://builds.apache.org/job/kafka-trunk-jdk8/ws/streams/examples/build/reports/spotbugs/main.xml> with 0 unique warnings and 0 duplicates.
[FINDBUGS] Successfully parsed file <https://builds.apache.org/job/kafka-trunk-jdk8/ws/streams/streams-scala/build/reports/spotbugs/main.xml> with 0 unique warnings and 0 duplicates.
[FINDBUGS] Successfully parsed file <https://builds.apache.org/job/kafka-trunk-jdk8/ws/streams/test-utils/build/reports/spotbugs/main.xml> with 0 unique warnings and 0 duplicates.
[FINDBUGS] Successfully parsed file <https://builds.apache.org/job/kafka-trunk-jdk8/ws/tools/build/reports/spotbugs/main.xml> with 0 unique warnings and 0 duplicates.
Setting GRADLE_4_10_3_HOME=/home/jenkins/tools/gradle/4.10.3
No credentials specified
Setting GRADLE_4_10_3_HOME=/home/jenkins/tools/gradle/4.10.3
<Git Blamer> Using GitBlamer to create author and commit information for all warnings.
<Git Blamer> GIT_COMMIT=4f96c5b424956355339dd3216c426c1c0388fe9e, workspace=<https://builds.apache.org/job/kafka-trunk-jdk8/ws/>
[FINDBUGS] Computing warning deltas based on reference build #4632
Recording test results
Setting GRADLE_4_10_3_HOME=/home/jenkins/tools/gradle/4.10.3
Setting GRADLE_4_10_3_HOME=/home/jenkins/tools/gradle/4.10.3
Not sending mail to unregistered user noreply@github.com
Jenkins build is back to normal : kafka-trunk-jdk8 #4653
Posted by Apache Jenkins Server <je...@builds.apache.org>.
See <https://builds.apache.org/job/kafka-trunk-jdk8/4653/display/redirect?page=changes>
Build failed in Jenkins: kafka-trunk-jdk8 #4652
Posted by Apache Jenkins Server <je...@builds.apache.org>.
See <https://builds.apache.org/job/kafka-trunk-jdk8/4652/display/redirect?page=changes>
Changes:
[github] KAFKA-10123; Fix incorrect value for AWAIT_RESET#hasPosition (#8841)
[github] MINOR: Upgrade ducktape to 0.7.8 (#8879)
------------------------------------------
[...truncated 5.37 MB...]
org.apache.kafka.streams.scala.kstream.KStreamTest > join 2 KStreams should join correctly records PASSED
org.apache.kafka.streams.scala.kstream.KStreamTest > transform a KStream should transform correctly records STARTED
org.apache.kafka.streams.scala.kstream.KStreamTest > transform a KStream should transform correctly records PASSED
org.apache.kafka.streams.scala.kstream.KStreamTest > flatTransform a KStream should flatTransform correctly records STARTED
org.apache.kafka.streams.scala.kstream.KStreamTest > flatTransform a KStream should flatTransform correctly records PASSED
org.apache.kafka.streams.scala.kstream.KStreamTest > flatTransformValues a KStream should correctly flatTransform values in records STARTED
org.apache.kafka.streams.scala.kstream.KStreamTest > flatTransformValues a KStream should correctly flatTransform values in records PASSED
org.apache.kafka.streams.scala.kstream.KStreamTest > flatTransformValues with key in a KStream should correctly flatTransformValues in records STARTED
org.apache.kafka.streams.scala.kstream.KStreamTest > flatTransformValues with key in a KStream should correctly flatTransformValues in records PASSED
org.apache.kafka.streams.scala.kstream.KStreamTest > join 2 KStreamToTables should join correctly records STARTED
org.apache.kafka.streams.scala.kstream.KTableTest > session windowed KTable#suppress should correctly suppress results using Suppressed.untilWindowCloses PASSED
org.apache.kafka.streams.scala.kstream.KTableTest > non-windowed KTable#suppress should correctly suppress results using Suppressed.untilTimeLimit STARTED
org.apache.kafka.streams.scala.kstream.KStreamTest > join 2 KStreamToTables should join correctly records PASSED
org.apache.kafka.streams.scala.kstream.GroupedTest > Create a Grouped should create a Grouped with Serdes STARTED
org.apache.kafka.streams.scala.kstream.GroupedTest > Create a Grouped should create a Grouped with Serdes PASSED
org.apache.kafka.streams.scala.kstream.GroupedTest > Create a Grouped with repartition topic name should create a Grouped with Serdes, and repartition topic name STARTED
org.apache.kafka.streams.scala.kstream.GroupedTest > Create a Grouped with repartition topic name should create a Grouped with Serdes, and repartition topic name PASSED
org.apache.kafka.streams.scala.kstream.StreamJoinedTest > Create a StreamJoined should create a StreamJoined with Serdes STARTED
org.apache.kafka.streams.scala.kstream.StreamJoinedTest > Create a StreamJoined should create a StreamJoined with Serdes PASSED
org.apache.kafka.streams.scala.kstream.StreamJoinedTest > Create a StreamJoined should create a StreamJoined with Serdes and Store Suppliers STARTED
org.apache.kafka.streams.scala.kstream.StreamJoinedTest > Create a StreamJoined should create a StreamJoined with Serdes and Store Suppliers PASSED
org.apache.kafka.streams.scala.kstream.StreamJoinedTest > Create a StreamJoined should create a StreamJoined with Serdes and a State Store name STARTED
org.apache.kafka.streams.scala.kstream.StreamJoinedTest > Create a StreamJoined should create a StreamJoined with Serdes and a State Store name PASSED
org.apache.kafka.streams.scala.kstream.SuppressedTest > Suppressed.untilWindowCloses should produce the correct suppression STARTED
org.apache.kafka.streams.scala.kstream.SuppressedTest > Suppressed.untilWindowCloses should produce the correct suppression PASSED
org.apache.kafka.streams.scala.kstream.SuppressedTest > Suppressed.untilTimeLimit should produce the correct suppression STARTED
org.apache.kafka.streams.scala.kstream.SuppressedTest > Suppressed.untilTimeLimit should produce the correct suppression PASSED
org.apache.kafka.streams.scala.kstream.SuppressedTest > BufferConfig.maxRecords should produce the correct buffer config STARTED
org.apache.kafka.streams.scala.kstream.SuppressedTest > BufferConfig.maxRecords should produce the correct buffer config PASSED
org.apache.kafka.streams.scala.kstream.SuppressedTest > BufferConfig.maxBytes should produce the correct buffer config STARTED
org.apache.kafka.streams.scala.kstream.SuppressedTest > BufferConfig.maxBytes should produce the correct buffer config PASSED
org.apache.kafka.streams.scala.kstream.SuppressedTest > BufferConfig.unbounded should produce the correct buffer config STARTED
org.apache.kafka.streams.scala.kstream.SuppressedTest > BufferConfig.unbounded should produce the correct buffer config PASSED
org.apache.kafka.streams.scala.kstream.SuppressedTest > BufferConfig should support very long chains of factory methods STARTED
org.apache.kafka.streams.scala.kstream.SuppressedTest > BufferConfig should support very long chains of factory methods PASSED
org.apache.kafka.streams.scala.kstream.KTableTest > non-windowed KTable#suppress should correctly suppress results using Suppressed.untilTimeLimit PASSED
org.apache.kafka.streams.scala.kstream.ProducedTest > Create a Produced should create a Produced with Serdes STARTED
org.apache.kafka.streams.scala.kstream.ProducedTest > Create a Produced should create a Produced with Serdes PASSED
org.apache.kafka.streams.scala.kstream.ProducedTest > Create a Produced with streamPartitioner should create a Produced with Serdes and streamPartitioner STARTED
org.apache.kafka.streams.scala.kstream.ProducedTest > Create a Produced with streamPartitioner should create a Produced with Serdes and streamPartitioner PASSED
org.apache.kafka.streams.scala.TopologyTest > shouldBuildIdenticalTopologyInJavaNScalaJoin STARTED
org.apache.kafka.streams.scala.TopologyTest > shouldBuildIdenticalTopologyInJavaNScalaJoin PASSED
org.apache.kafka.streams.scala.TopologyTest > shouldBuildIdenticalTopologyInJavaNScalaCogroup STARTED
org.apache.kafka.streams.scala.TopologyTest > shouldBuildIdenticalTopologyInJavaNScalaCogroup PASSED
org.apache.kafka.streams.scala.TopologyTest > shouldBuildIdenticalTopologyInJavaNScalaSimple STARTED
org.apache.kafka.streams.scala.TopologyTest > shouldBuildIdenticalTopologyInJavaNScalaSimple PASSED
org.apache.kafka.streams.scala.TopologyTest > shouldBuildIdenticalTopologyInJavaNScalaCogroupSimple STARTED
org.apache.kafka.streams.scala.TopologyTest > shouldBuildIdenticalTopologyInJavaNScalaCogroupSimple PASSED
org.apache.kafka.streams.scala.TopologyTest > shouldBuildIdenticalTopologyInJavaNScalaAggregate STARTED
org.apache.kafka.streams.scala.TopologyTest > shouldBuildIdenticalTopologyInJavaNScalaAggregate PASSED
org.apache.kafka.streams.scala.TopologyTest > shouldBuildIdenticalTopologyInJavaNScalaProperties STARTED
org.apache.kafka.streams.scala.TopologyTest > shouldBuildIdenticalTopologyInJavaNScalaProperties PASSED
org.apache.kafka.streams.scala.TopologyTest > shouldBuildIdenticalTopologyInJavaNScalaTransform STARTED
org.apache.kafka.streams.scala.TopologyTest > shouldBuildIdenticalTopologyInJavaNScalaTransform PASSED
> Task :streams:upgrade-system-tests-10:processTestResources NO-SOURCE
> Task :streams:upgrade-system-tests-10:testClasses
> Task :streams:upgrade-system-tests-10:checkstyleTest
> Task :streams:upgrade-system-tests-10:spotbugsMain NO-SOURCE
> Task :streams:upgrade-system-tests-10:test
> Task :streams:upgrade-system-tests-11:compileJava NO-SOURCE
> Task :streams:upgrade-system-tests-11:processResources NO-SOURCE
> Task :streams:upgrade-system-tests-11:classes UP-TO-DATE
> Task :streams:upgrade-system-tests-11:checkstyleMain NO-SOURCE
> Task :streams:upgrade-system-tests-11:compileTestJava
> Task :streams:upgrade-system-tests-11:processTestResources NO-SOURCE
> Task :streams:upgrade-system-tests-11:testClasses
> Task :streams:upgrade-system-tests-11:checkstyleTest
> Task :streams:upgrade-system-tests-11:spotbugsMain NO-SOURCE
> Task :streams:upgrade-system-tests-11:test
> Task :streams:upgrade-system-tests-20:compileJava NO-SOURCE
> Task :streams:upgrade-system-tests-20:processResources NO-SOURCE
> Task :streams:upgrade-system-tests-20:classes UP-TO-DATE
> Task :streams:upgrade-system-tests-20:checkstyleMain NO-SOURCE
> Task :streams:upgrade-system-tests-20:compileTestJava
> Task :streams:upgrade-system-tests-20:processTestResources NO-SOURCE
> Task :streams:upgrade-system-tests-20:testClasses
> Task :streams:upgrade-system-tests-20:checkstyleTest
> Task :streams:upgrade-system-tests-20:spotbugsMain NO-SOURCE
> Task :streams:upgrade-system-tests-20:test
> Task :streams:upgrade-system-tests-21:compileJava NO-SOURCE
> Task :streams:upgrade-system-tests-21:processResources NO-SOURCE
> Task :streams:upgrade-system-tests-21:classes UP-TO-DATE
> Task :streams:upgrade-system-tests-21:checkstyleMain NO-SOURCE
> Task :streams:upgrade-system-tests-21:compileTestJava
> Task :streams:upgrade-system-tests-21:processTestResources NO-SOURCE
> Task :streams:upgrade-system-tests-21:testClasses
> Task :streams:upgrade-system-tests-21:checkstyleTest
> Task :streams:upgrade-system-tests-21:spotbugsMain NO-SOURCE
> Task :streams:upgrade-system-tests-21:test
> Task :streams:upgrade-system-tests-22:compileJava NO-SOURCE
> Task :streams:upgrade-system-tests-22:processResources NO-SOURCE
> Task :streams:upgrade-system-tests-22:classes UP-TO-DATE
> Task :streams:upgrade-system-tests-22:checkstyleMain NO-SOURCE
> Task :streams:upgrade-system-tests-22:compileTestJava
> Task :streams:upgrade-system-tests-22:processTestResources NO-SOURCE
> Task :streams:upgrade-system-tests-22:testClasses
> Task :streams:upgrade-system-tests-22:checkstyleTest
> Task :streams:upgrade-system-tests-22:spotbugsMain NO-SOURCE
> Task :streams:upgrade-system-tests-22:test
> Task :streams:upgrade-system-tests-23:compileJava NO-SOURCE
> Task :streams:upgrade-system-tests-23:processResources NO-SOURCE
> Task :streams:upgrade-system-tests-23:classes UP-TO-DATE
> Task :streams:upgrade-system-tests-23:checkstyleMain NO-SOURCE
> Task :streams:upgrade-system-tests-23:compileTestJava
> Task :streams:upgrade-system-tests-23:processTestResources NO-SOURCE
> Task :streams:upgrade-system-tests-23:testClasses
> Task :streams:upgrade-system-tests-23:checkstyleTest
> Task :streams:upgrade-system-tests-23:spotbugsMain NO-SOURCE
> Task :streams:upgrade-system-tests-23:test
> Task :streams:upgrade-system-tests-24:compileJava NO-SOURCE
> Task :streams:upgrade-system-tests-24:processResources NO-SOURCE
> Task :streams:upgrade-system-tests-24:classes UP-TO-DATE
> Task :streams:upgrade-system-tests-24:checkstyleMain NO-SOURCE
> Task :streams:upgrade-system-tests-24:compileTestJava
> Task :streams:upgrade-system-tests-24:processTestResources NO-SOURCE
> Task :streams:upgrade-system-tests-24:testClasses
> Task :streams:upgrade-system-tests-24:checkstyleTest
> Task :streams:upgrade-system-tests-24:spotbugsMain NO-SOURCE
> Task :streams:upgrade-system-tests-24:test
> Task :streams:upgrade-system-tests-25:compileJava NO-SOURCE
> Task :streams:upgrade-system-tests-25:processResources NO-SOURCE
> Task :streams:upgrade-system-tests-25:classes UP-TO-DATE
> Task :streams:upgrade-system-tests-25:checkstyleMain NO-SOURCE
> Task :streams:upgrade-system-tests-25:compileTestJava
> Task :streams:upgrade-system-tests-25:processTestResources NO-SOURCE
> Task :streams:upgrade-system-tests-25:testClasses
> Task :streams:upgrade-system-tests-25:checkstyleTest
> Task :streams:upgrade-system-tests-25:spotbugsMain NO-SOURCE
> Task :streams:upgrade-system-tests-25:test
FAILURE: Build completed with 2 failures.
1: Task failed with an exception.
-----------
* What went wrong:
Execution failed for task ':streams:test'.
> There were failing tests. See the report at: file://<https://builds.apache.org/job/kafka-trunk-jdk8/ws/streams/build/reports/tests/test/index.html>
* Try:
Run with --stacktrace option to get the stack trace. Run with --info or --debug option to get more log output. Run with --scan to get full insights.
==============================================================================
2: Task failed with an exception.
-----------
* What went wrong:
Execution failed for task ':connect:runtime:test'.
> There were failing tests. See the report at: file://<https://builds.apache.org/job/kafka-trunk-jdk8/ws/connect/runtime/build/reports/tests/test/index.html>
* Try:
Run with --stacktrace option to get the stack trace. Run with --info or --debug option to get more log output. Run with --scan to get full insights.
==============================================================================
* Get more help at https://help.gradle.org
Deprecated Gradle features were used in this build, making it incompatible with Gradle 7.0.
Use '--warning-mode all' to show the individual deprecation warnings.
See https://docs.gradle.org/6.5/userguide/command_line_interface.html#sec:command_line_warnings
BUILD FAILED in 2h 19m 57s
215 actionable tasks: 183 executed, 32 up-to-date
Build step 'Execute shell' marked build as failure
[FINDBUGS] Collecting findbugs analysis files...
Setting GRADLE_4_10_3_HOME=/home/jenkins/tools/gradle/4.10.3
[FINDBUGS] Searching for all files in <https://builds.apache.org/job/kafka-trunk-jdk8/ws/> that match the pattern **/build/reports/*bugs/*.xml
[FINDBUGS] Parsing 19 files in <https://builds.apache.org/job/kafka-trunk-jdk8/ws/>
[FINDBUGS] Successfully parsed file <https://builds.apache.org/job/kafka-trunk-jdk8/ws/clients/build/reports/spotbugs/main.xml> with 0 unique warnings and 0 duplicates.
[FINDBUGS] Successfully parsed file <https://builds.apache.org/job/kafka-trunk-jdk8/ws/connect/api/build/reports/spotbugs/main.xml> with 0 unique warnings and 0 duplicates.
[FINDBUGS] Successfully parsed file <https://builds.apache.org/job/kafka-trunk-jdk8/ws/connect/basic-auth-extension/build/reports/spotbugs/main.xml> with 0 unique warnings and 0 duplicates.
[FINDBUGS] Successfully parsed file <https://builds.apache.org/job/kafka-trunk-jdk8/ws/connect/file/build/reports/spotbugs/main.xml> with 0 unique warnings and 0 duplicates.
[FINDBUGS] Successfully parsed file <https://builds.apache.org/job/kafka-trunk-jdk8/ws/connect/json/build/reports/spotbugs/main.xml> with 0 unique warnings and 0 duplicates.
[FINDBUGS] Successfully parsed file <https://builds.apache.org/job/kafka-trunk-jdk8/ws/connect/mirror-client/build/reports/spotbugs/main.xml> with 0 unique warnings and 0 duplicates.
[FINDBUGS] Successfully parsed file <https://builds.apache.org/job/kafka-trunk-jdk8/ws/connect/mirror/build/reports/spotbugs/main.xml> with 0 unique warnings and 0 duplicates.
[FINDBUGS] Successfully parsed file <https://builds.apache.org/job/kafka-trunk-jdk8/ws/connect/runtime/build/reports/spotbugs/main.xml> with 0 unique warnings and 0 duplicates.
[FINDBUGS] Successfully parsed file <https://builds.apache.org/job/kafka-trunk-jdk8/ws/connect/transforms/build/reports/spotbugs/main.xml> with 0 unique warnings and 0 duplicates.
[FINDBUGS] Successfully parsed file <https://builds.apache.org/job/kafka-trunk-jdk8/ws/core/build/reports/spotbugs/main.xml> with 0 unique warnings and 0 duplicates.
[FINDBUGS] Successfully parsed file <https://builds.apache.org/job/kafka-trunk-jdk8/ws/examples/build/reports/spotbugs/main.xml> with 0 unique warnings and 0 duplicates.
[FINDBUGS] Successfully parsed file <https://builds.apache.org/job/kafka-trunk-jdk8/ws/generator/build/reports/spotbugs/main.xml> with 0 unique warnings and 0 duplicates.
[FINDBUGS] Successfully parsed file <https://builds.apache.org/job/kafka-trunk-jdk8/ws/jmh-benchmarks/build/reports/spotbugs/main.xml> with 0 unique warnings and 0 duplicates.
[FINDBUGS] Successfully parsed file <https://builds.apache.org/job/kafka-trunk-jdk8/ws/log4j-appender/build/reports/spotbugs/main.xml> with 0 unique warnings and 0 duplicates.
[FINDBUGS] Successfully parsed file <https://builds.apache.org/job/kafka-trunk-jdk8/ws/streams/build/reports/spotbugs/main.xml> with 0 unique warnings and 0 duplicates.
[FINDBUGS] Successfully parsed file <https://builds.apache.org/job/kafka-trunk-jdk8/ws/streams/examples/build/reports/spotbugs/main.xml> with 0 unique warnings and 0 duplicates.
[FINDBUGS] Successfully parsed file <https://builds.apache.org/job/kafka-trunk-jdk8/ws/streams/streams-scala/build/reports/spotbugs/main.xml> with 0 unique warnings and 0 duplicates.
[FINDBUGS] Successfully parsed file <https://builds.apache.org/job/kafka-trunk-jdk8/ws/streams/test-utils/build/reports/spotbugs/main.xml> with 0 unique warnings and 0 duplicates.
[FINDBUGS] Successfully parsed file <https://builds.apache.org/job/kafka-trunk-jdk8/ws/tools/build/reports/spotbugs/main.xml> with 0 unique warnings and 0 duplicates.
Setting GRADLE_4_10_3_HOME=/home/jenkins/tools/gradle/4.10.3
No credentials specified
Setting GRADLE_4_10_3_HOME=/home/jenkins/tools/gradle/4.10.3
<Git Blamer> Using GitBlamer to create author and commit information for all warnings.
<Git Blamer> GIT_COMMIT=d3d65dd5dd2fa3466366afac478724ef5d330df3, workspace=<https://builds.apache.org/job/kafka-trunk-jdk8/ws/>
[FINDBUGS] Computing warning deltas based on reference build #4632
Recording test results
Setting GRADLE_4_10_3_HOME=/home/jenkins/tools/gradle/4.10.3
Setting GRADLE_4_10_3_HOME=/home/jenkins/tools/gradle/4.10.3
Not sending mail to unregistered user noreply@github.com
Build failed in Jenkins: kafka-trunk-jdk8 #4651
Posted by Apache Jenkins Server <je...@builds.apache.org>.
See <https://builds.apache.org/job/kafka-trunk-jdk8/4651/display/redirect?page=changes>
Changes:
[github] MINOR: clean up unused checkstyle suppressions for Streams (#8861)
[github] KAFKA-9896: fix flaky StandbyTaskEOSIntegrationTest (#8883)
------------------------------------------
[...truncated 3.15 MB...]
org.apache.kafka.streams.TopologyTestDriverTest > shouldReturnAllStoresNames[Eos enabled = false] STARTED
org.apache.kafka.streams.TopologyTestDriverTest > shouldReturnAllStoresNames[Eos enabled = false] PASSED
org.apache.kafka.streams.TopologyTestDriverTest > shouldPassRecordHeadersIntoSerializersAndDeserializers[Eos enabled = false] STARTED
org.apache.kafka.streams.TopologyTestDriverTest > shouldPassRecordHeadersIntoSerializersAndDeserializers[Eos enabled = false] PASSED
org.apache.kafka.streams.TopologyTestDriverTest > shouldProcessConsumerRecordList[Eos enabled = false] STARTED
org.apache.kafka.streams.TopologyTestDriverTest > shouldProcessConsumerRecordList[Eos enabled = false] PASSED
org.apache.kafka.streams.TopologyTestDriverTest > shouldUseSinkSpecificSerializers[Eos enabled = false] STARTED
org.apache.kafka.streams.TopologyTestDriverTest > shouldUseSinkSpecificSerializers[Eos enabled = false] PASSED
org.apache.kafka.streams.TopologyTestDriverTest > shouldFlushStoreForFirstInput[Eos enabled = false] STARTED
org.apache.kafka.streams.TopologyTestDriverTest > shouldFlushStoreForFirstInput[Eos enabled = false] PASSED
org.apache.kafka.streams.TopologyTestDriverTest > shouldProcessFromSourceThatMatchPattern[Eos enabled = false] STARTED
org.apache.kafka.streams.TopologyTestDriverTest > shouldProcessFromSourceThatMatchPattern[Eos enabled = false] PASSED
org.apache.kafka.streams.TopologyTestDriverTest > shouldCaptureSinkTopicNamesIfWrittenInto[Eos enabled = false] STARTED
org.apache.kafka.streams.TopologyTestDriverTest > shouldCaptureSinkTopicNamesIfWrittenInto[Eos enabled = false] PASSED
org.apache.kafka.streams.TopologyTestDriverTest > shouldUpdateStoreForNewKey[Eos enabled = false] STARTED
org.apache.kafka.streams.TopologyTestDriverTest > shouldUpdateStoreForNewKey[Eos enabled = false] PASSED
org.apache.kafka.streams.TopologyTestDriverTest > shouldSendRecordViaCorrectSourceTopicDeprecated[Eos enabled = false] STARTED
org.apache.kafka.streams.TopologyTestDriverTest > shouldSendRecordViaCorrectSourceTopicDeprecated[Eos enabled = false] PASSED
org.apache.kafka.streams.TopologyTestDriverTest > shouldPunctuateOnWallClockTime[Eos enabled = false] STARTED
org.apache.kafka.streams.TopologyTestDriverTest > shouldPunctuateOnWallClockTime[Eos enabled = false] PASSED
org.apache.kafka.streams.TopologyTestDriverTest > shouldSetRecordMetadata[Eos enabled = false] STARTED
org.apache.kafka.streams.TopologyTestDriverTest > shouldSetRecordMetadata[Eos enabled = false] PASSED
org.apache.kafka.streams.TopologyTestDriverTest > shouldNotUpdateStoreForLargerValue[Eos enabled = false] STARTED
org.apache.kafka.streams.TopologyTestDriverTest > shouldNotUpdateStoreForLargerValue[Eos enabled = false] PASSED
org.apache.kafka.streams.TopologyTestDriverTest > shouldReturnCorrectInMemoryStoreTypeOnly[Eos enabled = false] STARTED
org.apache.kafka.streams.TopologyTestDriverTest > shouldReturnCorrectInMemoryStoreTypeOnly[Eos enabled = false] PASSED
org.apache.kafka.streams.TopologyTestDriverTest > shouldThrowForMissingTime[Eos enabled = false] STARTED
org.apache.kafka.streams.TopologyTestDriverTest > shouldThrowForMissingTime[Eos enabled = false] PASSED
org.apache.kafka.streams.TopologyTestDriverTest > shouldCaptureInternalTopicNamesIfWrittenInto[Eos enabled = false] STARTED
org.apache.kafka.streams.TopologyTestDriverTest > shouldCaptureInternalTopicNamesIfWrittenInto[Eos enabled = false] PASSED
org.apache.kafka.streams.TopologyTestDriverTest > shouldPunctuateOnWallClockTimeDeprecated[Eos enabled = false] STARTED
org.apache.kafka.streams.TopologyTestDriverTest > shouldPunctuateOnWallClockTimeDeprecated[Eos enabled = false] PASSED
org.apache.kafka.streams.TopologyTestDriverTest > shouldProcessRecordForTopic[Eos enabled = false] STARTED
org.apache.kafka.streams.TopologyTestDriverTest > shouldProcessRecordForTopic[Eos enabled = false] PASSED
org.apache.kafka.streams.TopologyTestDriverTest > shouldForwardRecordsFromSubtopologyToSubtopology[Eos enabled = false] STARTED
org.apache.kafka.streams.TopologyTestDriverTest > shouldForwardRecordsFromSubtopologyToSubtopology[Eos enabled = false] PASSED
org.apache.kafka.streams.TopologyTestDriverTest > shouldNotUpdateStoreForSmallerValue[Eos enabled = false] STARTED
org.apache.kafka.streams.TopologyTestDriverTest > shouldNotUpdateStoreForSmallerValue[Eos enabled = false] PASSED
org.apache.kafka.streams.TopologyTestDriverTest > shouldCreateStateDirectoryForStatefulTopology[Eos enabled = false] STARTED
org.apache.kafka.streams.TopologyTestDriverTest > shouldCreateStateDirectoryForStatefulTopology[Eos enabled = false] PASSED
org.apache.kafka.streams.TopologyTestDriverTest > shouldPunctuateIfWallClockTimeAdvances[Eos enabled = false] STARTED
org.apache.kafka.streams.TopologyTestDriverTest > shouldPunctuateIfWallClockTimeAdvances[Eos enabled = false] PASSED
> Task :streams:upgrade-system-tests-0100:spotbugsMain NO-SOURCE
> Task :streams:upgrade-system-tests-0100:test
> Task :streams:upgrade-system-tests-0101:compileJava NO-SOURCE
> Task :streams:upgrade-system-tests-0101:processResources NO-SOURCE
> Task :streams:upgrade-system-tests-0101:classes UP-TO-DATE
> Task :streams:upgrade-system-tests-0101:checkstyleMain NO-SOURCE
> Task :streams:upgrade-system-tests-0101:compileTestJava
> Task :streams:upgrade-system-tests-0101:processTestResources NO-SOURCE
> Task :streams:upgrade-system-tests-0101:testClasses
> Task :streams:upgrade-system-tests-0101:checkstyleTest
> Task :streams:upgrade-system-tests-0101:spotbugsMain NO-SOURCE
> Task :streams:upgrade-system-tests-0101:test
> Task :streams:upgrade-system-tests-0102:compileJava NO-SOURCE
> Task :streams:upgrade-system-tests-0102:processResources NO-SOURCE
> Task :streams:upgrade-system-tests-0102:classes UP-TO-DATE
> Task :streams:upgrade-system-tests-0102:checkstyleMain NO-SOURCE
> Task :streams:upgrade-system-tests-0102:compileTestJava
> Task :streams:upgrade-system-tests-0102:processTestResources NO-SOURCE
> Task :streams:upgrade-system-tests-0102:testClasses
> Task :streams:upgrade-system-tests-0102:checkstyleTest
> Task :streams:upgrade-system-tests-0102:spotbugsMain NO-SOURCE
> Task :streams:upgrade-system-tests-0102:test
> Task :streams:upgrade-system-tests-0110:compileJava NO-SOURCE
> Task :streams:upgrade-system-tests-0110:processResources NO-SOURCE
> Task :streams:upgrade-system-tests-0110:classes UP-TO-DATE
> Task :streams:upgrade-system-tests-0110:checkstyleMain NO-SOURCE
> Task :streams:upgrade-system-tests-0110:compileTestJava
> Task :streams:upgrade-system-tests-0110:processTestResources NO-SOURCE
> Task :streams:upgrade-system-tests-0110:testClasses
> Task :streams:upgrade-system-tests-0110:checkstyleTest
> Task :streams:upgrade-system-tests-0110:spotbugsMain NO-SOURCE
> Task :streams:upgrade-system-tests-0110:test
> Task :streams:upgrade-system-tests-10:compileJava NO-SOURCE
> Task :streams:upgrade-system-tests-10:processResources NO-SOURCE
> Task :streams:upgrade-system-tests-10:classes UP-TO-DATE
> Task :streams:upgrade-system-tests-10:checkstyleMain NO-SOURCE
> Task :streams:upgrade-system-tests-10:compileTestJava
> Task :streams:upgrade-system-tests-10:processTestResources NO-SOURCE
> Task :streams:upgrade-system-tests-10:testClasses
> Task :streams:upgrade-system-tests-10:checkstyleTest
> Task :streams:upgrade-system-tests-10:spotbugsMain NO-SOURCE
> Task :streams:upgrade-system-tests-10:test
> Task :streams:upgrade-system-tests-11:compileJava NO-SOURCE
> Task :streams:upgrade-system-tests-11:processResources NO-SOURCE
> Task :streams:upgrade-system-tests-11:classes UP-TO-DATE
> Task :streams:upgrade-system-tests-11:checkstyleMain NO-SOURCE
> Task :streams:upgrade-system-tests-11:compileTestJava
> Task :streams:upgrade-system-tests-11:processTestResources NO-SOURCE
> Task :streams:upgrade-system-tests-11:testClasses
> Task :streams:upgrade-system-tests-11:checkstyleTest
> Task :streams:upgrade-system-tests-11:spotbugsMain NO-SOURCE
> Task :streams:upgrade-system-tests-11:test
> Task :streams:upgrade-system-tests-20:compileJava NO-SOURCE
> Task :streams:upgrade-system-tests-20:processResources NO-SOURCE
> Task :streams:upgrade-system-tests-20:classes UP-TO-DATE
> Task :streams:upgrade-system-tests-20:checkstyleMain NO-SOURCE
> Task :streams:upgrade-system-tests-20:compileTestJava
> Task :streams:upgrade-system-tests-20:processTestResources NO-SOURCE
> Task :streams:upgrade-system-tests-20:testClasses
> Task :streams:upgrade-system-tests-20:checkstyleTest
> Task :streams:upgrade-system-tests-20:spotbugsMain NO-SOURCE
> Task :streams:upgrade-system-tests-20:test
> Task :streams:upgrade-system-tests-21:compileJava NO-SOURCE
> Task :streams:upgrade-system-tests-21:processResources NO-SOURCE
> Task :streams:upgrade-system-tests-21:classes UP-TO-DATE
> Task :streams:upgrade-system-tests-21:checkstyleMain NO-SOURCE
> Task :streams:upgrade-system-tests-21:compileTestJava
> Task :streams:upgrade-system-tests-21:processTestResources NO-SOURCE
> Task :streams:upgrade-system-tests-21:testClasses
> Task :streams:upgrade-system-tests-21:checkstyleTest
> Task :streams:upgrade-system-tests-21:spotbugsMain NO-SOURCE
> Task :streams:upgrade-system-tests-21:test
> Task :streams:upgrade-system-tests-22:compileJava NO-SOURCE
> Task :streams:upgrade-system-tests-22:processResources NO-SOURCE
> Task :streams:upgrade-system-tests-22:classes UP-TO-DATE
> Task :streams:upgrade-system-tests-22:checkstyleMain NO-SOURCE
> Task :streams:upgrade-system-tests-22:compileTestJava
> Task :streams:upgrade-system-tests-22:processTestResources NO-SOURCE
> Task :streams:upgrade-system-tests-22:testClasses
> Task :streams:upgrade-system-tests-22:checkstyleTest
> Task :streams:upgrade-system-tests-22:spotbugsMain NO-SOURCE
> Task :streams:upgrade-system-tests-22:test
> Task :streams:upgrade-system-tests-23:compileJava NO-SOURCE
> Task :streams:upgrade-system-tests-23:processResources NO-SOURCE
> Task :streams:upgrade-system-tests-23:classes UP-TO-DATE
> Task :streams:upgrade-system-tests-23:checkstyleMain NO-SOURCE
> Task :streams:upgrade-system-tests-23:compileTestJava
> Task :streams:upgrade-system-tests-23:processTestResources NO-SOURCE
> Task :streams:upgrade-system-tests-23:testClasses
> Task :streams:upgrade-system-tests-23:checkstyleTest
> Task :streams:upgrade-system-tests-23:spotbugsMain NO-SOURCE
> Task :streams:upgrade-system-tests-23:test
> Task :streams:upgrade-system-tests-24:compileJava NO-SOURCE
> Task :streams:upgrade-system-tests-24:processResources NO-SOURCE
> Task :streams:upgrade-system-tests-24:classes UP-TO-DATE
> Task :streams:upgrade-system-tests-24:checkstyleMain NO-SOURCE
> Task :streams:upgrade-system-tests-24:compileTestJava
> Task :streams:upgrade-system-tests-24:processTestResources NO-SOURCE
> Task :streams:upgrade-system-tests-24:testClasses
> Task :streams:upgrade-system-tests-24:checkstyleTest
> Task :streams:upgrade-system-tests-24:spotbugsMain NO-SOURCE
> Task :streams:upgrade-system-tests-24:test
> Task :streams:upgrade-system-tests-25:compileJava NO-SOURCE
> Task :streams:upgrade-system-tests-25:processResources NO-SOURCE
> Task :streams:upgrade-system-tests-25:classes UP-TO-DATE
> Task :streams:upgrade-system-tests-25:checkstyleMain NO-SOURCE
> Task :streams:upgrade-system-tests-25:compileTestJava
> Task :streams:upgrade-system-tests-25:processTestResources NO-SOURCE
> Task :streams:upgrade-system-tests-25:testClasses
> Task :streams:upgrade-system-tests-25:checkstyleTest
> Task :streams:upgrade-system-tests-25:spotbugsMain NO-SOURCE
> Task :streams:upgrade-system-tests-25:test
FAILURE: Build failed with an exception.
* What went wrong:
Execution failed for task ':connect:mirror:test'.
> There were failing tests. See the report at: file://<https://builds.apache.org/job/kafka-trunk-jdk8/ws/connect/mirror/build/reports/tests/test/index.html>
* Try:
Run with --stacktrace option to get the stack trace. Run with --info or --debug option to get more log output. Run with --scan to get full insights.
* Get more help at https://help.gradle.org
Deprecated Gradle features were used in this build, making it incompatible with Gradle 7.0.
Use '--warning-mode all' to show the individual deprecation warnings.
See https://docs.gradle.org/6.5/userguide/command_line_interface.html#sec:command_line_warnings
BUILD FAILED in 1h 55m 30s
215 actionable tasks: 183 executed, 32 up-to-date
Build step 'Execute shell' marked build as failure
[FINDBUGS] Collecting findbugs analysis files...
Setting GRADLE_4_10_3_HOME=/home/jenkins/tools/gradle/4.10.3
[FINDBUGS] Searching for all files in <https://builds.apache.org/job/kafka-trunk-jdk8/ws/> that match the pattern **/build/reports/*bugs/*.xml
[FINDBUGS] Parsing 19 files in <https://builds.apache.org/job/kafka-trunk-jdk8/ws/>
[FINDBUGS] Successfully parsed file <https://builds.apache.org/job/kafka-trunk-jdk8/ws/clients/build/reports/spotbugs/main.xml> with 0 unique warnings and 0 duplicates.
[FINDBUGS] Successfully parsed file <https://builds.apache.org/job/kafka-trunk-jdk8/ws/connect/api/build/reports/spotbugs/main.xml> with 0 unique warnings and 0 duplicates.
[FINDBUGS] Successfully parsed file <https://builds.apache.org/job/kafka-trunk-jdk8/ws/connect/basic-auth-extension/build/reports/spotbugs/main.xml> with 0 unique warnings and 0 duplicates.
[FINDBUGS] Successfully parsed file <https://builds.apache.org/job/kafka-trunk-jdk8/ws/connect/file/build/reports/spotbugs/main.xml> with 0 unique warnings and 0 duplicates.
[FINDBUGS] Successfully parsed file <https://builds.apache.org/job/kafka-trunk-jdk8/ws/connect/json/build/reports/spotbugs/main.xml> with 0 unique warnings and 0 duplicates.
[FINDBUGS] Successfully parsed file <https://builds.apache.org/job/kafka-trunk-jdk8/ws/connect/mirror-client/build/reports/spotbugs/main.xml> with 0 unique warnings and 0 duplicates.
[FINDBUGS] Successfully parsed file <https://builds.apache.org/job/kafka-trunk-jdk8/ws/connect/mirror/build/reports/spotbugs/main.xml> with 0 unique warnings and 0 duplicates.
[FINDBUGS] Successfully parsed file <https://builds.apache.org/job/kafka-trunk-jdk8/ws/connect/runtime/build/reports/spotbugs/main.xml> with 0 unique warnings and 0 duplicates.
[FINDBUGS] Successfully parsed file <https://builds.apache.org/job/kafka-trunk-jdk8/ws/connect/transforms/build/reports/spotbugs/main.xml> with 0 unique warnings and 0 duplicates.
[FINDBUGS] Successfully parsed file <https://builds.apache.org/job/kafka-trunk-jdk8/ws/core/build/reports/spotbugs/main.xml> with 0 unique warnings and 0 duplicates.
[FINDBUGS] Successfully parsed file <https://builds.apache.org/job/kafka-trunk-jdk8/ws/examples/build/reports/spotbugs/main.xml> with 0 unique warnings and 0 duplicates.
[FINDBUGS] Successfully parsed file <https://builds.apache.org/job/kafka-trunk-jdk8/ws/generator/build/reports/spotbugs/main.xml> with 0 unique warnings and 0 duplicates.
[FINDBUGS] Successfully parsed file <https://builds.apache.org/job/kafka-trunk-jdk8/ws/jmh-benchmarks/build/reports/spotbugs/main.xml> with 0 unique warnings and 0 duplicates.
[FINDBUGS] Successfully parsed file <https://builds.apache.org/job/kafka-trunk-jdk8/ws/log4j-appender/build/reports/spotbugs/main.xml> with 0 unique warnings and 0 duplicates.
[FINDBUGS] Successfully parsed file <https://builds.apache.org/job/kafka-trunk-jdk8/ws/streams/build/reports/spotbugs/main.xml> with 0 unique warnings and 0 duplicates.
[FINDBUGS] Successfully parsed file <https://builds.apache.org/job/kafka-trunk-jdk8/ws/streams/examples/build/reports/spotbugs/main.xml> with 0 unique warnings and 0 duplicates.
[FINDBUGS] Successfully parsed file <https://builds.apache.org/job/kafka-trunk-jdk8/ws/streams/streams-scala/build/reports/spotbugs/main.xml> with 0 unique warnings and 0 duplicates.
[FINDBUGS] Successfully parsed file <https://builds.apache.org/job/kafka-trunk-jdk8/ws/streams/test-utils/build/reports/spotbugs/main.xml> with 0 unique warnings and 0 duplicates.
[FINDBUGS] Successfully parsed file <https://builds.apache.org/job/kafka-trunk-jdk8/ws/tools/build/reports/spotbugs/main.xml> with 0 unique warnings and 0 duplicates.
Setting GRADLE_4_10_3_HOME=/home/jenkins/tools/gradle/4.10.3
No credentials specified
Setting GRADLE_4_10_3_HOME=/home/jenkins/tools/gradle/4.10.3
<Git Blamer> Using GitBlamer to create author and commit information for all warnings.
<Git Blamer> GIT_COMMIT=7ed899a320697e20a7c7f9a2753dd5de6bbecb9d, workspace=<https://builds.apache.org/job/kafka-trunk-jdk8/ws/>
[FINDBUGS] Computing warning deltas based on reference build #4632
Recording test results
Setting GRADLE_4_10_3_HOME=/home/jenkins/tools/gradle/4.10.3
Setting GRADLE_4_10_3_HOME=/home/jenkins/tools/gradle/4.10.3
Not sending mail to unregistered user noreply@github.com
Build failed in Jenkins: kafka-trunk-jdk8 #4650
Posted by Apache Jenkins Server <je...@builds.apache.org>.
See <https://builds.apache.org/job/kafka-trunk-jdk8/4650/display/redirect?page=changes>
Changes:
[github] MINOR: reuse toConfigObject(Map) to generate Config (#8889)
------------------------------------------
[...truncated 6.30 MB...]
org.apache.kafka.streams.TopologyTestDriverTest > shouldProcessConsumerRecordList[Eos enabled = false] STARTED
org.apache.kafka.streams.TopologyTestDriverTest > shouldProcessConsumerRecordList[Eos enabled = false] PASSED
org.apache.kafka.streams.TopologyTestDriverTest > shouldUseSinkSpecificSerializers[Eos enabled = false] STARTED
org.apache.kafka.streams.TopologyTestDriverTest > shouldUseSinkSpecificSerializers[Eos enabled = false] PASSED
org.apache.kafka.streams.TopologyTestDriverTest > shouldFlushStoreForFirstInput[Eos enabled = false] STARTED
org.apache.kafka.streams.TopologyTestDriverTest > shouldFlushStoreForFirstInput[Eos enabled = false] PASSED
org.apache.kafka.streams.TopologyTestDriverTest > shouldProcessFromSourceThatMatchPattern[Eos enabled = false] STARTED
org.apache.kafka.streams.TopologyTestDriverTest > shouldProcessFromSourceThatMatchPattern[Eos enabled = false] PASSED
org.apache.kafka.streams.TopologyTestDriverTest > shouldCaptureSinkTopicNamesIfWrittenInto[Eos enabled = false] STARTED
org.apache.kafka.streams.TopologyTestDriverTest > shouldCaptureSinkTopicNamesIfWrittenInto[Eos enabled = false] PASSED
org.apache.kafka.streams.TopologyTestDriverTest > shouldUpdateStoreForNewKey[Eos enabled = false] STARTED
org.apache.kafka.streams.TopologyTestDriverTest > shouldUpdateStoreForNewKey[Eos enabled = false] PASSED
org.apache.kafka.streams.TopologyTestDriverTest > shouldSendRecordViaCorrectSourceTopicDeprecated[Eos enabled = false] STARTED
org.apache.kafka.streams.TopologyTestDriverTest > shouldSendRecordViaCorrectSourceTopicDeprecated[Eos enabled = false] PASSED
org.apache.kafka.streams.TopologyTestDriverTest > shouldPunctuateOnWallClockTime[Eos enabled = false] STARTED
org.apache.kafka.streams.TopologyTestDriverTest > shouldPunctuateOnWallClockTime[Eos enabled = false] PASSED
org.apache.kafka.streams.TopologyTestDriverTest > shouldSetRecordMetadata[Eos enabled = false] STARTED
org.apache.kafka.streams.TopologyTestDriverTest > shouldSetRecordMetadata[Eos enabled = false] PASSED
org.apache.kafka.streams.TopologyTestDriverTest > shouldNotUpdateStoreForLargerValue[Eos enabled = false] STARTED
org.apache.kafka.streams.TopologyTestDriverTest > shouldNotUpdateStoreForLargerValue[Eos enabled = false] PASSED
org.apache.kafka.streams.TopologyTestDriverTest > shouldReturnCorrectInMemoryStoreTypeOnly[Eos enabled = false] STARTED
org.apache.kafka.streams.TopologyTestDriverTest > shouldReturnCorrectInMemoryStoreTypeOnly[Eos enabled = false] PASSED
org.apache.kafka.streams.TopologyTestDriverTest > shouldThrowForMissingTime[Eos enabled = false] STARTED
org.apache.kafka.streams.TopologyTestDriverTest > shouldThrowForMissingTime[Eos enabled = false] PASSED
org.apache.kafka.streams.TopologyTestDriverTest > shouldCaptureInternalTopicNamesIfWrittenInto[Eos enabled = false] STARTED
org.apache.kafka.streams.TopologyTestDriverTest > shouldCaptureInternalTopicNamesIfWrittenInto[Eos enabled = false] PASSED
org.apache.kafka.streams.TopologyTestDriverTest > shouldPunctuateOnWallClockTimeDeprecated[Eos enabled = false] STARTED
org.apache.kafka.streams.TopologyTestDriverTest > shouldPunctuateOnWallClockTimeDeprecated[Eos enabled = false] PASSED
org.apache.kafka.streams.TopologyTestDriverTest > shouldProcessRecordForTopic[Eos enabled = false] STARTED
org.apache.kafka.streams.TopologyTestDriverTest > shouldProcessRecordForTopic[Eos enabled = false] PASSED
org.apache.kafka.streams.TopologyTestDriverTest > shouldForwardRecordsFromSubtopologyToSubtopology[Eos enabled = false] STARTED
org.apache.kafka.streams.TopologyTestDriverTest > shouldForwardRecordsFromSubtopologyToSubtopology[Eos enabled = false] PASSED
org.apache.kafka.streams.TopologyTestDriverTest > shouldNotUpdateStoreForSmallerValue[Eos enabled = false] STARTED
org.apache.kafka.streams.TopologyTestDriverTest > shouldNotUpdateStoreForSmallerValue[Eos enabled = false] PASSED
org.apache.kafka.streams.TopologyTestDriverTest > shouldCreateStateDirectoryForStatefulTopology[Eos enabled = false] STARTED
org.apache.kafka.streams.TopologyTestDriverTest > shouldCreateStateDirectoryForStatefulTopology[Eos enabled = false] PASSED
org.apache.kafka.streams.TopologyTestDriverTest > shouldPunctuateIfWallClockTimeAdvances[Eos enabled = false] STARTED
org.apache.kafka.streams.TopologyTestDriverTest > shouldPunctuateIfWallClockTimeAdvances[Eos enabled = false] PASSED
> Task :streams:upgrade-system-tests-0100:compileJava NO-SOURCE
> Task :streams:upgrade-system-tests-0100:processResources NO-SOURCE
> Task :streams:upgrade-system-tests-0100:classes UP-TO-DATE
> Task :streams:upgrade-system-tests-0100:checkstyleMain NO-SOURCE
> Task :streams:upgrade-system-tests-0100:compileTestJava
> Task :streams:upgrade-system-tests-0100:processTestResources NO-SOURCE
> Task :streams:upgrade-system-tests-0100:testClasses
> Task :streams:upgrade-system-tests-0100:checkstyleTest
> Task :streams:upgrade-system-tests-0100:spotbugsMain NO-SOURCE
> Task :streams:upgrade-system-tests-0100:test
> Task :streams:upgrade-system-tests-0101:compileJava NO-SOURCE
> Task :streams:upgrade-system-tests-0101:processResources NO-SOURCE
> Task :streams:upgrade-system-tests-0101:classes UP-TO-DATE
> Task :streams:upgrade-system-tests-0101:checkstyleMain NO-SOURCE
> Task :streams:upgrade-system-tests-0101:compileTestJava
> Task :streams:upgrade-system-tests-0101:processTestResources NO-SOURCE
> Task :streams:upgrade-system-tests-0101:testClasses
> Task :streams:upgrade-system-tests-0101:checkstyleTest
> Task :streams:upgrade-system-tests-0101:spotbugsMain NO-SOURCE
> Task :streams:upgrade-system-tests-0101:test
> Task :streams:upgrade-system-tests-0102:compileJava NO-SOURCE
> Task :streams:upgrade-system-tests-0102:processResources NO-SOURCE
> Task :streams:upgrade-system-tests-0102:classes UP-TO-DATE
> Task :streams:upgrade-system-tests-0102:checkstyleMain NO-SOURCE
> Task :streams:upgrade-system-tests-0102:compileTestJava
> Task :streams:upgrade-system-tests-0102:processTestResources NO-SOURCE
> Task :streams:upgrade-system-tests-0102:testClasses
> Task :streams:upgrade-system-tests-0102:checkstyleTest
> Task :streams:upgrade-system-tests-0102:spotbugsMain NO-SOURCE
> Task :streams:upgrade-system-tests-0102:test
> Task :streams:upgrade-system-tests-0110:compileJava NO-SOURCE
> Task :streams:upgrade-system-tests-0110:processResources NO-SOURCE
> Task :streams:upgrade-system-tests-0110:classes UP-TO-DATE
> Task :streams:upgrade-system-tests-0110:checkstyleMain NO-SOURCE
> Task :streams:upgrade-system-tests-0110:compileTestJava
> Task :streams:upgrade-system-tests-0110:processTestResources NO-SOURCE
> Task :streams:upgrade-system-tests-0110:testClasses
> Task :streams:upgrade-system-tests-0110:checkstyleTest
> Task :streams:upgrade-system-tests-0110:spotbugsMain NO-SOURCE
> Task :streams:upgrade-system-tests-0110:test
> Task :streams:upgrade-system-tests-10:compileJava NO-SOURCE
> Task :streams:upgrade-system-tests-10:processResources NO-SOURCE
> Task :streams:upgrade-system-tests-10:classes UP-TO-DATE
> Task :streams:upgrade-system-tests-10:checkstyleMain NO-SOURCE
> Task :streams:upgrade-system-tests-10:compileTestJava
> Task :streams:upgrade-system-tests-10:processTestResources NO-SOURCE
> Task :streams:upgrade-system-tests-10:testClasses
> Task :streams:upgrade-system-tests-10:checkstyleTest
> Task :streams:upgrade-system-tests-10:spotbugsMain NO-SOURCE
> Task :streams:upgrade-system-tests-10:test
> Task :streams:upgrade-system-tests-11:compileJava NO-SOURCE
> Task :streams:upgrade-system-tests-11:processResources NO-SOURCE
> Task :streams:upgrade-system-tests-11:classes UP-TO-DATE
> Task :streams:upgrade-system-tests-11:checkstyleMain NO-SOURCE
> Task :streams:upgrade-system-tests-11:compileTestJava
> Task :streams:upgrade-system-tests-11:processTestResources NO-SOURCE
> Task :streams:upgrade-system-tests-11:testClasses
> Task :streams:upgrade-system-tests-11:checkstyleTest
> Task :streams:upgrade-system-tests-11:spotbugsMain NO-SOURCE
> Task :streams:upgrade-system-tests-11:test
> Task :streams:upgrade-system-tests-20:compileJava NO-SOURCE
> Task :streams:upgrade-system-tests-20:processResources NO-SOURCE
> Task :streams:upgrade-system-tests-20:classes UP-TO-DATE
> Task :streams:upgrade-system-tests-20:checkstyleMain NO-SOURCE
> Task :streams:upgrade-system-tests-20:compileTestJava
> Task :streams:upgrade-system-tests-20:processTestResources NO-SOURCE
> Task :streams:upgrade-system-tests-20:testClasses
> Task :streams:upgrade-system-tests-20:checkstyleTest
> Task :streams:upgrade-system-tests-20:spotbugsMain NO-SOURCE
> Task :streams:upgrade-system-tests-20:test
> Task :streams:upgrade-system-tests-21:compileJava NO-SOURCE
> Task :streams:upgrade-system-tests-21:processResources NO-SOURCE
> Task :streams:upgrade-system-tests-21:classes UP-TO-DATE
> Task :streams:upgrade-system-tests-21:checkstyleMain NO-SOURCE
> Task :streams:upgrade-system-tests-21:compileTestJava
> Task :streams:upgrade-system-tests-21:processTestResources NO-SOURCE
> Task :streams:upgrade-system-tests-21:testClasses
> Task :streams:upgrade-system-tests-21:checkstyleTest
> Task :streams:upgrade-system-tests-21:spotbugsMain NO-SOURCE
> Task :streams:upgrade-system-tests-21:test
> Task :streams:upgrade-system-tests-22:compileJava NO-SOURCE
> Task :streams:upgrade-system-tests-22:processResources NO-SOURCE
> Task :streams:upgrade-system-tests-22:classes UP-TO-DATE
> Task :streams:upgrade-system-tests-22:checkstyleMain NO-SOURCE
> Task :streams:upgrade-system-tests-22:compileTestJava
> Task :streams:upgrade-system-tests-22:processTestResources NO-SOURCE
> Task :streams:upgrade-system-tests-22:testClasses
> Task :streams:upgrade-system-tests-22:checkstyleTest
> Task :streams:upgrade-system-tests-22:spotbugsMain NO-SOURCE
> Task :streams:upgrade-system-tests-22:test
> Task :streams:upgrade-system-tests-23:compileJava NO-SOURCE
> Task :streams:upgrade-system-tests-23:processResources NO-SOURCE
> Task :streams:upgrade-system-tests-23:classes UP-TO-DATE
> Task :streams:upgrade-system-tests-23:checkstyleMain NO-SOURCE
> Task :streams:upgrade-system-tests-23:compileTestJava
> Task :streams:upgrade-system-tests-23:processTestResources NO-SOURCE
> Task :streams:upgrade-system-tests-23:testClasses
> Task :streams:upgrade-system-tests-23:checkstyleTest
> Task :streams:upgrade-system-tests-23:spotbugsMain NO-SOURCE
> Task :streams:upgrade-system-tests-23:test
> Task :streams:upgrade-system-tests-24:compileJava NO-SOURCE
> Task :streams:upgrade-system-tests-24:processResources NO-SOURCE
> Task :streams:upgrade-system-tests-24:classes UP-TO-DATE
> Task :streams:upgrade-system-tests-24:checkstyleMain NO-SOURCE
> Task :streams:upgrade-system-tests-24:compileTestJava
> Task :streams:upgrade-system-tests-24:processTestResources NO-SOURCE
> Task :streams:upgrade-system-tests-24:testClasses
> Task :streams:upgrade-system-tests-24:checkstyleTest
> Task :streams:upgrade-system-tests-24:spotbugsMain NO-SOURCE
> Task :streams:upgrade-system-tests-24:test
> Task :streams:upgrade-system-tests-25:compileJava NO-SOURCE
> Task :streams:upgrade-system-tests-25:processResources NO-SOURCE
> Task :streams:upgrade-system-tests-25:classes UP-TO-DATE
> Task :streams:upgrade-system-tests-25:checkstyleMain NO-SOURCE
> Task :streams:upgrade-system-tests-25:compileTestJava
> Task :streams:upgrade-system-tests-25:processTestResources NO-SOURCE
> Task :streams:upgrade-system-tests-25:testClasses
> Task :streams:upgrade-system-tests-25:checkstyleTest
> Task :streams:upgrade-system-tests-25:spotbugsMain NO-SOURCE
> Task :streams:upgrade-system-tests-25:test
FAILURE: Build failed with an exception.
* What went wrong:
Execution failed for task ':connect:mirror:test'.
> There were failing tests. See the report at: file://<https://builds.apache.org/job/kafka-trunk-jdk8/ws/connect/mirror/build/reports/tests/test/index.html>
* Try:
Run with --stacktrace option to get the stack trace. Run with --info or --debug option to get more log output. Run with --scan to get full insights.
* Get more help at https://help.gradle.org
Deprecated Gradle features were used in this build, making it incompatible with Gradle 7.0.
Use '--warning-mode all' to show the individual deprecation warnings.
See https://docs.gradle.org/6.5/userguide/command_line_interface.html#sec:command_line_warnings
BUILD FAILED in 1h 55m 17s
215 actionable tasks: 210 executed, 5 up-to-date
Build step 'Execute shell' marked build as failure
[FINDBUGS] Collecting findbugs analysis files...
Setting GRADLE_4_10_3_HOME=/home/jenkins/tools/gradle/4.10.3
[FINDBUGS] Searching for all files in <https://builds.apache.org/job/kafka-trunk-jdk8/ws/> that match the pattern **/build/reports/*bugs/*.xml
[FINDBUGS] Parsing 19 files in <https://builds.apache.org/job/kafka-trunk-jdk8/ws/>
[FINDBUGS] Successfully parsed file <https://builds.apache.org/job/kafka-trunk-jdk8/ws/clients/build/reports/spotbugs/main.xml> with 0 unique warnings and 0 duplicates.
[FINDBUGS] Successfully parsed file <https://builds.apache.org/job/kafka-trunk-jdk8/ws/connect/api/build/reports/spotbugs/main.xml> with 0 unique warnings and 0 duplicates.
[FINDBUGS] Successfully parsed file <https://builds.apache.org/job/kafka-trunk-jdk8/ws/connect/basic-auth-extension/build/reports/spotbugs/main.xml> with 0 unique warnings and 0 duplicates.
[FINDBUGS] Successfully parsed file <https://builds.apache.org/job/kafka-trunk-jdk8/ws/connect/file/build/reports/spotbugs/main.xml> with 0 unique warnings and 0 duplicates.
[FINDBUGS] Successfully parsed file <https://builds.apache.org/job/kafka-trunk-jdk8/ws/connect/json/build/reports/spotbugs/main.xml> with 0 unique warnings and 0 duplicates.
[FINDBUGS] Successfully parsed file <https://builds.apache.org/job/kafka-trunk-jdk8/ws/connect/mirror-client/build/reports/spotbugs/main.xml> with 0 unique warnings and 0 duplicates.
[FINDBUGS] Successfully parsed file <https://builds.apache.org/job/kafka-trunk-jdk8/ws/connect/mirror/build/reports/spotbugs/main.xml> with 0 unique warnings and 0 duplicates.
[FINDBUGS] Successfully parsed file <https://builds.apache.org/job/kafka-trunk-jdk8/ws/connect/runtime/build/reports/spotbugs/main.xml> with 0 unique warnings and 0 duplicates.
[FINDBUGS] Successfully parsed file <https://builds.apache.org/job/kafka-trunk-jdk8/ws/connect/transforms/build/reports/spotbugs/main.xml> with 0 unique warnings and 0 duplicates.
[FINDBUGS] Successfully parsed file <https://builds.apache.org/job/kafka-trunk-jdk8/ws/core/build/reports/spotbugs/main.xml> with 0 unique warnings and 0 duplicates.
[FINDBUGS] Successfully parsed file <https://builds.apache.org/job/kafka-trunk-jdk8/ws/examples/build/reports/spotbugs/main.xml> with 0 unique warnings and 0 duplicates.
[FINDBUGS] Successfully parsed file <https://builds.apache.org/job/kafka-trunk-jdk8/ws/generator/build/reports/spotbugs/main.xml> with 0 unique warnings and 0 duplicates.
[FINDBUGS] Successfully parsed file <https://builds.apache.org/job/kafka-trunk-jdk8/ws/jmh-benchmarks/build/reports/spotbugs/main.xml> with 0 unique warnings and 0 duplicates.
[FINDBUGS] Successfully parsed file <https://builds.apache.org/job/kafka-trunk-jdk8/ws/log4j-appender/build/reports/spotbugs/main.xml> with 0 unique warnings and 0 duplicates.
[FINDBUGS] Successfully parsed file <https://builds.apache.org/job/kafka-trunk-jdk8/ws/streams/build/reports/spotbugs/main.xml> with 0 unique warnings and 0 duplicates.
[FINDBUGS] Successfully parsed file <https://builds.apache.org/job/kafka-trunk-jdk8/ws/streams/examples/build/reports/spotbugs/main.xml> with 0 unique warnings and 0 duplicates.
[FINDBUGS] Successfully parsed file <https://builds.apache.org/job/kafka-trunk-jdk8/ws/streams/streams-scala/build/reports/spotbugs/main.xml> with 0 unique warnings and 0 duplicates.
[FINDBUGS] Successfully parsed file <https://builds.apache.org/job/kafka-trunk-jdk8/ws/streams/test-utils/build/reports/spotbugs/main.xml> with 0 unique warnings and 0 duplicates.
[FINDBUGS] Successfully parsed file <https://builds.apache.org/job/kafka-trunk-jdk8/ws/tools/build/reports/spotbugs/main.xml> with 0 unique warnings and 0 duplicates.
Setting GRADLE_4_10_3_HOME=/home/jenkins/tools/gradle/4.10.3
No credentials specified
Setting GRADLE_4_10_3_HOME=/home/jenkins/tools/gradle/4.10.3
<Git Blamer> Using GitBlamer to create author and commit information for all warnings.
<Git Blamer> GIT_COMMIT=3b7c2ab6d814e7860771f2eec055d34be5002e5d, workspace=<https://builds.apache.org/job/kafka-trunk-jdk8/ws/>
[FINDBUGS] Computing warning deltas based on reference build #4632
Recording test results
Setting GRADLE_4_10_3_HOME=/home/jenkins/tools/gradle/4.10.3
Setting GRADLE_4_10_3_HOME=/home/jenkins/tools/gradle/4.10.3
Not sending mail to unregistered user noreply@github.com
Build failed in Jenkins: kafka-trunk-jdk8 #4649
Posted by Apache Jenkins Server <je...@builds.apache.org>.
See <https://builds.apache.org/job/kafka-trunk-jdk8/4649/display/redirect?page=changes>
Changes:
[github] MINOR: Upgrade jetty to 9.4.27.v20200227 and jersey to 2.31 (#8859)
------------------------------------------
[...truncated 6.31 MB...]
org.apache.kafka.streams.internals.WindowStoreFacadeTest > shouldReturnName PASSED
org.apache.kafka.streams.internals.WindowStoreFacadeTest > shouldPutWithUnknownTimestamp STARTED
org.apache.kafka.streams.internals.WindowStoreFacadeTest > shouldPutWithUnknownTimestamp PASSED
org.apache.kafka.streams.internals.WindowStoreFacadeTest > shouldPutWindowStartTimestampWithUnknownTimestamp STARTED
org.apache.kafka.streams.internals.WindowStoreFacadeTest > shouldPutWindowStartTimestampWithUnknownTimestamp PASSED
org.apache.kafka.streams.internals.WindowStoreFacadeTest > shouldReturnIsPersistent STARTED
org.apache.kafka.streams.internals.WindowStoreFacadeTest > shouldReturnIsPersistent PASSED
org.apache.kafka.streams.internals.WindowStoreFacadeTest > shouldForwardClose STARTED
org.apache.kafka.streams.internals.WindowStoreFacadeTest > shouldForwardClose PASSED
org.apache.kafka.streams.internals.WindowStoreFacadeTest > shouldForwardFlush STARTED
org.apache.kafka.streams.internals.WindowStoreFacadeTest > shouldForwardFlush PASSED
org.apache.kafka.streams.internals.WindowStoreFacadeTest > shouldForwardInit STARTED
org.apache.kafka.streams.internals.WindowStoreFacadeTest > shouldForwardInit PASSED
org.apache.kafka.streams.test.TestRecordTest > testConsumerRecord STARTED
org.apache.kafka.streams.test.TestRecordTest > testConsumerRecord PASSED
org.apache.kafka.streams.test.TestRecordTest > testToString STARTED
org.apache.kafka.streams.test.TestRecordTest > testToString PASSED
org.apache.kafka.streams.test.TestRecordTest > testInvalidRecords STARTED
org.apache.kafka.streams.test.TestRecordTest > testInvalidRecords PASSED
org.apache.kafka.streams.test.TestRecordTest > testPartialConstructorEquals STARTED
org.apache.kafka.streams.test.TestRecordTest > testPartialConstructorEquals PASSED
org.apache.kafka.streams.test.TestRecordTest > testMultiFieldMatcher STARTED
org.apache.kafka.streams.test.TestRecordTest > testMultiFieldMatcher PASSED
org.apache.kafka.streams.test.TestRecordTest > testFields STARTED
org.apache.kafka.streams.test.TestRecordTest > testFields PASSED
org.apache.kafka.streams.test.TestRecordTest > testProducerRecord STARTED
org.apache.kafka.streams.test.TestRecordTest > testProducerRecord PASSED
org.apache.kafka.streams.test.TestRecordTest > testEqualsAndHashCode STARTED
org.apache.kafka.streams.test.TestRecordTest > testEqualsAndHashCode PASSED
> Task :streams:upgrade-system-tests-0100:processTestResources NO-SOURCE
> Task :streams:upgrade-system-tests-0100:testClasses
> Task :streams:upgrade-system-tests-0100:checkstyleTest
> Task :streams:upgrade-system-tests-0100:spotbugsMain NO-SOURCE
> Task :streams:upgrade-system-tests-0100:test
> Task :streams:upgrade-system-tests-0101:compileJava NO-SOURCE
> Task :streams:upgrade-system-tests-0101:processResources NO-SOURCE
> Task :streams:upgrade-system-tests-0101:classes UP-TO-DATE
> Task :streams:upgrade-system-tests-0101:checkstyleMain NO-SOURCE
> Task :streams:upgrade-system-tests-0101:compileTestJava
> Task :streams:upgrade-system-tests-0101:processTestResources NO-SOURCE
> Task :streams:upgrade-system-tests-0101:testClasses
> Task :streams:upgrade-system-tests-0101:checkstyleTest
> Task :streams:upgrade-system-tests-0101:spotbugsMain NO-SOURCE
> Task :streams:upgrade-system-tests-0101:test
> Task :streams:upgrade-system-tests-0102:compileJava NO-SOURCE
> Task :streams:upgrade-system-tests-0102:processResources NO-SOURCE
> Task :streams:upgrade-system-tests-0102:classes UP-TO-DATE
> Task :streams:upgrade-system-tests-0102:checkstyleMain NO-SOURCE
> Task :streams:upgrade-system-tests-0102:compileTestJava
> Task :streams:upgrade-system-tests-0102:processTestResources NO-SOURCE
> Task :streams:upgrade-system-tests-0102:testClasses
> Task :streams:upgrade-system-tests-0102:checkstyleTest
> Task :streams:upgrade-system-tests-0102:spotbugsMain NO-SOURCE
> Task :streams:upgrade-system-tests-0102:test
> Task :streams:upgrade-system-tests-0110:compileJava NO-SOURCE
> Task :streams:upgrade-system-tests-0110:processResources NO-SOURCE
> Task :streams:upgrade-system-tests-0110:classes UP-TO-DATE
> Task :streams:upgrade-system-tests-0110:checkstyleMain NO-SOURCE
> Task :streams:upgrade-system-tests-0110:compileTestJava
> Task :streams:upgrade-system-tests-0110:processTestResources NO-SOURCE
> Task :streams:upgrade-system-tests-0110:testClasses
> Task :streams:upgrade-system-tests-0110:checkstyleTest
> Task :streams:upgrade-system-tests-0110:spotbugsMain NO-SOURCE
> Task :streams:upgrade-system-tests-0110:test
> Task :streams:upgrade-system-tests-10:compileJava NO-SOURCE
> Task :streams:upgrade-system-tests-10:processResources NO-SOURCE
> Task :streams:upgrade-system-tests-10:classes UP-TO-DATE
> Task :streams:upgrade-system-tests-10:checkstyleMain NO-SOURCE
> Task :streams:upgrade-system-tests-10:compileTestJava
> Task :streams:upgrade-system-tests-10:processTestResources NO-SOURCE
> Task :streams:upgrade-system-tests-10:testClasses
> Task :streams:upgrade-system-tests-10:checkstyleTest
> Task :streams:upgrade-system-tests-10:spotbugsMain NO-SOURCE
> Task :streams:upgrade-system-tests-10:test
> Task :streams:upgrade-system-tests-11:compileJava NO-SOURCE
> Task :streams:upgrade-system-tests-11:processResources NO-SOURCE
> Task :streams:upgrade-system-tests-11:classes UP-TO-DATE
> Task :streams:upgrade-system-tests-11:checkstyleMain NO-SOURCE
> Task :streams:upgrade-system-tests-11:compileTestJava
> Task :streams:upgrade-system-tests-11:processTestResources NO-SOURCE
> Task :streams:upgrade-system-tests-11:testClasses
> Task :streams:upgrade-system-tests-11:checkstyleTest
> Task :streams:upgrade-system-tests-11:spotbugsMain NO-SOURCE
> Task :streams:upgrade-system-tests-11:test
> Task :streams:upgrade-system-tests-20:compileJava NO-SOURCE
> Task :streams:upgrade-system-tests-20:processResources NO-SOURCE
> Task :streams:upgrade-system-tests-20:classes UP-TO-DATE
> Task :streams:upgrade-system-tests-20:checkstyleMain NO-SOURCE
> Task :streams:upgrade-system-tests-20:compileTestJava
> Task :streams:upgrade-system-tests-20:processTestResources NO-SOURCE
> Task :streams:upgrade-system-tests-20:testClasses
> Task :streams:upgrade-system-tests-20:checkstyleTest
> Task :streams:upgrade-system-tests-20:spotbugsMain NO-SOURCE
> Task :streams:upgrade-system-tests-20:test
> Task :streams:upgrade-system-tests-21:compileJava NO-SOURCE
> Task :streams:upgrade-system-tests-21:processResources NO-SOURCE
> Task :streams:upgrade-system-tests-21:classes UP-TO-DATE
> Task :streams:upgrade-system-tests-21:checkstyleMain NO-SOURCE
> Task :streams:upgrade-system-tests-21:compileTestJava
> Task :streams:upgrade-system-tests-21:processTestResources NO-SOURCE
> Task :streams:upgrade-system-tests-21:testClasses
> Task :streams:upgrade-system-tests-21:checkstyleTest
> Task :streams:upgrade-system-tests-21:spotbugsMain NO-SOURCE
> Task :streams:upgrade-system-tests-21:test
> Task :streams:upgrade-system-tests-22:compileJava NO-SOURCE
> Task :streams:upgrade-system-tests-22:processResources NO-SOURCE
> Task :streams:upgrade-system-tests-22:classes UP-TO-DATE
> Task :streams:upgrade-system-tests-22:checkstyleMain NO-SOURCE
> Task :streams:upgrade-system-tests-22:compileTestJava
> Task :streams:upgrade-system-tests-22:processTestResources NO-SOURCE
> Task :streams:upgrade-system-tests-22:testClasses
> Task :streams:upgrade-system-tests-22:checkstyleTest
> Task :streams:upgrade-system-tests-22:spotbugsMain NO-SOURCE
> Task :streams:upgrade-system-tests-22:test
> Task :streams:upgrade-system-tests-23:compileJava NO-SOURCE
> Task :streams:upgrade-system-tests-23:processResources NO-SOURCE
> Task :streams:upgrade-system-tests-23:classes UP-TO-DATE
> Task :streams:upgrade-system-tests-23:checkstyleMain NO-SOURCE
> Task :streams:upgrade-system-tests-23:compileTestJava
> Task :streams:upgrade-system-tests-23:processTestResources NO-SOURCE
> Task :streams:upgrade-system-tests-23:testClasses
> Task :streams:upgrade-system-tests-23:checkstyleTest
> Task :streams:upgrade-system-tests-23:spotbugsMain NO-SOURCE
> Task :streams:upgrade-system-tests-23:test
> Task :streams:upgrade-system-tests-24:compileJava NO-SOURCE
> Task :streams:upgrade-system-tests-24:processResources NO-SOURCE
> Task :streams:upgrade-system-tests-24:classes UP-TO-DATE
> Task :streams:upgrade-system-tests-24:checkstyleMain NO-SOURCE
> Task :streams:upgrade-system-tests-24:compileTestJava
> Task :streams:upgrade-system-tests-24:processTestResources NO-SOURCE
> Task :streams:upgrade-system-tests-24:testClasses
> Task :streams:upgrade-system-tests-24:checkstyleTest
> Task :streams:upgrade-system-tests-24:spotbugsMain NO-SOURCE
> Task :streams:upgrade-system-tests-24:test
> Task :streams:upgrade-system-tests-25:compileJava NO-SOURCE
> Task :streams:upgrade-system-tests-25:processResources NO-SOURCE
> Task :streams:upgrade-system-tests-25:classes UP-TO-DATE
> Task :streams:upgrade-system-tests-25:checkstyleMain NO-SOURCE
> Task :streams:upgrade-system-tests-25:compileTestJava
> Task :streams:upgrade-system-tests-25:processTestResources NO-SOURCE
> Task :streams:upgrade-system-tests-25:testClasses
> Task :streams:upgrade-system-tests-25:checkstyleTest
> Task :streams:upgrade-system-tests-25:spotbugsMain NO-SOURCE
> Task :streams:upgrade-system-tests-25:test
FAILURE: Build completed with 3 failures.
1: Task failed with an exception.
-----------
* What went wrong:
Execution failed for task ':core:test'.
> There were failing tests. See the report at: file://<https://builds.apache.org/job/kafka-trunk-jdk8/ws/core/build/reports/tests/test/index.html>
* Try:
Run with --stacktrace option to get the stack trace. Run with --info or --debug option to get more log output. Run with --scan to get full insights.
==============================================================================
2: Task failed with an exception.
-----------
* What went wrong:
Execution failed for task ':streams:test'.
> There were failing tests. See the report at: file://<https://builds.apache.org/job/kafka-trunk-jdk8/ws/streams/build/reports/tests/test/index.html>
* Try:
Run with --stacktrace option to get the stack trace. Run with --info or --debug option to get more log output. Run with --scan to get full insights.
==============================================================================
3: Task failed with an exception.
-----------
* What went wrong:
Execution failed for task ':connect:mirror:test'.
> There were failing tests. See the report at: file://<https://builds.apache.org/job/kafka-trunk-jdk8/ws/connect/mirror/build/reports/tests/test/index.html>
* Try:
Run with --stacktrace option to get the stack trace. Run with --info or --debug option to get more log output. Run with --scan to get full insights.
==============================================================================
* Get more help at https://help.gradle.org
Deprecated Gradle features were used in this build, making it incompatible with Gradle 7.0.
Use '--warning-mode all' to show the individual deprecation warnings.
See https://docs.gradle.org/6.5/userguide/command_line_interface.html#sec:command_line_warnings
BUILD FAILED in 2h 2m 35s
215 actionable tasks: 210 executed, 5 up-to-date
Build step 'Execute shell' marked build as failure
[FINDBUGS] Collecting findbugs analysis files...
Setting GRADLE_4_10_3_HOME=/home/jenkins/tools/gradle/4.10.3
[FINDBUGS] Searching for all files in <https://builds.apache.org/job/kafka-trunk-jdk8/ws/> that match the pattern **/build/reports/*bugs/*.xml
[FINDBUGS] Parsing 19 files in <https://builds.apache.org/job/kafka-trunk-jdk8/ws/>
[FINDBUGS] Successfully parsed file <https://builds.apache.org/job/kafka-trunk-jdk8/ws/clients/build/reports/spotbugs/main.xml> with 0 unique warnings and 0 duplicates.
[FINDBUGS] Successfully parsed file <https://builds.apache.org/job/kafka-trunk-jdk8/ws/connect/api/build/reports/spotbugs/main.xml> with 0 unique warnings and 0 duplicates.
[FINDBUGS] Successfully parsed file <https://builds.apache.org/job/kafka-trunk-jdk8/ws/connect/basic-auth-extension/build/reports/spotbugs/main.xml> with 0 unique warnings and 0 duplicates.
[FINDBUGS] Successfully parsed file <https://builds.apache.org/job/kafka-trunk-jdk8/ws/connect/file/build/reports/spotbugs/main.xml> with 0 unique warnings and 0 duplicates.
[FINDBUGS] Successfully parsed file <https://builds.apache.org/job/kafka-trunk-jdk8/ws/connect/json/build/reports/spotbugs/main.xml> with 0 unique warnings and 0 duplicates.
[FINDBUGS] Successfully parsed file <https://builds.apache.org/job/kafka-trunk-jdk8/ws/connect/mirror-client/build/reports/spotbugs/main.xml> with 0 unique warnings and 0 duplicates.
[FINDBUGS] Successfully parsed file <https://builds.apache.org/job/kafka-trunk-jdk8/ws/connect/mirror/build/reports/spotbugs/main.xml> with 0 unique warnings and 0 duplicates.
[FINDBUGS] Successfully parsed file <https://builds.apache.org/job/kafka-trunk-jdk8/ws/connect/runtime/build/reports/spotbugs/main.xml> with 0 unique warnings and 0 duplicates.
[FINDBUGS] Successfully parsed file <https://builds.apache.org/job/kafka-trunk-jdk8/ws/connect/transforms/build/reports/spotbugs/main.xml> with 0 unique warnings and 0 duplicates.
[FINDBUGS] Successfully parsed file <https://builds.apache.org/job/kafka-trunk-jdk8/ws/core/build/reports/spotbugs/main.xml> with 0 unique warnings and 0 duplicates.
[FINDBUGS] Successfully parsed file <https://builds.apache.org/job/kafka-trunk-jdk8/ws/examples/build/reports/spotbugs/main.xml> with 0 unique warnings and 0 duplicates.
[FINDBUGS] Successfully parsed file <https://builds.apache.org/job/kafka-trunk-jdk8/ws/generator/build/reports/spotbugs/main.xml> with 0 unique warnings and 0 duplicates.
[FINDBUGS] Successfully parsed file <https://builds.apache.org/job/kafka-trunk-jdk8/ws/jmh-benchmarks/build/reports/spotbugs/main.xml> with 0 unique warnings and 0 duplicates.
[FINDBUGS] Successfully parsed file <https://builds.apache.org/job/kafka-trunk-jdk8/ws/log4j-appender/build/reports/spotbugs/main.xml> with 0 unique warnings and 0 duplicates.
[FINDBUGS] Successfully parsed file <https://builds.apache.org/job/kafka-trunk-jdk8/ws/streams/build/reports/spotbugs/main.xml> with 0 unique warnings and 0 duplicates.
[FINDBUGS] Successfully parsed file <https://builds.apache.org/job/kafka-trunk-jdk8/ws/streams/examples/build/reports/spotbugs/main.xml> with 0 unique warnings and 0 duplicates.
[FINDBUGS] Successfully parsed file <https://builds.apache.org/job/kafka-trunk-jdk8/ws/streams/streams-scala/build/reports/spotbugs/main.xml> with 0 unique warnings and 0 duplicates.
[FINDBUGS] Successfully parsed file <https://builds.apache.org/job/kafka-trunk-jdk8/ws/streams/test-utils/build/reports/spotbugs/main.xml> with 0 unique warnings and 0 duplicates.
[FINDBUGS] Successfully parsed file <https://builds.apache.org/job/kafka-trunk-jdk8/ws/tools/build/reports/spotbugs/main.xml> with 0 unique warnings and 0 duplicates.
Setting GRADLE_4_10_3_HOME=/home/jenkins/tools/gradle/4.10.3
No credentials specified
Setting GRADLE_4_10_3_HOME=/home/jenkins/tools/gradle/4.10.3
<Git Blamer> Using GitBlamer to create author and commit information for all warnings.
<Git Blamer> GIT_COMMIT=492306a0c5ad558d8acf34325985aed803ae75fd, workspace=<https://builds.apache.org/job/kafka-trunk-jdk8/ws/>
[FINDBUGS] Computing warning deltas based on reference build #4632
Recording test results
Setting GRADLE_4_10_3_HOME=/home/jenkins/tools/gradle/4.10.3
Setting GRADLE_4_10_3_HOME=/home/jenkins/tools/gradle/4.10.3
Not sending mail to unregistered user noreply@github.com
Build failed in Jenkins: kafka-trunk-jdk8 #4648
Posted by Apache Jenkins Server <je...@builds.apache.org>.
See <https://builds.apache.org/job/kafka-trunk-jdk8/4648/display/redirect?page=changes>
Changes:
[github] KAFKA-10165: Remove Percentiles from e2e metrics (#8882)
[github] KAFKA-10147 MockAdminClient#describeConfigs(Collection<ConfigResource>)
[github] MINOR: Fix flaky HighAvailabilityTaskAssignorIntegrationTest (#8884)
------------------------------------------
[...truncated 6.30 MB...]
org.apache.kafka.streams.internals.KeyValueStoreFacadeTest > shouldPutIfAbsentWithUnknownTimestamp PASSED
org.apache.kafka.streams.internals.KeyValueStoreFacadeTest > shouldForwardClose STARTED
org.apache.kafka.streams.internals.KeyValueStoreFacadeTest > shouldForwardClose PASSED
org.apache.kafka.streams.internals.KeyValueStoreFacadeTest > shouldForwardFlush STARTED
org.apache.kafka.streams.internals.KeyValueStoreFacadeTest > shouldForwardFlush PASSED
org.apache.kafka.streams.internals.KeyValueStoreFacadeTest > shouldForwardInit STARTED
org.apache.kafka.streams.internals.KeyValueStoreFacadeTest > shouldForwardInit PASSED
org.apache.kafka.streams.test.TestRecordTest > testConsumerRecord STARTED
org.apache.kafka.streams.test.TestRecordTest > testConsumerRecord PASSED
org.apache.kafka.streams.test.TestRecordTest > testToString STARTED
org.apache.kafka.streams.test.TestRecordTest > testToString PASSED
org.apache.kafka.streams.test.TestRecordTest > testInvalidRecords STARTED
org.apache.kafka.streams.test.TestRecordTest > testInvalidRecords PASSED
org.apache.kafka.streams.test.TestRecordTest > testPartialConstructorEquals STARTED
org.apache.kafka.streams.test.TestRecordTest > testPartialConstructorEquals PASSED
org.apache.kafka.streams.test.TestRecordTest > testMultiFieldMatcher STARTED
org.apache.kafka.streams.test.TestRecordTest > testMultiFieldMatcher PASSED
org.apache.kafka.streams.test.TestRecordTest > testFields STARTED
org.apache.kafka.streams.test.TestRecordTest > testFields PASSED
org.apache.kafka.streams.test.TestRecordTest > testProducerRecord STARTED
org.apache.kafka.streams.test.TestRecordTest > testProducerRecord PASSED
org.apache.kafka.streams.test.TestRecordTest > testEqualsAndHashCode STARTED
org.apache.kafka.streams.test.TestRecordTest > testEqualsAndHashCode PASSED
org.apache.kafka.streams.test.ConsumerRecordFactoryTest > shouldCreateConsumerRecordsFromKeyValuePairs STARTED
org.apache.kafka.streams.test.ConsumerRecordFactoryTest > shouldCreateConsumerRecordsFromKeyValuePairs PASSED
org.apache.kafka.streams.test.ConsumerRecordFactoryTest > shouldNotAllowToCreateTopicWithNullTopicNameWithNullKeyAndDefaultTimestamp STARTED
org.apache.kafka.streams.test.ConsumerRecordFactoryTest > shouldNotAllowToCreateTopicWithNullTopicNameWithNullKeyAndDefaultTimestamp PASSED
org.apache.kafka.streams.test.ConsumerRecordFactoryTest > shouldRequireCustomTopicNameIfNotDefaultFactoryTopicNameWithDefaultTimestamp STARTED
org.apache.kafka.streams.test.ConsumerRecordFactoryTest > shouldRequireCustomTopicNameIfNotDefaultFactoryTopicNameWithDefaultTimestamp PASSED
org.apache.kafka.streams.test.ConsumerRecordFactoryTest > shouldNotAllowToCreateTopicWithNullTopicNameWithNullKey STARTED
org.apache.kafka.streams.test.ConsumerRecordFactoryTest > shouldNotAllowToCreateTopicWithNullTopicNameWithNullKey PASSED
org.apache.kafka.streams.test.ConsumerRecordFactoryTest > shouldCreateNullKeyConsumerRecordWithOtherTopicNameAndTimestampWithTimetamp STARTED
org.apache.kafka.streams.test.ConsumerRecordFactoryTest > shouldCreateNullKeyConsumerRecordWithOtherTopicNameAndTimestampWithTimetamp PASSED
org.apache.kafka.streams.test.ConsumerRecordFactoryTest > shouldCreateConsumerRecordWithTimestamp STARTED
org.apache.kafka.streams.test.ConsumerRecordFactoryTest > shouldCreateConsumerRecordWithTimestamp PASSED
org.apache.kafka.streams.test.ConsumerRecordFactoryTest > shouldNotAllowToCreateTopicWithNullHeaders STARTED
org.apache.kafka.streams.test.ConsumerRecordFactoryTest > shouldNotAllowToCreateTopicWithNullHeaders PASSED
org.apache.kafka.streams.test.ConsumerRecordFactoryTest > shouldNotAllowToCreateTopicWithNullTopicNameWithDefaultTimestamp STARTED
org.apache.kafka.streams.test.ConsumerRecordFactoryTest > shouldNotAllowToCreateTopicWithNullTopicNameWithDefaultTimestamp PASSED
org.apache.kafka.streams.test.ConsumerRecordFactoryTest > shouldRequireCustomTopicNameIfNotDefaultFactoryTopicName STARTED
org.apache.kafka.streams.test.ConsumerRecordFactoryTest > shouldRequireCustomTopicNameIfNotDefaultFactoryTopicName PASSED
org.apache.kafka.streams.test.ConsumerRecordFactoryTest > shouldRequireCustomTopicNameIfNotDefaultFactoryTopicNameWithNullKey STARTED
org.apache.kafka.streams.test.ConsumerRecordFactoryTest > shouldRequireCustomTopicNameIfNotDefaultFactoryTopicNameWithNullKey PASSED
org.apache.kafka.streams.test.ConsumerRecordFactoryTest > shouldCreateConsumerRecord STARTED
org.apache.kafka.streams.test.ConsumerRecordFactoryTest > shouldCreateConsumerRecord PASSED
org.apache.kafka.streams.test.ConsumerRecordFactoryTest > shouldCreateNullKeyConsumerRecord STARTED
org.apache.kafka.streams.test.ConsumerRecordFactoryTest > shouldCreateNullKeyConsumerRecord PASSED
org.apache.kafka.streams.test.ConsumerRecordFactoryTest > shouldCreateConsumerRecordWithOtherTopicName STARTED
org.apache.kafka.streams.test.ConsumerRecordFactoryTest > shouldCreateConsumerRecordWithOtherTopicName PASSED
org.apache.kafka.streams.test.ConsumerRecordFactoryTest > shouldAdvanceTime STARTED
org.apache.kafka.streams.test.ConsumerRecordFactoryTest > shouldAdvanceTime PASSED
org.apache.kafka.streams.test.ConsumerRecordFactoryTest > shouldNotAllowToCreateTopicWithNullTopicNameWithKeyValuePairs STARTED
org.apache.kafka.streams.test.ConsumerRecordFactoryTest > shouldNotAllowToCreateTopicWithNullTopicNameWithKeyValuePairs PASSED
org.apache.kafka.streams.test.ConsumerRecordFactoryTest > shouldRequireCustomTopicNameIfNotDefaultFactoryTopicNameWithKeyValuePairsAndCustomTimestamps STARTED
org.apache.kafka.streams.test.ConsumerRecordFactoryTest > shouldRequireCustomTopicNameIfNotDefaultFactoryTopicNameWithKeyValuePairsAndCustomTimestamps PASSED
org.apache.kafka.streams.test.ConsumerRecordFactoryTest > shouldRequireCustomTopicNameIfNotDefaultFactoryTopicNameWithKeyValuePairs STARTED
org.apache.kafka.streams.test.ConsumerRecordFactoryTest > shouldRequireCustomTopicNameIfNotDefaultFactoryTopicNameWithKeyValuePairs PASSED
org.apache.kafka.streams.test.ConsumerRecordFactoryTest > shouldCreateConsumerRecordWithOtherTopicNameAndTimestamp STARTED
org.apache.kafka.streams.test.ConsumerRecordFactoryTest > shouldCreateConsumerRecordWithOtherTopicNameAndTimestamp PASSED
org.apache.kafka.streams.test.ConsumerRecordFactoryTest > shouldNotAllowToCreateTopicWithNullTopicNameWithKeyValuePairsAndCustomTimestamps STARTED
org.apache.kafka.streams.test.ConsumerRecordFactoryTest > shouldNotAllowToCreateTopicWithNullTopicNameWithKeyValuePairsAndCustomTimestamps PASSED
org.apache.kafka.streams.test.ConsumerRecordFactoryTest > shouldNotAllowToCreateTopicWithNullTopicName STARTED
org.apache.kafka.streams.test.ConsumerRecordFactoryTest > shouldNotAllowToCreateTopicWithNullTopicName PASSED
org.apache.kafka.streams.test.ConsumerRecordFactoryTest > shouldCreateConsumerRecordsFromKeyValuePairsWithCustomTimestampAndIncrementsAndNotAdvanceTime STARTED
org.apache.kafka.streams.test.ConsumerRecordFactoryTest > shouldCreateConsumerRecordsFromKeyValuePairsWithCustomTimestampAndIncrementsAndNotAdvanceTime PASSED
org.apache.kafka.streams.test.ConsumerRecordFactoryTest > shouldCreateNullKeyConsumerRecordWithTimestampWithTimestamp STARTED
org.apache.kafka.streams.test.ConsumerRecordFactoryTest > shouldCreateNullKeyConsumerRecordWithTimestampWithTimestamp PASSED
org.apache.kafka.streams.test.ConsumerRecordFactoryTest > shouldRequireCustomTopicNameIfNotDefaultFactoryTopicNameWithNullKeyAndDefaultTimestamp STARTED
org.apache.kafka.streams.test.ConsumerRecordFactoryTest > shouldRequireCustomTopicNameIfNotDefaultFactoryTopicNameWithNullKeyAndDefaultTimestamp PASSED
org.apache.kafka.streams.test.ConsumerRecordFactoryTest > shouldCreateConsumerRecordsFromKeyValuePairsWithTimestampAndIncrements STARTED
org.apache.kafka.streams.test.ConsumerRecordFactoryTest > shouldCreateConsumerRecordsFromKeyValuePairsWithTimestampAndIncrements PASSED
> Task :streams:upgrade-system-tests-20:processTestResources NO-SOURCE
> Task :streams:upgrade-system-tests-20:testClasses
> Task :streams:upgrade-system-tests-20:checkstyleTest
> Task :streams:upgrade-system-tests-20:spotbugsMain NO-SOURCE
> Task :streams:upgrade-system-tests-20:test
> Task :streams:upgrade-system-tests-21:compileJava NO-SOURCE
> Task :streams:upgrade-system-tests-21:processResources NO-SOURCE
> Task :streams:upgrade-system-tests-21:classes UP-TO-DATE
> Task :streams:upgrade-system-tests-21:checkstyleMain NO-SOURCE
> Task :streams:upgrade-system-tests-21:compileTestJava
> Task :streams:upgrade-system-tests-21:processTestResources NO-SOURCE
> Task :streams:upgrade-system-tests-21:testClasses
> Task :streams:upgrade-system-tests-21:checkstyleTest
> Task :streams:upgrade-system-tests-21:spotbugsMain NO-SOURCE
> Task :streams:upgrade-system-tests-21:test
> Task :streams:upgrade-system-tests-22:compileJava NO-SOURCE
> Task :streams:upgrade-system-tests-22:processResources NO-SOURCE
> Task :streams:upgrade-system-tests-22:classes UP-TO-DATE
> Task :streams:upgrade-system-tests-22:checkstyleMain NO-SOURCE
> Task :streams:upgrade-system-tests-22:compileTestJava
> Task :streams:upgrade-system-tests-22:processTestResources NO-SOURCE
> Task :streams:upgrade-system-tests-22:testClasses
> Task :streams:upgrade-system-tests-22:checkstyleTest
> Task :streams:upgrade-system-tests-22:spotbugsMain NO-SOURCE
> Task :streams:upgrade-system-tests-22:test
> Task :streams:upgrade-system-tests-23:compileJava NO-SOURCE
> Task :streams:upgrade-system-tests-23:processResources NO-SOURCE
> Task :streams:upgrade-system-tests-23:classes UP-TO-DATE
> Task :streams:upgrade-system-tests-23:checkstyleMain NO-SOURCE
> Task :streams:upgrade-system-tests-23:compileTestJava
> Task :streams:upgrade-system-tests-23:processTestResources NO-SOURCE
> Task :streams:upgrade-system-tests-23:testClasses
> Task :streams:upgrade-system-tests-23:checkstyleTest
> Task :streams:upgrade-system-tests-23:spotbugsMain NO-SOURCE
> Task :streams:upgrade-system-tests-23:test
> Task :streams:upgrade-system-tests-24:compileJava NO-SOURCE
> Task :streams:upgrade-system-tests-24:processResources NO-SOURCE
> Task :streams:upgrade-system-tests-24:classes UP-TO-DATE
> Task :streams:upgrade-system-tests-24:checkstyleMain NO-SOURCE
> Task :streams:upgrade-system-tests-24:compileTestJava
> Task :streams:upgrade-system-tests-24:processTestResources NO-SOURCE
> Task :streams:upgrade-system-tests-24:testClasses
> Task :streams:upgrade-system-tests-24:checkstyleTest
> Task :streams:upgrade-system-tests-24:spotbugsMain NO-SOURCE
> Task :streams:upgrade-system-tests-24:test
> Task :streams:upgrade-system-tests-25:compileJava NO-SOURCE
> Task :streams:upgrade-system-tests-25:processResources NO-SOURCE
> Task :streams:upgrade-system-tests-25:classes UP-TO-DATE
> Task :streams:upgrade-system-tests-25:checkstyleMain NO-SOURCE
> Task :streams:upgrade-system-tests-25:compileTestJava
> Task :streams:upgrade-system-tests-25:processTestResources NO-SOURCE
> Task :streams:upgrade-system-tests-25:testClasses
> Task :streams:upgrade-system-tests-25:checkstyleTest
> Task :streams:upgrade-system-tests-25:spotbugsMain NO-SOURCE
> Task :streams:upgrade-system-tests-25:test
FAILURE: Build failed with an exception.
* What went wrong:
Execution failed for task ':connect:runtime:test'.
> There were failing tests. See the report at: file://<https://builds.apache.org/job/kafka-trunk-jdk8/ws/connect/runtime/build/reports/tests/test/index.html>
* Try:
Run with --stacktrace option to get the stack trace. Run with --info or --debug option to get more log output. Run with --scan to get full insights.
* Get more help at https://help.gradle.org
Deprecated Gradle features were used in this build, making it incompatible with Gradle 7.0.
Use '--warning-mode all' to show the individual deprecation warnings.
See https://docs.gradle.org/6.5/userguide/command_line_interface.html#sec:command_line_warnings
BUILD FAILED in 1h 54m 36s
215 actionable tasks: 210 executed, 5 up-to-date
Build step 'Execute shell' marked build as failure
[FINDBUGS] Collecting findbugs analysis files...
Setting GRADLE_4_10_3_HOME=/home/jenkins/tools/gradle/4.10.3
[FINDBUGS] Searching for all files in <https://builds.apache.org/job/kafka-trunk-jdk8/ws/> that match the pattern **/build/reports/*bugs/*.xml
[FINDBUGS] Parsing 19 files in <https://builds.apache.org/job/kafka-trunk-jdk8/ws/>
[FINDBUGS] Successfully parsed file <https://builds.apache.org/job/kafka-trunk-jdk8/ws/clients/build/reports/spotbugs/main.xml> with 0 unique warnings and 0 duplicates.
[FINDBUGS] Successfully parsed file <https://builds.apache.org/job/kafka-trunk-jdk8/ws/connect/api/build/reports/spotbugs/main.xml> with 0 unique warnings and 0 duplicates.
[FINDBUGS] Successfully parsed file <https://builds.apache.org/job/kafka-trunk-jdk8/ws/connect/basic-auth-extension/build/reports/spotbugs/main.xml> with 0 unique warnings and 0 duplicates.
[FINDBUGS] Successfully parsed file <https://builds.apache.org/job/kafka-trunk-jdk8/ws/connect/file/build/reports/spotbugs/main.xml> with 0 unique warnings and 0 duplicates.
[FINDBUGS] Successfully parsed file <https://builds.apache.org/job/kafka-trunk-jdk8/ws/connect/json/build/reports/spotbugs/main.xml> with 0 unique warnings and 0 duplicates.
[FINDBUGS] Successfully parsed file <https://builds.apache.org/job/kafka-trunk-jdk8/ws/connect/mirror-client/build/reports/spotbugs/main.xml> with 0 unique warnings and 0 duplicates.
[FINDBUGS] Successfully parsed file <https://builds.apache.org/job/kafka-trunk-jdk8/ws/connect/mirror/build/reports/spotbugs/main.xml> with 0 unique warnings and 0 duplicates.
[FINDBUGS] Successfully parsed file <https://builds.apache.org/job/kafka-trunk-jdk8/ws/connect/runtime/build/reports/spotbugs/main.xml> with 0 unique warnings and 0 duplicates.
[FINDBUGS] Successfully parsed file <https://builds.apache.org/job/kafka-trunk-jdk8/ws/connect/transforms/build/reports/spotbugs/main.xml> with 0 unique warnings and 0 duplicates.
[FINDBUGS] Successfully parsed file <https://builds.apache.org/job/kafka-trunk-jdk8/ws/core/build/reports/spotbugs/main.xml> with 0 unique warnings and 0 duplicates.
[FINDBUGS] Successfully parsed file <https://builds.apache.org/job/kafka-trunk-jdk8/ws/examples/build/reports/spotbugs/main.xml> with 0 unique warnings and 0 duplicates.
[FINDBUGS] Successfully parsed file <https://builds.apache.org/job/kafka-trunk-jdk8/ws/generator/build/reports/spotbugs/main.xml> with 0 unique warnings and 0 duplicates.
[FINDBUGS] Successfully parsed file <https://builds.apache.org/job/kafka-trunk-jdk8/ws/jmh-benchmarks/build/reports/spotbugs/main.xml> with 0 unique warnings and 0 duplicates.
[FINDBUGS] Successfully parsed file <https://builds.apache.org/job/kafka-trunk-jdk8/ws/log4j-appender/build/reports/spotbugs/main.xml> with 0 unique warnings and 0 duplicates.
[FINDBUGS] Successfully parsed file <https://builds.apache.org/job/kafka-trunk-jdk8/ws/streams/build/reports/spotbugs/main.xml> with 0 unique warnings and 0 duplicates.
[FINDBUGS] Successfully parsed file <https://builds.apache.org/job/kafka-trunk-jdk8/ws/streams/examples/build/reports/spotbugs/main.xml> with 0 unique warnings and 0 duplicates.
[FINDBUGS] Successfully parsed file <https://builds.apache.org/job/kafka-trunk-jdk8/ws/streams/streams-scala/build/reports/spotbugs/main.xml> with 0 unique warnings and 0 duplicates.
[FINDBUGS] Successfully parsed file <https://builds.apache.org/job/kafka-trunk-jdk8/ws/streams/test-utils/build/reports/spotbugs/main.xml> with 0 unique warnings and 0 duplicates.
[FINDBUGS] Successfully parsed file <https://builds.apache.org/job/kafka-trunk-jdk8/ws/tools/build/reports/spotbugs/main.xml> with 0 unique warnings and 0 duplicates.
Setting GRADLE_4_10_3_HOME=/home/jenkins/tools/gradle/4.10.3
No credentials specified
Setting GRADLE_4_10_3_HOME=/home/jenkins/tools/gradle/4.10.3
<Git Blamer> Using GitBlamer to create author and commit information for all warnings.
<Git Blamer> GIT_COMMIT=0c2dfcfc85ccf2ab06a69910f5a991720880d7ba, workspace=<https://builds.apache.org/job/kafka-trunk-jdk8/ws/>
[FINDBUGS] Computing warning deltas based on reference build #4632
Recording test results
Setting GRADLE_4_10_3_HOME=/home/jenkins/tools/gradle/4.10.3
Setting GRADLE_4_10_3_HOME=/home/jenkins/tools/gradle/4.10.3
Not sending mail to unregistered user noreply@github.com
Build failed in Jenkins: kafka-trunk-jdk8 #4647
Posted by Apache Jenkins Server <je...@builds.apache.org>.
See <https://builds.apache.org/job/kafka-trunk-jdk8/4647/display/redirect?page=changes>
Changes:
[github] KAFKA-10150: task state transitions/management and committing cleanup
------------------------------------------
[...truncated 3.15 MB...]
org.apache.kafka.streams.TopologyTestDriverTest > shouldReturnAllStoresNames[Eos enabled = false] STARTED
org.apache.kafka.streams.TopologyTestDriverTest > shouldReturnAllStoresNames[Eos enabled = false] PASSED
org.apache.kafka.streams.TopologyTestDriverTest > shouldPassRecordHeadersIntoSerializersAndDeserializers[Eos enabled = false] STARTED
org.apache.kafka.streams.TopologyTestDriverTest > shouldPassRecordHeadersIntoSerializersAndDeserializers[Eos enabled = false] PASSED
org.apache.kafka.streams.TopologyTestDriverTest > shouldProcessConsumerRecordList[Eos enabled = false] STARTED
org.apache.kafka.streams.TopologyTestDriverTest > shouldProcessConsumerRecordList[Eos enabled = false] PASSED
org.apache.kafka.streams.TopologyTestDriverTest > shouldUseSinkSpecificSerializers[Eos enabled = false] STARTED
org.apache.kafka.streams.TopologyTestDriverTest > shouldUseSinkSpecificSerializers[Eos enabled = false] PASSED
org.apache.kafka.streams.TopologyTestDriverTest > shouldFlushStoreForFirstInput[Eos enabled = false] STARTED
org.apache.kafka.streams.TopologyTestDriverTest > shouldFlushStoreForFirstInput[Eos enabled = false] PASSED
org.apache.kafka.streams.TopologyTestDriverTest > shouldProcessFromSourceThatMatchPattern[Eos enabled = false] STARTED
org.apache.kafka.streams.TopologyTestDriverTest > shouldProcessFromSourceThatMatchPattern[Eos enabled = false] PASSED
org.apache.kafka.streams.TopologyTestDriverTest > shouldCaptureSinkTopicNamesIfWrittenInto[Eos enabled = false] STARTED
org.apache.kafka.streams.TopologyTestDriverTest > shouldCaptureSinkTopicNamesIfWrittenInto[Eos enabled = false] PASSED
org.apache.kafka.streams.TopologyTestDriverTest > shouldUpdateStoreForNewKey[Eos enabled = false] STARTED
org.apache.kafka.streams.TopologyTestDriverTest > shouldUpdateStoreForNewKey[Eos enabled = false] PASSED
org.apache.kafka.streams.TopologyTestDriverTest > shouldSendRecordViaCorrectSourceTopicDeprecated[Eos enabled = false] STARTED
org.apache.kafka.streams.TopologyTestDriverTest > shouldSendRecordViaCorrectSourceTopicDeprecated[Eos enabled = false] PASSED
org.apache.kafka.streams.TopologyTestDriverTest > shouldPunctuateOnWallClockTime[Eos enabled = false] STARTED
org.apache.kafka.streams.TopologyTestDriverTest > shouldPunctuateOnWallClockTime[Eos enabled = false] PASSED
org.apache.kafka.streams.TopologyTestDriverTest > shouldSetRecordMetadata[Eos enabled = false] STARTED
org.apache.kafka.streams.TopologyTestDriverTest > shouldSetRecordMetadata[Eos enabled = false] PASSED
org.apache.kafka.streams.TopologyTestDriverTest > shouldNotUpdateStoreForLargerValue[Eos enabled = false] STARTED
org.apache.kafka.streams.TopologyTestDriverTest > shouldNotUpdateStoreForLargerValue[Eos enabled = false] PASSED
org.apache.kafka.streams.TopologyTestDriverTest > shouldReturnCorrectInMemoryStoreTypeOnly[Eos enabled = false] STARTED
org.apache.kafka.streams.TopologyTestDriverTest > shouldReturnCorrectInMemoryStoreTypeOnly[Eos enabled = false] PASSED
org.apache.kafka.streams.TopologyTestDriverTest > shouldThrowForMissingTime[Eos enabled = false] STARTED
org.apache.kafka.streams.TopologyTestDriverTest > shouldThrowForMissingTime[Eos enabled = false] PASSED
org.apache.kafka.streams.TopologyTestDriverTest > shouldCaptureInternalTopicNamesIfWrittenInto[Eos enabled = false] STARTED
org.apache.kafka.streams.TopologyTestDriverTest > shouldCaptureInternalTopicNamesIfWrittenInto[Eos enabled = false] PASSED
org.apache.kafka.streams.TopologyTestDriverTest > shouldPunctuateOnWallClockTimeDeprecated[Eos enabled = false] STARTED
org.apache.kafka.streams.TopologyTestDriverTest > shouldPunctuateOnWallClockTimeDeprecated[Eos enabled = false] PASSED
org.apache.kafka.streams.TopologyTestDriverTest > shouldProcessRecordForTopic[Eos enabled = false] STARTED
org.apache.kafka.streams.TopologyTestDriverTest > shouldProcessRecordForTopic[Eos enabled = false] PASSED
org.apache.kafka.streams.TopologyTestDriverTest > shouldForwardRecordsFromSubtopologyToSubtopology[Eos enabled = false] STARTED
org.apache.kafka.streams.TopologyTestDriverTest > shouldForwardRecordsFromSubtopologyToSubtopology[Eos enabled = false] PASSED
org.apache.kafka.streams.TopologyTestDriverTest > shouldNotUpdateStoreForSmallerValue[Eos enabled = false] STARTED
org.apache.kafka.streams.TopologyTestDriverTest > shouldNotUpdateStoreForSmallerValue[Eos enabled = false] PASSED
org.apache.kafka.streams.TopologyTestDriverTest > shouldCreateStateDirectoryForStatefulTopology[Eos enabled = false] STARTED
org.apache.kafka.streams.TopologyTestDriverTest > shouldCreateStateDirectoryForStatefulTopology[Eos enabled = false] PASSED
org.apache.kafka.streams.TopologyTestDriverTest > shouldPunctuateIfWallClockTimeAdvances[Eos enabled = false] STARTED
org.apache.kafka.streams.TopologyTestDriverTest > shouldPunctuateIfWallClockTimeAdvances[Eos enabled = false] PASSED
> Task :streams:upgrade-system-tests-0100:spotbugsMain NO-SOURCE
> Task :streams:upgrade-system-tests-0100:test
> Task :streams:upgrade-system-tests-0101:compileJava NO-SOURCE
> Task :streams:upgrade-system-tests-0101:processResources NO-SOURCE
> Task :streams:upgrade-system-tests-0101:classes UP-TO-DATE
> Task :streams:upgrade-system-tests-0101:checkstyleMain NO-SOURCE
> Task :streams:upgrade-system-tests-0101:compileTestJava
> Task :streams:upgrade-system-tests-0101:processTestResources NO-SOURCE
> Task :streams:upgrade-system-tests-0101:testClasses
> Task :streams:upgrade-system-tests-0101:checkstyleTest
> Task :streams:upgrade-system-tests-0101:spotbugsMain NO-SOURCE
> Task :streams:upgrade-system-tests-0101:test
> Task :streams:upgrade-system-tests-0102:compileJava NO-SOURCE
> Task :streams:upgrade-system-tests-0102:processResources NO-SOURCE
> Task :streams:upgrade-system-tests-0102:classes UP-TO-DATE
> Task :streams:upgrade-system-tests-0102:checkstyleMain NO-SOURCE
> Task :streams:upgrade-system-tests-0102:compileTestJava
> Task :streams:upgrade-system-tests-0102:processTestResources NO-SOURCE
> Task :streams:upgrade-system-tests-0102:testClasses
> Task :streams:upgrade-system-tests-0102:checkstyleTest
> Task :streams:upgrade-system-tests-0102:spotbugsMain NO-SOURCE
> Task :streams:upgrade-system-tests-0102:test
> Task :streams:upgrade-system-tests-0110:compileJava NO-SOURCE
> Task :streams:upgrade-system-tests-0110:processResources NO-SOURCE
> Task :streams:upgrade-system-tests-0110:classes UP-TO-DATE
> Task :streams:upgrade-system-tests-0110:checkstyleMain NO-SOURCE
> Task :streams:upgrade-system-tests-0110:compileTestJava
> Task :streams:upgrade-system-tests-0110:processTestResources NO-SOURCE
> Task :streams:upgrade-system-tests-0110:testClasses
> Task :streams:upgrade-system-tests-0110:checkstyleTest
> Task :streams:upgrade-system-tests-0110:spotbugsMain NO-SOURCE
> Task :streams:upgrade-system-tests-0110:test
> Task :streams:upgrade-system-tests-10:compileJava NO-SOURCE
> Task :streams:upgrade-system-tests-10:processResources NO-SOURCE
> Task :streams:upgrade-system-tests-10:classes UP-TO-DATE
> Task :streams:upgrade-system-tests-10:checkstyleMain NO-SOURCE
> Task :streams:upgrade-system-tests-10:compileTestJava
> Task :streams:upgrade-system-tests-10:processTestResources NO-SOURCE
> Task :streams:upgrade-system-tests-10:testClasses
> Task :streams:upgrade-system-tests-10:checkstyleTest
> Task :streams:upgrade-system-tests-10:spotbugsMain NO-SOURCE
> Task :streams:upgrade-system-tests-10:test
> Task :streams:upgrade-system-tests-11:compileJava NO-SOURCE
> Task :streams:upgrade-system-tests-11:processResources NO-SOURCE
> Task :streams:upgrade-system-tests-11:classes UP-TO-DATE
> Task :streams:upgrade-system-tests-11:checkstyleMain NO-SOURCE
> Task :streams:upgrade-system-tests-11:compileTestJava
> Task :streams:upgrade-system-tests-11:processTestResources NO-SOURCE
> Task :streams:upgrade-system-tests-11:testClasses
> Task :streams:upgrade-system-tests-11:checkstyleTest
> Task :streams:upgrade-system-tests-11:spotbugsMain NO-SOURCE
> Task :streams:upgrade-system-tests-11:test
> Task :streams:upgrade-system-tests-20:compileJava NO-SOURCE
> Task :streams:upgrade-system-tests-20:processResources NO-SOURCE
> Task :streams:upgrade-system-tests-20:classes UP-TO-DATE
> Task :streams:upgrade-system-tests-20:checkstyleMain NO-SOURCE
> Task :streams:upgrade-system-tests-20:compileTestJava
> Task :streams:upgrade-system-tests-20:processTestResources NO-SOURCE
> Task :streams:upgrade-system-tests-20:testClasses
> Task :streams:upgrade-system-tests-20:checkstyleTest
> Task :streams:upgrade-system-tests-20:spotbugsMain NO-SOURCE
> Task :streams:upgrade-system-tests-20:test
> Task :streams:upgrade-system-tests-21:compileJava NO-SOURCE
> Task :streams:upgrade-system-tests-21:processResources NO-SOURCE
> Task :streams:upgrade-system-tests-21:classes UP-TO-DATE
> Task :streams:upgrade-system-tests-21:checkstyleMain NO-SOURCE
> Task :streams:upgrade-system-tests-21:compileTestJava
> Task :streams:upgrade-system-tests-21:processTestResources NO-SOURCE
> Task :streams:upgrade-system-tests-21:testClasses
> Task :streams:upgrade-system-tests-21:checkstyleTest
> Task :streams:upgrade-system-tests-21:spotbugsMain NO-SOURCE
> Task :streams:upgrade-system-tests-21:test
> Task :streams:upgrade-system-tests-22:compileJava NO-SOURCE
> Task :streams:upgrade-system-tests-22:processResources NO-SOURCE
> Task :streams:upgrade-system-tests-22:classes UP-TO-DATE
> Task :streams:upgrade-system-tests-22:checkstyleMain NO-SOURCE
> Task :streams:upgrade-system-tests-22:compileTestJava
> Task :streams:upgrade-system-tests-22:processTestResources NO-SOURCE
> Task :streams:upgrade-system-tests-22:testClasses
> Task :streams:upgrade-system-tests-22:checkstyleTest
> Task :streams:upgrade-system-tests-22:spotbugsMain NO-SOURCE
> Task :streams:upgrade-system-tests-22:test
> Task :streams:upgrade-system-tests-23:compileJava NO-SOURCE
> Task :streams:upgrade-system-tests-23:processResources NO-SOURCE
> Task :streams:upgrade-system-tests-23:classes UP-TO-DATE
> Task :streams:upgrade-system-tests-23:checkstyleMain NO-SOURCE
> Task :streams:upgrade-system-tests-23:compileTestJava
> Task :streams:upgrade-system-tests-23:processTestResources NO-SOURCE
> Task :streams:upgrade-system-tests-23:testClasses
> Task :streams:upgrade-system-tests-23:checkstyleTest
> Task :streams:upgrade-system-tests-23:spotbugsMain NO-SOURCE
> Task :streams:upgrade-system-tests-23:test
> Task :streams:upgrade-system-tests-24:compileJava NO-SOURCE
> Task :streams:upgrade-system-tests-24:processResources NO-SOURCE
> Task :streams:upgrade-system-tests-24:classes UP-TO-DATE
> Task :streams:upgrade-system-tests-24:checkstyleMain NO-SOURCE
> Task :streams:upgrade-system-tests-24:compileTestJava
> Task :streams:upgrade-system-tests-24:processTestResources NO-SOURCE
> Task :streams:upgrade-system-tests-24:testClasses
> Task :streams:upgrade-system-tests-24:checkstyleTest
> Task :streams:upgrade-system-tests-24:spotbugsMain NO-SOURCE
> Task :streams:upgrade-system-tests-24:test
> Task :streams:upgrade-system-tests-25:compileJava NO-SOURCE
> Task :streams:upgrade-system-tests-25:processResources NO-SOURCE
> Task :streams:upgrade-system-tests-25:classes UP-TO-DATE
> Task :streams:upgrade-system-tests-25:checkstyleMain NO-SOURCE
> Task :streams:upgrade-system-tests-25:compileTestJava
> Task :streams:upgrade-system-tests-25:processTestResources NO-SOURCE
> Task :streams:upgrade-system-tests-25:testClasses
> Task :streams:upgrade-system-tests-25:checkstyleTest
> Task :streams:upgrade-system-tests-25:spotbugsMain NO-SOURCE
> Task :streams:upgrade-system-tests-25:test
FAILURE: Build failed with an exception.
* What went wrong:
Execution failed for task ':core:test'.
> There were failing tests. See the report at: file://<https://builds.apache.org/job/kafka-trunk-jdk8/ws/core/build/reports/tests/test/index.html>
* Try:
Run with --stacktrace option to get the stack trace. Run with --info or --debug option to get more log output. Run with --scan to get full insights.
* Get more help at https://help.gradle.org
Deprecated Gradle features were used in this build, making it incompatible with Gradle 7.0.
Use '--warning-mode all' to show the individual deprecation warnings.
See https://docs.gradle.org/6.5/userguide/command_line_interface.html#sec:command_line_warnings
BUILD FAILED in 1h 53m 27s
215 actionable tasks: 183 executed, 32 up-to-date
Build step 'Execute shell' marked build as failure
[FINDBUGS] Collecting findbugs analysis files...
Setting GRADLE_4_10_3_HOME=/home/jenkins/tools/gradle/4.10.3
[FINDBUGS] Searching for all files in <https://builds.apache.org/job/kafka-trunk-jdk8/ws/> that match the pattern **/build/reports/*bugs/*.xml
[FINDBUGS] Parsing 19 files in <https://builds.apache.org/job/kafka-trunk-jdk8/ws/>
[FINDBUGS] Successfully parsed file <https://builds.apache.org/job/kafka-trunk-jdk8/ws/clients/build/reports/spotbugs/main.xml> with 0 unique warnings and 0 duplicates.
[FINDBUGS] Successfully parsed file <https://builds.apache.org/job/kafka-trunk-jdk8/ws/connect/api/build/reports/spotbugs/main.xml> with 0 unique warnings and 0 duplicates.
[FINDBUGS] Successfully parsed file <https://builds.apache.org/job/kafka-trunk-jdk8/ws/connect/basic-auth-extension/build/reports/spotbugs/main.xml> with 0 unique warnings and 0 duplicates.
[FINDBUGS] Successfully parsed file <https://builds.apache.org/job/kafka-trunk-jdk8/ws/connect/file/build/reports/spotbugs/main.xml> with 0 unique warnings and 0 duplicates.
[FINDBUGS] Successfully parsed file <https://builds.apache.org/job/kafka-trunk-jdk8/ws/connect/json/build/reports/spotbugs/main.xml> with 0 unique warnings and 0 duplicates.
[FINDBUGS] Successfully parsed file <https://builds.apache.org/job/kafka-trunk-jdk8/ws/connect/mirror-client/build/reports/spotbugs/main.xml> with 0 unique warnings and 0 duplicates.
[FINDBUGS] Successfully parsed file <https://builds.apache.org/job/kafka-trunk-jdk8/ws/connect/mirror/build/reports/spotbugs/main.xml> with 0 unique warnings and 0 duplicates.
[FINDBUGS] Successfully parsed file <https://builds.apache.org/job/kafka-trunk-jdk8/ws/connect/runtime/build/reports/spotbugs/main.xml> with 0 unique warnings and 0 duplicates.
[FINDBUGS] Successfully parsed file <https://builds.apache.org/job/kafka-trunk-jdk8/ws/connect/transforms/build/reports/spotbugs/main.xml> with 0 unique warnings and 0 duplicates.
[FINDBUGS] Successfully parsed file <https://builds.apache.org/job/kafka-trunk-jdk8/ws/core/build/reports/spotbugs/main.xml> with 0 unique warnings and 0 duplicates.
[FINDBUGS] Successfully parsed file <https://builds.apache.org/job/kafka-trunk-jdk8/ws/examples/build/reports/spotbugs/main.xml> with 0 unique warnings and 0 duplicates.
[FINDBUGS] Successfully parsed file <https://builds.apache.org/job/kafka-trunk-jdk8/ws/generator/build/reports/spotbugs/main.xml> with 0 unique warnings and 0 duplicates.
[FINDBUGS] Successfully parsed file <https://builds.apache.org/job/kafka-trunk-jdk8/ws/jmh-benchmarks/build/reports/spotbugs/main.xml> with 0 unique warnings and 0 duplicates.
[FINDBUGS] Successfully parsed file <https://builds.apache.org/job/kafka-trunk-jdk8/ws/log4j-appender/build/reports/spotbugs/main.xml> with 0 unique warnings and 0 duplicates.
[FINDBUGS] Successfully parsed file <https://builds.apache.org/job/kafka-trunk-jdk8/ws/streams/build/reports/spotbugs/main.xml> with 0 unique warnings and 0 duplicates.
[FINDBUGS] Successfully parsed file <https://builds.apache.org/job/kafka-trunk-jdk8/ws/streams/examples/build/reports/spotbugs/main.xml> with 0 unique warnings and 0 duplicates.
[FINDBUGS] Successfully parsed file <https://builds.apache.org/job/kafka-trunk-jdk8/ws/streams/streams-scala/build/reports/spotbugs/main.xml> with 0 unique warnings and 0 duplicates.
[FINDBUGS] Successfully parsed file <https://builds.apache.org/job/kafka-trunk-jdk8/ws/streams/test-utils/build/reports/spotbugs/main.xml> with 0 unique warnings and 0 duplicates.
[FINDBUGS] Successfully parsed file <https://builds.apache.org/job/kafka-trunk-jdk8/ws/tools/build/reports/spotbugs/main.xml> with 0 unique warnings and 0 duplicates.
Setting GRADLE_4_10_3_HOME=/home/jenkins/tools/gradle/4.10.3
No credentials specified
Setting GRADLE_4_10_3_HOME=/home/jenkins/tools/gradle/4.10.3
<Git Blamer> Using GitBlamer to create author and commit information for all warnings.
<Git Blamer> GIT_COMMIT=2239004907b29e00811fee9ded5a790172701a03, workspace=<https://builds.apache.org/job/kafka-trunk-jdk8/ws/>
[FINDBUGS] Computing warning deltas based on reference build #4632
Recording test results
Setting GRADLE_4_10_3_HOME=/home/jenkins/tools/gradle/4.10.3
Setting GRADLE_4_10_3_HOME=/home/jenkins/tools/gradle/4.10.3
Not sending mail to unregistered user noreply@github.com
Build failed in Jenkins: kafka-trunk-jdk8 #4646
Posted by Apache Jenkins Server <je...@builds.apache.org>.
See <https://builds.apache.org/job/kafka-trunk-jdk8/4646/display/redirect?page=changes>
Changes:
[github] KAFKA-9974: Fix flaky test by removing unneeded asserts (#8646)
[github] KAFKA-10169: Error message when transit to Aborting / AbortableError /
------------------------------------------
[...truncated 3.15 MB...]
org.apache.kafka.streams.TopologyTestDriverTest > shouldSendRecordViaCorrectSourceTopicDeprecated[Eos enabled = false] STARTED
org.apache.kafka.streams.TopologyTestDriverTest > shouldSendRecordViaCorrectSourceTopicDeprecated[Eos enabled = false] PASSED
org.apache.kafka.streams.TopologyTestDriverTest > shouldPunctuateOnWallClockTime[Eos enabled = false] STARTED
org.apache.kafka.streams.TopologyTestDriverTest > shouldPunctuateOnWallClockTime[Eos enabled = false] PASSED
org.apache.kafka.streams.TopologyTestDriverTest > shouldSetRecordMetadata[Eos enabled = false] STARTED
org.apache.kafka.streams.TopologyTestDriverTest > shouldSetRecordMetadata[Eos enabled = false] PASSED
org.apache.kafka.streams.TopologyTestDriverTest > shouldNotUpdateStoreForLargerValue[Eos enabled = false] STARTED
org.apache.kafka.streams.TopologyTestDriverTest > shouldNotUpdateStoreForLargerValue[Eos enabled = false] PASSED
org.apache.kafka.streams.TopologyTestDriverTest > shouldReturnCorrectInMemoryStoreTypeOnly[Eos enabled = false] STARTED
org.apache.kafka.streams.TopologyTestDriverTest > shouldReturnCorrectInMemoryStoreTypeOnly[Eos enabled = false] PASSED
org.apache.kafka.streams.TopologyTestDriverTest > shouldThrowForMissingTime[Eos enabled = false] STARTED
org.apache.kafka.streams.TopologyTestDriverTest > shouldThrowForMissingTime[Eos enabled = false] PASSED
org.apache.kafka.streams.TopologyTestDriverTest > shouldCaptureInternalTopicNamesIfWrittenInto[Eos enabled = false] STARTED
org.apache.kafka.streams.TopologyTestDriverTest > shouldCaptureInternalTopicNamesIfWrittenInto[Eos enabled = false] PASSED
org.apache.kafka.streams.TopologyTestDriverTest > shouldPunctuateOnWallClockTimeDeprecated[Eos enabled = false] STARTED
org.apache.kafka.streams.TopologyTestDriverTest > shouldPunctuateOnWallClockTimeDeprecated[Eos enabled = false] PASSED
org.apache.kafka.streams.TopologyTestDriverTest > shouldProcessRecordForTopic[Eos enabled = false] STARTED
org.apache.kafka.streams.TopologyTestDriverTest > shouldProcessRecordForTopic[Eos enabled = false] PASSED
org.apache.kafka.streams.TopologyTestDriverTest > shouldForwardRecordsFromSubtopologyToSubtopology[Eos enabled = false] STARTED
org.apache.kafka.streams.TopologyTestDriverTest > shouldForwardRecordsFromSubtopologyToSubtopology[Eos enabled = false] PASSED
org.apache.kafka.streams.TopologyTestDriverTest > shouldNotUpdateStoreForSmallerValue[Eos enabled = false] STARTED
org.apache.kafka.streams.TopologyTestDriverTest > shouldNotUpdateStoreForSmallerValue[Eos enabled = false] PASSED
org.apache.kafka.streams.TopologyTestDriverTest > shouldCreateStateDirectoryForStatefulTopology[Eos enabled = false] STARTED
org.apache.kafka.streams.TopologyTestDriverTest > shouldCreateStateDirectoryForStatefulTopology[Eos enabled = false] PASSED
org.apache.kafka.streams.TopologyTestDriverTest > shouldPunctuateIfWallClockTimeAdvances[Eos enabled = false] STARTED
org.apache.kafka.streams.TopologyTestDriverTest > shouldPunctuateIfWallClockTimeAdvances[Eos enabled = false] PASSED
org.apache.kafka.streams.MockTimeTest > shouldGetNanosAsMillis STARTED
org.apache.kafka.streams.MockTimeTest > shouldGetNanosAsMillis PASSED
org.apache.kafka.streams.MockTimeTest > shouldSetStartTime STARTED
org.apache.kafka.streams.MockTimeTest > shouldSetStartTime PASSED
org.apache.kafka.streams.MockTimeTest > shouldNotAllowNegativeSleep STARTED
org.apache.kafka.streams.MockTimeTest > shouldNotAllowNegativeSleep PASSED
org.apache.kafka.streams.MockTimeTest > shouldAdvanceTimeOnSleep STARTED
org.apache.kafka.streams.MockTimeTest > shouldAdvanceTimeOnSleep PASSED
org.apache.kafka.streams.internals.WindowStoreFacadeTest > shouldReturnIsOpen STARTED
org.apache.kafka.streams.internals.WindowStoreFacadeTest > shouldReturnIsOpen PASSED
org.apache.kafka.streams.internals.WindowStoreFacadeTest > shouldReturnName STARTED
org.apache.kafka.streams.internals.WindowStoreFacadeTest > shouldReturnName PASSED
org.apache.kafka.streams.internals.WindowStoreFacadeTest > shouldPutWithUnknownTimestamp STARTED
org.apache.kafka.streams.internals.WindowStoreFacadeTest > shouldPutWithUnknownTimestamp PASSED
org.apache.kafka.streams.internals.WindowStoreFacadeTest > shouldPutWindowStartTimestampWithUnknownTimestamp STARTED
org.apache.kafka.streams.internals.WindowStoreFacadeTest > shouldPutWindowStartTimestampWithUnknownTimestamp PASSED
org.apache.kafka.streams.internals.WindowStoreFacadeTest > shouldReturnIsPersistent STARTED
org.apache.kafka.streams.internals.WindowStoreFacadeTest > shouldReturnIsPersistent PASSED
org.apache.kafka.streams.internals.WindowStoreFacadeTest > shouldForwardClose STARTED
org.apache.kafka.streams.internals.WindowStoreFacadeTest > shouldForwardClose PASSED
org.apache.kafka.streams.internals.WindowStoreFacadeTest > shouldForwardFlush STARTED
org.apache.kafka.streams.internals.WindowStoreFacadeTest > shouldForwardFlush PASSED
org.apache.kafka.streams.internals.WindowStoreFacadeTest > shouldForwardInit STARTED
org.apache.kafka.streams.internals.WindowStoreFacadeTest > shouldForwardInit PASSED
org.apache.kafka.streams.test.TestRecordTest > testConsumerRecord STARTED
org.apache.kafka.streams.test.TestRecordTest > testConsumerRecord PASSED
org.apache.kafka.streams.test.TestRecordTest > testToString STARTED
org.apache.kafka.streams.test.TestRecordTest > testToString PASSED
org.apache.kafka.streams.test.TestRecordTest > testInvalidRecords STARTED
org.apache.kafka.streams.test.TestRecordTest > testInvalidRecords PASSED
org.apache.kafka.streams.test.TestRecordTest > testPartialConstructorEquals STARTED
org.apache.kafka.streams.test.TestRecordTest > testPartialConstructorEquals PASSED
org.apache.kafka.streams.test.TestRecordTest > testMultiFieldMatcher STARTED
org.apache.kafka.streams.test.TestRecordTest > testMultiFieldMatcher PASSED
org.apache.kafka.streams.test.TestRecordTest > testFields STARTED
org.apache.kafka.streams.test.TestRecordTest > testFields PASSED
org.apache.kafka.streams.test.TestRecordTest > testProducerRecord STARTED
org.apache.kafka.streams.test.TestRecordTest > testProducerRecord PASSED
org.apache.kafka.streams.test.TestRecordTest > testEqualsAndHashCode STARTED
org.apache.kafka.streams.test.TestRecordTest > testEqualsAndHashCode PASSED
> Task :streams:upgrade-system-tests-11:processTestResources NO-SOURCE
> Task :streams:upgrade-system-tests-11:testClasses
> Task :streams:upgrade-system-tests-11:checkstyleTest
> Task :streams:upgrade-system-tests-11:spotbugsMain NO-SOURCE
> Task :streams:upgrade-system-tests-11:test
> Task :streams:upgrade-system-tests-20:compileJava NO-SOURCE
> Task :streams:upgrade-system-tests-20:processResources NO-SOURCE
> Task :streams:upgrade-system-tests-20:classes UP-TO-DATE
> Task :streams:upgrade-system-tests-20:checkstyleMain NO-SOURCE
> Task :streams:upgrade-system-tests-20:compileTestJava
> Task :streams:upgrade-system-tests-20:processTestResources NO-SOURCE
> Task :streams:upgrade-system-tests-20:testClasses
> Task :streams:upgrade-system-tests-20:checkstyleTest
> Task :streams:upgrade-system-tests-20:spotbugsMain NO-SOURCE
> Task :streams:upgrade-system-tests-20:test
> Task :streams:upgrade-system-tests-21:compileJava NO-SOURCE
> Task :streams:upgrade-system-tests-21:processResources NO-SOURCE
> Task :streams:upgrade-system-tests-21:classes UP-TO-DATE
> Task :streams:upgrade-system-tests-21:checkstyleMain NO-SOURCE
> Task :streams:upgrade-system-tests-21:compileTestJava
> Task :streams:upgrade-system-tests-21:processTestResources NO-SOURCE
> Task :streams:upgrade-system-tests-21:testClasses
> Task :streams:upgrade-system-tests-21:checkstyleTest
> Task :streams:upgrade-system-tests-21:spotbugsMain NO-SOURCE
> Task :streams:upgrade-system-tests-21:test
> Task :streams:upgrade-system-tests-22:compileJava NO-SOURCE
> Task :streams:upgrade-system-tests-22:processResources NO-SOURCE
> Task :streams:upgrade-system-tests-22:classes UP-TO-DATE
> Task :streams:upgrade-system-tests-22:checkstyleMain NO-SOURCE
> Task :streams:upgrade-system-tests-22:compileTestJava
> Task :streams:upgrade-system-tests-22:processTestResources NO-SOURCE
> Task :streams:upgrade-system-tests-22:testClasses
> Task :streams:upgrade-system-tests-22:checkstyleTest
> Task :streams:upgrade-system-tests-22:spotbugsMain NO-SOURCE
> Task :streams:upgrade-system-tests-22:test
> Task :streams:upgrade-system-tests-23:compileJava NO-SOURCE
> Task :streams:upgrade-system-tests-23:processResources NO-SOURCE
> Task :streams:upgrade-system-tests-23:classes UP-TO-DATE
> Task :streams:upgrade-system-tests-23:checkstyleMain NO-SOURCE
> Task :streams:upgrade-system-tests-23:compileTestJava
> Task :streams:upgrade-system-tests-23:processTestResources NO-SOURCE
> Task :streams:upgrade-system-tests-23:testClasses
> Task :streams:upgrade-system-tests-23:checkstyleTest
> Task :streams:upgrade-system-tests-23:spotbugsMain NO-SOURCE
> Task :streams:upgrade-system-tests-23:test
> Task :streams:upgrade-system-tests-24:compileJava NO-SOURCE
> Task :streams:upgrade-system-tests-24:processResources NO-SOURCE
> Task :streams:upgrade-system-tests-24:classes UP-TO-DATE
> Task :streams:upgrade-system-tests-24:checkstyleMain NO-SOURCE
> Task :streams:upgrade-system-tests-24:compileTestJava
> Task :streams:upgrade-system-tests-24:processTestResources NO-SOURCE
> Task :streams:upgrade-system-tests-24:testClasses
> Task :streams:upgrade-system-tests-24:checkstyleTest
> Task :streams:upgrade-system-tests-24:spotbugsMain NO-SOURCE
> Task :streams:upgrade-system-tests-24:test
> Task :streams:upgrade-system-tests-25:compileJava NO-SOURCE
> Task :streams:upgrade-system-tests-25:processResources NO-SOURCE
> Task :streams:upgrade-system-tests-25:classes UP-TO-DATE
> Task :streams:upgrade-system-tests-25:checkstyleMain NO-SOURCE
> Task :streams:upgrade-system-tests-25:compileTestJava
> Task :streams:upgrade-system-tests-25:processTestResources NO-SOURCE
> Task :streams:upgrade-system-tests-25:testClasses
> Task :streams:upgrade-system-tests-25:checkstyleTest
> Task :streams:upgrade-system-tests-25:spotbugsMain NO-SOURCE
> Task :streams:upgrade-system-tests-25:test
FAILURE: Build failed with an exception.
* What went wrong:
Execution failed for task ':core:test'.
> There were failing tests. See the report at: file://<https://builds.apache.org/job/kafka-trunk-jdk8/ws/core/build/reports/tests/test/index.html>
* Try:
Run with --stacktrace option to get the stack trace. Run with --info or --debug option to get more log output. Run with --scan to get full insights.
* Get more help at https://help.gradle.org
Deprecated Gradle features were used in this build, making it incompatible with Gradle 7.0.
Use '--warning-mode all' to show the individual deprecation warnings.
See https://docs.gradle.org/6.5/userguide/command_line_interface.html#sec:command_line_warnings
BUILD FAILED in 1h 46m 13s
215 actionable tasks: 183 executed, 32 up-to-date
Build step 'Execute shell' marked build as failure
[FINDBUGS] Collecting findbugs analysis files...
Setting GRADLE_4_10_3_HOME=/home/jenkins/tools/gradle/4.10.3
[FINDBUGS] Searching for all files in <https://builds.apache.org/job/kafka-trunk-jdk8/ws/> that match the pattern **/build/reports/*bugs/*.xml
[FINDBUGS] Parsing 19 files in <https://builds.apache.org/job/kafka-trunk-jdk8/ws/>
[FINDBUGS] Successfully parsed file <https://builds.apache.org/job/kafka-trunk-jdk8/ws/clients/build/reports/spotbugs/main.xml> with 0 unique warnings and 0 duplicates.
[FINDBUGS] Successfully parsed file <https://builds.apache.org/job/kafka-trunk-jdk8/ws/connect/api/build/reports/spotbugs/main.xml> with 0 unique warnings and 0 duplicates.
[FINDBUGS] Successfully parsed file <https://builds.apache.org/job/kafka-trunk-jdk8/ws/connect/basic-auth-extension/build/reports/spotbugs/main.xml> with 0 unique warnings and 0 duplicates.
[FINDBUGS] Successfully parsed file <https://builds.apache.org/job/kafka-trunk-jdk8/ws/connect/file/build/reports/spotbugs/main.xml> with 0 unique warnings and 0 duplicates.
[FINDBUGS] Successfully parsed file <https://builds.apache.org/job/kafka-trunk-jdk8/ws/connect/json/build/reports/spotbugs/main.xml> with 0 unique warnings and 0 duplicates.
[FINDBUGS] Successfully parsed file <https://builds.apache.org/job/kafka-trunk-jdk8/ws/connect/mirror-client/build/reports/spotbugs/main.xml> with 0 unique warnings and 0 duplicates.
[FINDBUGS] Successfully parsed file <https://builds.apache.org/job/kafka-trunk-jdk8/ws/connect/mirror/build/reports/spotbugs/main.xml> with 0 unique warnings and 0 duplicates.
[FINDBUGS] Successfully parsed file <https://builds.apache.org/job/kafka-trunk-jdk8/ws/connect/runtime/build/reports/spotbugs/main.xml> with 0 unique warnings and 0 duplicates.
[FINDBUGS] Successfully parsed file <https://builds.apache.org/job/kafka-trunk-jdk8/ws/connect/transforms/build/reports/spotbugs/main.xml> with 0 unique warnings and 0 duplicates.
[FINDBUGS] Successfully parsed file <https://builds.apache.org/job/kafka-trunk-jdk8/ws/core/build/reports/spotbugs/main.xml> with 0 unique warnings and 0 duplicates.
[FINDBUGS] Successfully parsed file <https://builds.apache.org/job/kafka-trunk-jdk8/ws/examples/build/reports/spotbugs/main.xml> with 0 unique warnings and 0 duplicates.
[FINDBUGS] Successfully parsed file <https://builds.apache.org/job/kafka-trunk-jdk8/ws/generator/build/reports/spotbugs/main.xml> with 0 unique warnings and 0 duplicates.
[FINDBUGS] Successfully parsed file <https://builds.apache.org/job/kafka-trunk-jdk8/ws/jmh-benchmarks/build/reports/spotbugs/main.xml> with 0 unique warnings and 0 duplicates.
[FINDBUGS] Successfully parsed file <https://builds.apache.org/job/kafka-trunk-jdk8/ws/log4j-appender/build/reports/spotbugs/main.xml> with 0 unique warnings and 0 duplicates.
[FINDBUGS] Successfully parsed file <https://builds.apache.org/job/kafka-trunk-jdk8/ws/streams/build/reports/spotbugs/main.xml> with 0 unique warnings and 0 duplicates.
[FINDBUGS] Successfully parsed file <https://builds.apache.org/job/kafka-trunk-jdk8/ws/streams/examples/build/reports/spotbugs/main.xml> with 0 unique warnings and 0 duplicates.
[FINDBUGS] Successfully parsed file <https://builds.apache.org/job/kafka-trunk-jdk8/ws/streams/streams-scala/build/reports/spotbugs/main.xml> with 0 unique warnings and 0 duplicates.
[FINDBUGS] Successfully parsed file <https://builds.apache.org/job/kafka-trunk-jdk8/ws/streams/test-utils/build/reports/spotbugs/main.xml> with 0 unique warnings and 0 duplicates.
[FINDBUGS] Successfully parsed file <https://builds.apache.org/job/kafka-trunk-jdk8/ws/tools/build/reports/spotbugs/main.xml> with 0 unique warnings and 0 duplicates.
Setting GRADLE_4_10_3_HOME=/home/jenkins/tools/gradle/4.10.3
No credentials specified
Setting GRADLE_4_10_3_HOME=/home/jenkins/tools/gradle/4.10.3
<Git Blamer> Using GitBlamer to create author and commit information for all warnings.
<Git Blamer> GIT_COMMIT=bea5ceb4343e79ede4107c879288a5f690bd455f, workspace=<https://builds.apache.org/job/kafka-trunk-jdk8/ws/>
[FINDBUGS] Computing warning deltas based on reference build #4632
Recording test results
Setting GRADLE_4_10_3_HOME=/home/jenkins/tools/gradle/4.10.3
Setting GRADLE_4_10_3_HOME=/home/jenkins/tools/gradle/4.10.3
Not sending mail to unregistered user noreply@github.com
Build failed in Jenkins: kafka-trunk-jdk8 #4645
Posted by Apache Jenkins Server <je...@builds.apache.org>.
See <https://builds.apache.org/job/kafka-trunk-jdk8/4645/display/redirect?page=changes>
Changes:
[github] MINOR: Documentation for KIP-585 (#8839)
------------------------------------------
[...truncated 3.15 MB...]
org.apache.kafka.streams.TopologyTestDriverTest > shouldThrowForUnknownTopicDeprecated[Eos enabled = false] PASSED
org.apache.kafka.streams.TopologyTestDriverTest > shouldThrowPatternNotValidForTopicNameException[Eos enabled = false] STARTED
org.apache.kafka.streams.TopologyTestDriverTest > shouldThrowPatternNotValidForTopicNameException[Eos enabled = false] PASSED
org.apache.kafka.streams.TopologyTestDriverTest > shouldEnqueueLaterOutputsAfterEarlierOnes[Eos enabled = false] STARTED
org.apache.kafka.streams.TopologyTestDriverTest > shouldEnqueueLaterOutputsAfterEarlierOnes[Eos enabled = false] PASSED
org.apache.kafka.streams.TopologyTestDriverTest > shouldUseSourceSpecificDeserializersDeprecated[Eos enabled = false] STARTED
org.apache.kafka.streams.TopologyTestDriverTest > shouldUseSourceSpecificDeserializersDeprecated[Eos enabled = false] PASSED
org.apache.kafka.streams.TopologyTestDriverTest > shouldPunctuateIfEvenTimeAdvances[Eos enabled = false] STARTED
org.apache.kafka.streams.TopologyTestDriverTest > shouldPunctuateIfEvenTimeAdvances[Eos enabled = false] PASSED
org.apache.kafka.streams.TopologyTestDriverTest > shouldInitProcessor[Eos enabled = false] STARTED
org.apache.kafka.streams.TopologyTestDriverTest > shouldInitProcessor[Eos enabled = false] PASSED
org.apache.kafka.streams.TopologyTestDriverTest > shouldThrowForUnknownTopic[Eos enabled = false] STARTED
org.apache.kafka.streams.TopologyTestDriverTest > shouldThrowForUnknownTopic[Eos enabled = false] PASSED
org.apache.kafka.streams.TopologyTestDriverTest > shouldPunctuateOnStreamsTime[Eos enabled = false] STARTED
org.apache.kafka.streams.TopologyTestDriverTest > shouldPunctuateOnStreamsTime[Eos enabled = false] PASSED
org.apache.kafka.streams.TopologyTestDriverTest > shouldCaptureGlobalTopicNameIfWrittenInto[Eos enabled = false] STARTED
org.apache.kafka.streams.TopologyTestDriverTest > shouldCaptureGlobalTopicNameIfWrittenInto[Eos enabled = false] PASSED
org.apache.kafka.streams.TopologyTestDriverTest > shouldThrowIfInMemoryBuiltInStoreIsAccessedWithUntypedMethod[Eos enabled = false] STARTED
org.apache.kafka.streams.TopologyTestDriverTest > shouldThrowIfInMemoryBuiltInStoreIsAccessedWithUntypedMethod[Eos enabled = false] PASSED
org.apache.kafka.streams.TopologyTestDriverTest > shouldProcessFromSourcesThatMatchMultiplePattern[Eos enabled = false] STARTED
org.apache.kafka.streams.TopologyTestDriverTest > shouldProcessFromSourcesThatMatchMultiplePattern[Eos enabled = false] PASSED
org.apache.kafka.streams.TopologyTestDriverTest > shouldPopulateGlobalStore[Eos enabled = false] STARTED
org.apache.kafka.streams.TopologyTestDriverTest > shouldPopulateGlobalStore[Eos enabled = false] PASSED
org.apache.kafka.streams.TopologyTestDriverTest > shouldThrowIfPersistentBuiltInStoreIsAccessedWithUntypedMethod[Eos enabled = false] STARTED
org.apache.kafka.streams.TopologyTestDriverTest > shouldThrowIfPersistentBuiltInStoreIsAccessedWithUntypedMethod[Eos enabled = false] PASSED
org.apache.kafka.streams.TopologyTestDriverTest > shouldAllowPrePopulatingStatesStoresWithCachingEnabled[Eos enabled = false] STARTED
org.apache.kafka.streams.TopologyTestDriverTest > shouldAllowPrePopulatingStatesStoresWithCachingEnabled[Eos enabled = false] PASSED
org.apache.kafka.streams.TopologyTestDriverTest > shouldReturnCorrectPersistentStoreTypeOnly[Eos enabled = false] STARTED
org.apache.kafka.streams.TopologyTestDriverTest > shouldReturnCorrectPersistentStoreTypeOnly[Eos enabled = false] PASSED
org.apache.kafka.streams.TopologyTestDriverTest > shouldRespectTaskIdling[Eos enabled = false] STARTED
org.apache.kafka.streams.TopologyTestDriverTest > shouldRespectTaskIdling[Eos enabled = false] PASSED
org.apache.kafka.streams.TopologyTestDriverTest > shouldUseSourceSpecificDeserializers[Eos enabled = false] STARTED
org.apache.kafka.streams.TopologyTestDriverTest > shouldUseSourceSpecificDeserializers[Eos enabled = false] PASSED
org.apache.kafka.streams.TopologyTestDriverTest > shouldReturnAllStores[Eos enabled = false] STARTED
org.apache.kafka.streams.TopologyTestDriverTest > shouldReturnAllStores[Eos enabled = false] PASSED
org.apache.kafka.streams.TopologyTestDriverTest > shouldNotCreateStateDirectoryForStatelessTopology[Eos enabled = false] STARTED
org.apache.kafka.streams.TopologyTestDriverTest > shouldNotCreateStateDirectoryForStatelessTopology[Eos enabled = false] PASSED
org.apache.kafka.streams.TopologyTestDriverTest > shouldApplyGlobalUpdatesCorrectlyInRecursiveTopologies[Eos enabled = false] STARTED
org.apache.kafka.streams.TopologyTestDriverTest > shouldApplyGlobalUpdatesCorrectlyInRecursiveTopologies[Eos enabled = false] PASSED
org.apache.kafka.streams.TopologyTestDriverTest > shouldReturnAllStoresNames[Eos enabled = false] STARTED
org.apache.kafka.streams.TopologyTestDriverTest > shouldReturnAllStoresNames[Eos enabled = false] PASSED
org.apache.kafka.streams.TopologyTestDriverTest > shouldPassRecordHeadersIntoSerializersAndDeserializers[Eos enabled = false] STARTED
org.apache.kafka.streams.TopologyTestDriverTest > shouldPassRecordHeadersIntoSerializersAndDeserializers[Eos enabled = false] PASSED
org.apache.kafka.streams.TopologyTestDriverTest > shouldProcessConsumerRecordList[Eos enabled = false] STARTED
org.apache.kafka.streams.TopologyTestDriverTest > shouldProcessConsumerRecordList[Eos enabled = false] PASSED
org.apache.kafka.streams.TopologyTestDriverTest > shouldUseSinkSpecificSerializers[Eos enabled = false] STARTED
org.apache.kafka.streams.TopologyTestDriverTest > shouldUseSinkSpecificSerializers[Eos enabled = false] PASSED
org.apache.kafka.streams.TopologyTestDriverTest > shouldFlushStoreForFirstInput[Eos enabled = false] STARTED
org.apache.kafka.streams.TopologyTestDriverTest > shouldFlushStoreForFirstInput[Eos enabled = false] PASSED
org.apache.kafka.streams.TopologyTestDriverTest > shouldProcessFromSourceThatMatchPattern[Eos enabled = false] STARTED
org.apache.kafka.streams.TopologyTestDriverTest > shouldProcessFromSourceThatMatchPattern[Eos enabled = false] PASSED
org.apache.kafka.streams.TopologyTestDriverTest > shouldCaptureSinkTopicNamesIfWrittenInto[Eos enabled = false] STARTED
org.apache.kafka.streams.TopologyTestDriverTest > shouldCaptureSinkTopicNamesIfWrittenInto[Eos enabled = false] PASSED
org.apache.kafka.streams.TopologyTestDriverTest > shouldUpdateStoreForNewKey[Eos enabled = false] STARTED
org.apache.kafka.streams.TopologyTestDriverTest > shouldUpdateStoreForNewKey[Eos enabled = false] PASSED
org.apache.kafka.streams.TopologyTestDriverTest > shouldSendRecordViaCorrectSourceTopicDeprecated[Eos enabled = false] STARTED
org.apache.kafka.streams.TopologyTestDriverTest > shouldSendRecordViaCorrectSourceTopicDeprecated[Eos enabled = false] PASSED
org.apache.kafka.streams.TopologyTestDriverTest > shouldPunctuateOnWallClockTime[Eos enabled = false] STARTED
org.apache.kafka.streams.TopologyTestDriverTest > shouldPunctuateOnWallClockTime[Eos enabled = false] PASSED
org.apache.kafka.streams.TopologyTestDriverTest > shouldSetRecordMetadata[Eos enabled = false] STARTED
org.apache.kafka.streams.TopologyTestDriverTest > shouldSetRecordMetadata[Eos enabled = false] PASSED
org.apache.kafka.streams.TopologyTestDriverTest > shouldNotUpdateStoreForLargerValue[Eos enabled = false] STARTED
org.apache.kafka.streams.TopologyTestDriverTest > shouldNotUpdateStoreForLargerValue[Eos enabled = false] PASSED
org.apache.kafka.streams.TopologyTestDriverTest > shouldReturnCorrectInMemoryStoreTypeOnly[Eos enabled = false] STARTED
org.apache.kafka.streams.TopologyTestDriverTest > shouldReturnCorrectInMemoryStoreTypeOnly[Eos enabled = false] PASSED
org.apache.kafka.streams.TopologyTestDriverTest > shouldThrowForMissingTime[Eos enabled = false] STARTED
org.apache.kafka.streams.TopologyTestDriverTest > shouldThrowForMissingTime[Eos enabled = false] PASSED
org.apache.kafka.streams.TopologyTestDriverTest > shouldCaptureInternalTopicNamesIfWrittenInto[Eos enabled = false] STARTED
org.apache.kafka.streams.TopologyTestDriverTest > shouldCaptureInternalTopicNamesIfWrittenInto[Eos enabled = false] PASSED
org.apache.kafka.streams.TopologyTestDriverTest > shouldPunctuateOnWallClockTimeDeprecated[Eos enabled = false] STARTED
org.apache.kafka.streams.TopologyTestDriverTest > shouldPunctuateOnWallClockTimeDeprecated[Eos enabled = false] PASSED
org.apache.kafka.streams.TopologyTestDriverTest > shouldProcessRecordForTopic[Eos enabled = false] STARTED
org.apache.kafka.streams.TopologyTestDriverTest > shouldProcessRecordForTopic[Eos enabled = false] PASSED
org.apache.kafka.streams.TopologyTestDriverTest > shouldForwardRecordsFromSubtopologyToSubtopology[Eos enabled = false] STARTED
org.apache.kafka.streams.TopologyTestDriverTest > shouldForwardRecordsFromSubtopologyToSubtopology[Eos enabled = false] PASSED
org.apache.kafka.streams.TopologyTestDriverTest > shouldNotUpdateStoreForSmallerValue[Eos enabled = false] STARTED
org.apache.kafka.streams.TopologyTestDriverTest > shouldNotUpdateStoreForSmallerValue[Eos enabled = false] PASSED
org.apache.kafka.streams.TopologyTestDriverTest > shouldCreateStateDirectoryForStatefulTopology[Eos enabled = false] STARTED
org.apache.kafka.streams.TopologyTestDriverTest > shouldCreateStateDirectoryForStatefulTopology[Eos enabled = false] PASSED
org.apache.kafka.streams.TopologyTestDriverTest > shouldPunctuateIfWallClockTimeAdvances[Eos enabled = false] STARTED
org.apache.kafka.streams.TopologyTestDriverTest > shouldPunctuateIfWallClockTimeAdvances[Eos enabled = false] PASSED
> Task :streams:upgrade-system-tests-23:spotbugsMain NO-SOURCE
> Task :streams:upgrade-system-tests-23:test
> Task :streams:upgrade-system-tests-24:compileJava NO-SOURCE
> Task :streams:upgrade-system-tests-24:processResources NO-SOURCE
> Task :streams:upgrade-system-tests-24:classes UP-TO-DATE
> Task :streams:upgrade-system-tests-24:checkstyleMain NO-SOURCE
> Task :streams:upgrade-system-tests-24:compileTestJava
> Task :streams:upgrade-system-tests-24:processTestResources NO-SOURCE
> Task :streams:upgrade-system-tests-24:testClasses
> Task :streams:upgrade-system-tests-24:checkstyleTest
> Task :streams:upgrade-system-tests-24:spotbugsMain NO-SOURCE
> Task :streams:upgrade-system-tests-24:test
> Task :streams:upgrade-system-tests-25:compileJava NO-SOURCE
> Task :streams:upgrade-system-tests-25:processResources NO-SOURCE
> Task :streams:upgrade-system-tests-25:classes UP-TO-DATE
> Task :streams:upgrade-system-tests-25:checkstyleMain NO-SOURCE
> Task :streams:upgrade-system-tests-25:compileTestJava
> Task :streams:upgrade-system-tests-25:processTestResources NO-SOURCE
> Task :streams:upgrade-system-tests-25:testClasses
> Task :streams:upgrade-system-tests-25:checkstyleTest
> Task :streams:upgrade-system-tests-25:spotbugsMain NO-SOURCE
> Task :streams:upgrade-system-tests-25:test
FAILURE: Build completed with 2 failures.
1: Task failed with an exception.
-----------
* What went wrong:
Execution failed for task ':core:test'.
> There were failing tests. See the report at: file://<https://builds.apache.org/job/kafka-trunk-jdk8/ws/core/build/reports/tests/test/index.html>
* Try:
Run with --stacktrace option to get the stack trace. Run with --info or --debug option to get more log output. Run with --scan to get full insights.
==============================================================================
2: Task failed with an exception.
-----------
* What went wrong:
Execution failed for task ':connect:mirror:test'.
> There were failing tests. See the report at: file://<https://builds.apache.org/job/kafka-trunk-jdk8/ws/connect/mirror/build/reports/tests/test/index.html>
* Try:
Run with --stacktrace option to get the stack trace. Run with --info or --debug option to get more log output. Run with --scan to get full insights.
==============================================================================
* Get more help at https://help.gradle.org
Deprecated Gradle features were used in this build, making it incompatible with Gradle 7.0.
Use '--warning-mode all' to show the individual deprecation warnings.
See https://docs.gradle.org/6.5/userguide/command_line_interface.html#sec:command_line_warnings
BUILD FAILED in 1h 58m 41s
215 actionable tasks: 183 executed, 32 up-to-date
Build step 'Execute shell' marked build as failure
[FINDBUGS] Collecting findbugs analysis files...
Setting GRADLE_4_10_3_HOME=/home/jenkins/tools/gradle/4.10.3
[FINDBUGS] Searching for all files in <https://builds.apache.org/job/kafka-trunk-jdk8/ws/> that match the pattern **/build/reports/*bugs/*.xml
[FINDBUGS] Parsing 19 files in <https://builds.apache.org/job/kafka-trunk-jdk8/ws/>
[FINDBUGS] Successfully parsed file <https://builds.apache.org/job/kafka-trunk-jdk8/ws/clients/build/reports/spotbugs/main.xml> with 0 unique warnings and 0 duplicates.
[FINDBUGS] Successfully parsed file <https://builds.apache.org/job/kafka-trunk-jdk8/ws/connect/api/build/reports/spotbugs/main.xml> with 0 unique warnings and 0 duplicates.
[FINDBUGS] Successfully parsed file <https://builds.apache.org/job/kafka-trunk-jdk8/ws/connect/basic-auth-extension/build/reports/spotbugs/main.xml> with 0 unique warnings and 0 duplicates.
[FINDBUGS] Successfully parsed file <https://builds.apache.org/job/kafka-trunk-jdk8/ws/connect/file/build/reports/spotbugs/main.xml> with 0 unique warnings and 0 duplicates.
[FINDBUGS] Successfully parsed file <https://builds.apache.org/job/kafka-trunk-jdk8/ws/connect/json/build/reports/spotbugs/main.xml> with 0 unique warnings and 0 duplicates.
[FINDBUGS] Successfully parsed file <https://builds.apache.org/job/kafka-trunk-jdk8/ws/connect/mirror-client/build/reports/spotbugs/main.xml> with 0 unique warnings and 0 duplicates.
[FINDBUGS] Successfully parsed file <https://builds.apache.org/job/kafka-trunk-jdk8/ws/connect/mirror/build/reports/spotbugs/main.xml> with 0 unique warnings and 0 duplicates.
[FINDBUGS] Successfully parsed file <https://builds.apache.org/job/kafka-trunk-jdk8/ws/connect/runtime/build/reports/spotbugs/main.xml> with 0 unique warnings and 0 duplicates.
[FINDBUGS] Successfully parsed file <https://builds.apache.org/job/kafka-trunk-jdk8/ws/connect/transforms/build/reports/spotbugs/main.xml> with 0 unique warnings and 0 duplicates.
[FINDBUGS] Successfully parsed file <https://builds.apache.org/job/kafka-trunk-jdk8/ws/core/build/reports/spotbugs/main.xml> with 0 unique warnings and 0 duplicates.
[FINDBUGS] Successfully parsed file <https://builds.apache.org/job/kafka-trunk-jdk8/ws/examples/build/reports/spotbugs/main.xml> with 0 unique warnings and 0 duplicates.
[FINDBUGS] Successfully parsed file <https://builds.apache.org/job/kafka-trunk-jdk8/ws/generator/build/reports/spotbugs/main.xml> with 0 unique warnings and 0 duplicates.
[FINDBUGS] Successfully parsed file <https://builds.apache.org/job/kafka-trunk-jdk8/ws/jmh-benchmarks/build/reports/spotbugs/main.xml> with 0 unique warnings and 0 duplicates.
[FINDBUGS] Successfully parsed file <https://builds.apache.org/job/kafka-trunk-jdk8/ws/log4j-appender/build/reports/spotbugs/main.xml> with 0 unique warnings and 0 duplicates.
[FINDBUGS] Successfully parsed file <https://builds.apache.org/job/kafka-trunk-jdk8/ws/streams/build/reports/spotbugs/main.xml> with 0 unique warnings and 0 duplicates.
[FINDBUGS] Successfully parsed file <https://builds.apache.org/job/kafka-trunk-jdk8/ws/streams/examples/build/reports/spotbugs/main.xml> with 0 unique warnings and 0 duplicates.
[FINDBUGS] Successfully parsed file <https://builds.apache.org/job/kafka-trunk-jdk8/ws/streams/streams-scala/build/reports/spotbugs/main.xml> with 0 unique warnings and 0 duplicates.
[FINDBUGS] Successfully parsed file <https://builds.apache.org/job/kafka-trunk-jdk8/ws/streams/test-utils/build/reports/spotbugs/main.xml> with 0 unique warnings and 0 duplicates.
[FINDBUGS] Successfully parsed file <https://builds.apache.org/job/kafka-trunk-jdk8/ws/tools/build/reports/spotbugs/main.xml> with 0 unique warnings and 0 duplicates.
Setting GRADLE_4_10_3_HOME=/home/jenkins/tools/gradle/4.10.3
No credentials specified
Setting GRADLE_4_10_3_HOME=/home/jenkins/tools/gradle/4.10.3
<Git Blamer> Using GitBlamer to create author and commit information for all warnings.
<Git Blamer> GIT_COMMIT=a1f429d4f636b8cfe99e052a20b85ed1cc7a0cef, workspace=<https://builds.apache.org/job/kafka-trunk-jdk8/ws/>
[FINDBUGS] Computing warning deltas based on reference build #4632
Recording test results
Setting GRADLE_4_10_3_HOME=/home/jenkins/tools/gradle/4.10.3
Setting GRADLE_4_10_3_HOME=/home/jenkins/tools/gradle/4.10.3
Not sending mail to unregistered user noreply@github.com
Build failed in Jenkins: kafka-trunk-jdk8 #4644
Posted by Apache Jenkins Server <je...@builds.apache.org>.
See <https://builds.apache.org/job/kafka-trunk-jdk8/4644/display/redirect?page=changes>
Changes:
[github] HOTFIX: checkstyle error in ProcessorStateManager (#8874)
------------------------------------------
[...truncated 3.15 MB...]
org.apache.kafka.streams.TopologyTestDriverTest > shouldProcessFromSourceThatMatchPattern[Eos enabled = false] STARTED
org.apache.kafka.streams.TopologyTestDriverTest > shouldProcessFromSourceThatMatchPattern[Eos enabled = false] PASSED
org.apache.kafka.streams.TopologyTestDriverTest > shouldCaptureSinkTopicNamesIfWrittenInto[Eos enabled = false] STARTED
org.apache.kafka.streams.TopologyTestDriverTest > shouldCaptureSinkTopicNamesIfWrittenInto[Eos enabled = false] PASSED
org.apache.kafka.streams.TopologyTestDriverTest > shouldUpdateStoreForNewKey[Eos enabled = false] STARTED
org.apache.kafka.streams.TopologyTestDriverTest > shouldUpdateStoreForNewKey[Eos enabled = false] PASSED
org.apache.kafka.streams.TopologyTestDriverTest > shouldSendRecordViaCorrectSourceTopicDeprecated[Eos enabled = false] STARTED
org.apache.kafka.streams.TopologyTestDriverTest > shouldSendRecordViaCorrectSourceTopicDeprecated[Eos enabled = false] PASSED
org.apache.kafka.streams.TopologyTestDriverTest > shouldPunctuateOnWallClockTime[Eos enabled = false] STARTED
org.apache.kafka.streams.TopologyTestDriverTest > shouldPunctuateOnWallClockTime[Eos enabled = false] PASSED
org.apache.kafka.streams.TopologyTestDriverTest > shouldSetRecordMetadata[Eos enabled = false] STARTED
org.apache.kafka.streams.TopologyTestDriverTest > shouldSetRecordMetadata[Eos enabled = false] PASSED
org.apache.kafka.streams.TopologyTestDriverTest > shouldNotUpdateStoreForLargerValue[Eos enabled = false] STARTED
org.apache.kafka.streams.TopologyTestDriverTest > shouldNotUpdateStoreForLargerValue[Eos enabled = false] PASSED
org.apache.kafka.streams.TopologyTestDriverTest > shouldReturnCorrectInMemoryStoreTypeOnly[Eos enabled = false] STARTED
org.apache.kafka.streams.TopologyTestDriverTest > shouldReturnCorrectInMemoryStoreTypeOnly[Eos enabled = false] PASSED
org.apache.kafka.streams.TopologyTestDriverTest > shouldThrowForMissingTime[Eos enabled = false] STARTED
org.apache.kafka.streams.TopologyTestDriverTest > shouldThrowForMissingTime[Eos enabled = false] PASSED
org.apache.kafka.streams.TopologyTestDriverTest > shouldCaptureInternalTopicNamesIfWrittenInto[Eos enabled = false] STARTED
org.apache.kafka.streams.TopologyTestDriverTest > shouldCaptureInternalTopicNamesIfWrittenInto[Eos enabled = false] PASSED
org.apache.kafka.streams.TopologyTestDriverTest > shouldPunctuateOnWallClockTimeDeprecated[Eos enabled = false] STARTED
org.apache.kafka.streams.TopologyTestDriverTest > shouldPunctuateOnWallClockTimeDeprecated[Eos enabled = false] PASSED
org.apache.kafka.streams.TopologyTestDriverTest > shouldProcessRecordForTopic[Eos enabled = false] STARTED
org.apache.kafka.streams.TopologyTestDriverTest > shouldProcessRecordForTopic[Eos enabled = false] PASSED
org.apache.kafka.streams.TopologyTestDriverTest > shouldForwardRecordsFromSubtopologyToSubtopology[Eos enabled = false] STARTED
org.apache.kafka.streams.TopologyTestDriverTest > shouldForwardRecordsFromSubtopologyToSubtopology[Eos enabled = false] PASSED
org.apache.kafka.streams.TopologyTestDriverTest > shouldNotUpdateStoreForSmallerValue[Eos enabled = false] STARTED
org.apache.kafka.streams.TopologyTestDriverTest > shouldNotUpdateStoreForSmallerValue[Eos enabled = false] PASSED
org.apache.kafka.streams.TopologyTestDriverTest > shouldCreateStateDirectoryForStatefulTopology[Eos enabled = false] STARTED
org.apache.kafka.streams.TopologyTestDriverTest > shouldCreateStateDirectoryForStatefulTopology[Eos enabled = false] PASSED
org.apache.kafka.streams.TopologyTestDriverTest > shouldPunctuateIfWallClockTimeAdvances[Eos enabled = false] STARTED
org.apache.kafka.streams.TopologyTestDriverTest > shouldPunctuateIfWallClockTimeAdvances[Eos enabled = false] PASSED
org.apache.kafka.streams.MockTimeTest > shouldGetNanosAsMillis STARTED
org.apache.kafka.streams.MockTimeTest > shouldGetNanosAsMillis PASSED
org.apache.kafka.streams.MockTimeTest > shouldSetStartTime STARTED
org.apache.kafka.streams.MockTimeTest > shouldSetStartTime PASSED
org.apache.kafka.streams.MockTimeTest > shouldNotAllowNegativeSleep STARTED
org.apache.kafka.streams.MockTimeTest > shouldNotAllowNegativeSleep PASSED
org.apache.kafka.streams.MockTimeTest > shouldAdvanceTimeOnSleep STARTED
org.apache.kafka.streams.MockTimeTest > shouldAdvanceTimeOnSleep PASSED
org.apache.kafka.streams.internals.WindowStoreFacadeTest > shouldReturnIsOpen STARTED
org.apache.kafka.streams.internals.WindowStoreFacadeTest > shouldReturnIsOpen PASSED
org.apache.kafka.streams.internals.WindowStoreFacadeTest > shouldReturnName STARTED
org.apache.kafka.streams.internals.WindowStoreFacadeTest > shouldReturnName PASSED
org.apache.kafka.streams.internals.WindowStoreFacadeTest > shouldPutWithUnknownTimestamp STARTED
org.apache.kafka.streams.internals.WindowStoreFacadeTest > shouldPutWithUnknownTimestamp PASSED
org.apache.kafka.streams.internals.WindowStoreFacadeTest > shouldPutWindowStartTimestampWithUnknownTimestamp STARTED
org.apache.kafka.streams.internals.WindowStoreFacadeTest > shouldPutWindowStartTimestampWithUnknownTimestamp PASSED
org.apache.kafka.streams.internals.WindowStoreFacadeTest > shouldReturnIsPersistent STARTED
org.apache.kafka.streams.internals.WindowStoreFacadeTest > shouldReturnIsPersistent PASSED
org.apache.kafka.streams.internals.WindowStoreFacadeTest > shouldForwardClose STARTED
org.apache.kafka.streams.internals.WindowStoreFacadeTest > shouldForwardClose PASSED
org.apache.kafka.streams.internals.WindowStoreFacadeTest > shouldForwardFlush STARTED
org.apache.kafka.streams.internals.WindowStoreFacadeTest > shouldForwardFlush PASSED
org.apache.kafka.streams.internals.WindowStoreFacadeTest > shouldForwardInit STARTED
org.apache.kafka.streams.internals.WindowStoreFacadeTest > shouldForwardInit PASSED
org.apache.kafka.streams.test.TestRecordTest > testConsumerRecord STARTED
org.apache.kafka.streams.test.TestRecordTest > testConsumerRecord PASSED
org.apache.kafka.streams.test.TestRecordTest > testToString STARTED
org.apache.kafka.streams.test.TestRecordTest > testToString PASSED
org.apache.kafka.streams.test.TestRecordTest > testInvalidRecords STARTED
org.apache.kafka.streams.test.TestRecordTest > testInvalidRecords PASSED
org.apache.kafka.streams.test.TestRecordTest > testPartialConstructorEquals STARTED
org.apache.kafka.streams.test.TestRecordTest > testPartialConstructorEquals PASSED
org.apache.kafka.streams.test.TestRecordTest > testMultiFieldMatcher STARTED
org.apache.kafka.streams.test.TestRecordTest > testMultiFieldMatcher PASSED
org.apache.kafka.streams.test.TestRecordTest > testFields STARTED
org.apache.kafka.streams.test.TestRecordTest > testFields PASSED
org.apache.kafka.streams.test.TestRecordTest > testProducerRecord STARTED
org.apache.kafka.streams.test.TestRecordTest > testProducerRecord PASSED
org.apache.kafka.streams.test.TestRecordTest > testEqualsAndHashCode STARTED
org.apache.kafka.streams.test.TestRecordTest > testEqualsAndHashCode PASSED
> Task :streams:upgrade-system-tests-20:spotbugsMain NO-SOURCE
> Task :streams:upgrade-system-tests-20:test
> Task :streams:upgrade-system-tests-21:compileJava NO-SOURCE
> Task :streams:upgrade-system-tests-21:processResources NO-SOURCE
> Task :streams:upgrade-system-tests-21:classes UP-TO-DATE
> Task :streams:upgrade-system-tests-21:checkstyleMain NO-SOURCE
> Task :streams:upgrade-system-tests-21:compileTestJava
> Task :streams:upgrade-system-tests-21:processTestResources NO-SOURCE
> Task :streams:upgrade-system-tests-21:testClasses
> Task :streams:upgrade-system-tests-21:checkstyleTest
> Task :streams:upgrade-system-tests-21:spotbugsMain NO-SOURCE
> Task :streams:upgrade-system-tests-21:test
> Task :streams:upgrade-system-tests-22:compileJava NO-SOURCE
> Task :streams:upgrade-system-tests-22:processResources NO-SOURCE
> Task :streams:upgrade-system-tests-22:classes UP-TO-DATE
> Task :streams:upgrade-system-tests-22:checkstyleMain NO-SOURCE
> Task :streams:upgrade-system-tests-22:compileTestJava
> Task :streams:upgrade-system-tests-22:processTestResources NO-SOURCE
> Task :streams:upgrade-system-tests-22:testClasses
> Task :streams:upgrade-system-tests-22:checkstyleTest
> Task :streams:upgrade-system-tests-22:spotbugsMain NO-SOURCE
> Task :streams:upgrade-system-tests-22:test
> Task :streams:upgrade-system-tests-23:compileJava NO-SOURCE
> Task :streams:upgrade-system-tests-23:processResources NO-SOURCE
> Task :streams:upgrade-system-tests-23:classes UP-TO-DATE
> Task :streams:upgrade-system-tests-23:checkstyleMain NO-SOURCE
> Task :streams:upgrade-system-tests-23:compileTestJava
> Task :streams:upgrade-system-tests-23:processTestResources NO-SOURCE
> Task :streams:upgrade-system-tests-23:testClasses
> Task :streams:upgrade-system-tests-23:checkstyleTest
> Task :streams:upgrade-system-tests-23:spotbugsMain NO-SOURCE
> Task :streams:upgrade-system-tests-23:test
> Task :streams:upgrade-system-tests-24:compileJava NO-SOURCE
> Task :streams:upgrade-system-tests-24:processResources NO-SOURCE
> Task :streams:upgrade-system-tests-24:classes UP-TO-DATE
> Task :streams:upgrade-system-tests-24:checkstyleMain NO-SOURCE
> Task :streams:upgrade-system-tests-24:compileTestJava
> Task :streams:upgrade-system-tests-24:processTestResources NO-SOURCE
> Task :streams:upgrade-system-tests-24:testClasses
> Task :streams:upgrade-system-tests-24:checkstyleTest
> Task :streams:upgrade-system-tests-24:spotbugsMain NO-SOURCE
> Task :streams:upgrade-system-tests-24:test
> Task :streams:upgrade-system-tests-25:compileJava NO-SOURCE
> Task :streams:upgrade-system-tests-25:processResources NO-SOURCE
> Task :streams:upgrade-system-tests-25:classes UP-TO-DATE
> Task :streams:upgrade-system-tests-25:checkstyleMain NO-SOURCE
> Task :streams:upgrade-system-tests-25:compileTestJava
> Task :streams:upgrade-system-tests-25:processTestResources NO-SOURCE
> Task :streams:upgrade-system-tests-25:testClasses
> Task :streams:upgrade-system-tests-25:checkstyleTest
> Task :streams:upgrade-system-tests-25:spotbugsMain NO-SOURCE
> Task :streams:upgrade-system-tests-25:test
FAILURE: Build failed with an exception.
* What went wrong:
Execution failed for task ':core:test'.
> There were failing tests. See the report at: file://<https://builds.apache.org/job/kafka-trunk-jdk8/ws/core/build/reports/tests/test/index.html>
* Try:
Run with --stacktrace option to get the stack trace. Run with --info or --debug option to get more log output. Run with --scan to get full insights.
* Get more help at https://help.gradle.org
Deprecated Gradle features were used in this build, making it incompatible with Gradle 7.0.
Use '--warning-mode all' to show the individual deprecation warnings.
See https://docs.gradle.org/6.5/userguide/command_line_interface.html#sec:command_line_warnings
BUILD FAILED in 1h 48m 56s
215 actionable tasks: 183 executed, 32 up-to-date
Build step 'Execute shell' marked build as failure
[FINDBUGS] Collecting findbugs analysis files...
Setting GRADLE_4_10_3_HOME=/home/jenkins/tools/gradle/4.10.3
[FINDBUGS] Searching for all files in <https://builds.apache.org/job/kafka-trunk-jdk8/ws/> that match the pattern **/build/reports/*bugs/*.xml
[FINDBUGS] Parsing 19 files in <https://builds.apache.org/job/kafka-trunk-jdk8/ws/>
[FINDBUGS] Successfully parsed file <https://builds.apache.org/job/kafka-trunk-jdk8/ws/clients/build/reports/spotbugs/main.xml> with 0 unique warnings and 0 duplicates.
[FINDBUGS] Successfully parsed file <https://builds.apache.org/job/kafka-trunk-jdk8/ws/connect/api/build/reports/spotbugs/main.xml> with 0 unique warnings and 0 duplicates.
[FINDBUGS] Successfully parsed file <https://builds.apache.org/job/kafka-trunk-jdk8/ws/connect/basic-auth-extension/build/reports/spotbugs/main.xml> with 0 unique warnings and 0 duplicates.
[FINDBUGS] Successfully parsed file <https://builds.apache.org/job/kafka-trunk-jdk8/ws/connect/file/build/reports/spotbugs/main.xml> with 0 unique warnings and 0 duplicates.
[FINDBUGS] Successfully parsed file <https://builds.apache.org/job/kafka-trunk-jdk8/ws/connect/json/build/reports/spotbugs/main.xml> with 0 unique warnings and 0 duplicates.
[FINDBUGS] Successfully parsed file <https://builds.apache.org/job/kafka-trunk-jdk8/ws/connect/mirror-client/build/reports/spotbugs/main.xml> with 0 unique warnings and 0 duplicates.
[FINDBUGS] Successfully parsed file <https://builds.apache.org/job/kafka-trunk-jdk8/ws/connect/mirror/build/reports/spotbugs/main.xml> with 0 unique warnings and 0 duplicates.
[FINDBUGS] Successfully parsed file <https://builds.apache.org/job/kafka-trunk-jdk8/ws/connect/runtime/build/reports/spotbugs/main.xml> with 0 unique warnings and 0 duplicates.
[FINDBUGS] Successfully parsed file <https://builds.apache.org/job/kafka-trunk-jdk8/ws/connect/transforms/build/reports/spotbugs/main.xml> with 0 unique warnings and 0 duplicates.
[FINDBUGS] Successfully parsed file <https://builds.apache.org/job/kafka-trunk-jdk8/ws/core/build/reports/spotbugs/main.xml> with 0 unique warnings and 0 duplicates.
[FINDBUGS] Successfully parsed file <https://builds.apache.org/job/kafka-trunk-jdk8/ws/examples/build/reports/spotbugs/main.xml> with 0 unique warnings and 0 duplicates.
[FINDBUGS] Successfully parsed file <https://builds.apache.org/job/kafka-trunk-jdk8/ws/generator/build/reports/spotbugs/main.xml> with 0 unique warnings and 0 duplicates.
[FINDBUGS] Successfully parsed file <https://builds.apache.org/job/kafka-trunk-jdk8/ws/jmh-benchmarks/build/reports/spotbugs/main.xml> with 0 unique warnings and 0 duplicates.
[FINDBUGS] Successfully parsed file <https://builds.apache.org/job/kafka-trunk-jdk8/ws/log4j-appender/build/reports/spotbugs/main.xml> with 0 unique warnings and 0 duplicates.
[FINDBUGS] Successfully parsed file <https://builds.apache.org/job/kafka-trunk-jdk8/ws/streams/build/reports/spotbugs/main.xml> with 0 unique warnings and 0 duplicates.
[FINDBUGS] Successfully parsed file <https://builds.apache.org/job/kafka-trunk-jdk8/ws/streams/examples/build/reports/spotbugs/main.xml> with 0 unique warnings and 0 duplicates.
[FINDBUGS] Successfully parsed file <https://builds.apache.org/job/kafka-trunk-jdk8/ws/streams/streams-scala/build/reports/spotbugs/main.xml> with 0 unique warnings and 0 duplicates.
[FINDBUGS] Successfully parsed file <https://builds.apache.org/job/kafka-trunk-jdk8/ws/streams/test-utils/build/reports/spotbugs/main.xml> with 0 unique warnings and 0 duplicates.
[FINDBUGS] Successfully parsed file <https://builds.apache.org/job/kafka-trunk-jdk8/ws/tools/build/reports/spotbugs/main.xml> with 0 unique warnings and 0 duplicates.
Setting GRADLE_4_10_3_HOME=/home/jenkins/tools/gradle/4.10.3
No credentials specified
Setting GRADLE_4_10_3_HOME=/home/jenkins/tools/gradle/4.10.3
<Git Blamer> Using GitBlamer to create author and commit information for all warnings.
<Git Blamer> GIT_COMMIT=cb9f130ec8a584036b7953212572a6090c85af27, workspace=<https://builds.apache.org/job/kafka-trunk-jdk8/ws/>
[FINDBUGS] Computing warning deltas based on reference build #4632
Recording test results
Setting GRADLE_4_10_3_HOME=/home/jenkins/tools/gradle/4.10.3
Setting GRADLE_4_10_3_HOME=/home/jenkins/tools/gradle/4.10.3
Not sending mail to unregistered user noreply@github.com
Build failed in Jenkins: kafka-trunk-jdk8 #4643
Posted by Apache Jenkins Server <je...@builds.apache.org>.
See <https://builds.apache.org/job/kafka-trunk-jdk8/4643/display/redirect?page=changes>
Changes:
[github] MINOR: Avoid WARN log message when re-init from checkpoint skipped
[github] MINOR: Fix log message for transition from standby to active (#8872)
------------------------------------------
[...truncated 2.23 MB...]
org.apache.kafka.streams.TopologyTestDriverTest > shouldProcessRecordForTopic[Eos enabled = false] PASSED
org.apache.kafka.streams.TopologyTestDriverTest > shouldForwardRecordsFromSubtopologyToSubtopology[Eos enabled = false] STARTED
org.apache.kafka.streams.TopologyTestDriverTest > shouldForwardRecordsFromSubtopologyToSubtopology[Eos enabled = false] PASSED
org.apache.kafka.streams.TopologyTestDriverTest > shouldNotUpdateStoreForSmallerValue[Eos enabled = false] STARTED
org.apache.kafka.streams.TopologyTestDriverTest > shouldNotUpdateStoreForSmallerValue[Eos enabled = false] PASSED
org.apache.kafka.streams.TopologyTestDriverTest > shouldCreateStateDirectoryForStatefulTopology[Eos enabled = false] STARTED
org.apache.kafka.streams.TopologyTestDriverTest > shouldCreateStateDirectoryForStatefulTopology[Eos enabled = false] PASSED
org.apache.kafka.streams.TopologyTestDriverTest > shouldPunctuateIfWallClockTimeAdvances[Eos enabled = false] STARTED
org.apache.kafka.streams.TopologyTestDriverTest > shouldPunctuateIfWallClockTimeAdvances[Eos enabled = false] PASSED
org.apache.kafka.streams.MockTimeTest > shouldGetNanosAsMillis STARTED
org.apache.kafka.streams.MockTimeTest > shouldGetNanosAsMillis PASSED
org.apache.kafka.streams.MockTimeTest > shouldSetStartTime STARTED
org.apache.kafka.streams.MockTimeTest > shouldSetStartTime PASSED
org.apache.kafka.streams.MockTimeTest > shouldNotAllowNegativeSleep STARTED
org.apache.kafka.streams.MockTimeTest > shouldNotAllowNegativeSleep PASSED
org.apache.kafka.streams.MockTimeTest > shouldAdvanceTimeOnSleep STARTED
org.apache.kafka.streams.MockTimeTest > shouldAdvanceTimeOnSleep PASSED
org.apache.kafka.streams.internals.WindowStoreFacadeTest > shouldReturnIsOpen STARTED
org.apache.kafka.streams.internals.WindowStoreFacadeTest > shouldReturnIsOpen PASSED
org.apache.kafka.streams.internals.WindowStoreFacadeTest > shouldReturnName STARTED
org.apache.kafka.streams.internals.WindowStoreFacadeTest > shouldReturnName PASSED
org.apache.kafka.streams.internals.WindowStoreFacadeTest > shouldPutWithUnknownTimestamp STARTED
org.apache.kafka.streams.internals.WindowStoreFacadeTest > shouldPutWithUnknownTimestamp PASSED
org.apache.kafka.streams.internals.WindowStoreFacadeTest > shouldPutWindowStartTimestampWithUnknownTimestamp STARTED
org.apache.kafka.streams.internals.WindowStoreFacadeTest > shouldPutWindowStartTimestampWithUnknownTimestamp PASSED
org.apache.kafka.streams.internals.WindowStoreFacadeTest > shouldReturnIsPersistent STARTED
org.apache.kafka.streams.internals.WindowStoreFacadeTest > shouldReturnIsPersistent PASSED
org.apache.kafka.streams.internals.WindowStoreFacadeTest > shouldForwardClose STARTED
org.apache.kafka.streams.internals.WindowStoreFacadeTest > shouldForwardClose PASSED
org.apache.kafka.streams.internals.WindowStoreFacadeTest > shouldForwardFlush STARTED
org.apache.kafka.streams.internals.WindowStoreFacadeTest > shouldForwardFlush PASSED
org.apache.kafka.streams.internals.WindowStoreFacadeTest > shouldForwardInit STARTED
org.apache.kafka.streams.internals.WindowStoreFacadeTest > shouldForwardInit PASSED
org.apache.kafka.streams.test.TestRecordTest > testConsumerRecord STARTED
org.apache.kafka.streams.test.TestRecordTest > testConsumerRecord PASSED
org.apache.kafka.streams.test.TestRecordTest > testToString STARTED
org.apache.kafka.streams.test.TestRecordTest > testToString PASSED
org.apache.kafka.streams.test.TestRecordTest > testInvalidRecords STARTED
org.apache.kafka.streams.test.TestRecordTest > testInvalidRecords PASSED
org.apache.kafka.streams.test.TestRecordTest > testPartialConstructorEquals STARTED
org.apache.kafka.streams.test.TestRecordTest > testPartialConstructorEquals PASSED
org.apache.kafka.streams.test.TestRecordTest > testMultiFieldMatcher STARTED
org.apache.kafka.streams.test.TestRecordTest > testMultiFieldMatcher PASSED
org.apache.kafka.streams.test.TestRecordTest > testFields STARTED
org.apache.kafka.streams.test.TestRecordTest > testFields PASSED
org.apache.kafka.streams.test.TestRecordTest > testProducerRecord STARTED
org.apache.kafka.streams.test.TestRecordTest > testProducerRecord PASSED
org.apache.kafka.streams.test.TestRecordTest > testEqualsAndHashCode STARTED
org.apache.kafka.streams.test.TestRecordTest > testEqualsAndHashCode PASSED
> Task :streams:upgrade-system-tests-0110:spotbugsMain NO-SOURCE
> Task :streams:upgrade-system-tests-0110:test
> Task :streams:upgrade-system-tests-10:compileJava NO-SOURCE
> Task :streams:upgrade-system-tests-10:processResources NO-SOURCE
> Task :streams:upgrade-system-tests-10:classes UP-TO-DATE
> Task :streams:upgrade-system-tests-10:checkstyleMain NO-SOURCE
> Task :streams:upgrade-system-tests-10:compileTestJava
> Task :streams:upgrade-system-tests-10:processTestResources NO-SOURCE
> Task :streams:upgrade-system-tests-10:testClasses
> Task :streams:upgrade-system-tests-10:checkstyleTest
> Task :streams:upgrade-system-tests-10:spotbugsMain NO-SOURCE
> Task :streams:upgrade-system-tests-10:test
> Task :streams:upgrade-system-tests-11:compileJava NO-SOURCE
> Task :streams:upgrade-system-tests-11:processResources NO-SOURCE
> Task :streams:upgrade-system-tests-11:classes UP-TO-DATE
> Task :streams:upgrade-system-tests-11:checkstyleMain NO-SOURCE
> Task :streams:upgrade-system-tests-11:compileTestJava
> Task :streams:upgrade-system-tests-11:processTestResources NO-SOURCE
> Task :streams:upgrade-system-tests-11:testClasses
> Task :streams:upgrade-system-tests-11:checkstyleTest
> Task :streams:upgrade-system-tests-11:spotbugsMain NO-SOURCE
> Task :streams:upgrade-system-tests-11:test
> Task :streams:upgrade-system-tests-20:compileJava NO-SOURCE
> Task :streams:upgrade-system-tests-20:processResources NO-SOURCE
> Task :streams:upgrade-system-tests-20:classes UP-TO-DATE
> Task :streams:upgrade-system-tests-20:checkstyleMain NO-SOURCE
> Task :streams:upgrade-system-tests-20:compileTestJava
> Task :streams:upgrade-system-tests-20:processTestResources NO-SOURCE
> Task :streams:upgrade-system-tests-20:testClasses
> Task :streams:upgrade-system-tests-20:checkstyleTest
> Task :streams:upgrade-system-tests-20:spotbugsMain NO-SOURCE
> Task :streams:upgrade-system-tests-20:test
> Task :streams:upgrade-system-tests-21:compileJava NO-SOURCE
> Task :streams:upgrade-system-tests-21:processResources NO-SOURCE
> Task :streams:upgrade-system-tests-21:classes UP-TO-DATE
> Task :streams:upgrade-system-tests-21:checkstyleMain NO-SOURCE
> Task :streams:upgrade-system-tests-21:compileTestJava
> Task :streams:upgrade-system-tests-21:processTestResources NO-SOURCE
> Task :streams:upgrade-system-tests-21:testClasses
> Task :streams:upgrade-system-tests-21:checkstyleTest
> Task :streams:upgrade-system-tests-21:spotbugsMain NO-SOURCE
> Task :streams:upgrade-system-tests-21:test
> Task :streams:upgrade-system-tests-22:compileJava NO-SOURCE
> Task :streams:upgrade-system-tests-22:processResources NO-SOURCE
> Task :streams:upgrade-system-tests-22:classes UP-TO-DATE
> Task :streams:upgrade-system-tests-22:checkstyleMain NO-SOURCE
> Task :streams:upgrade-system-tests-22:compileTestJava
> Task :streams:upgrade-system-tests-22:processTestResources NO-SOURCE
> Task :streams:upgrade-system-tests-22:testClasses
> Task :streams:upgrade-system-tests-22:checkstyleTest
> Task :streams:upgrade-system-tests-22:spotbugsMain NO-SOURCE
> Task :streams:upgrade-system-tests-22:test
> Task :streams:upgrade-system-tests-23:compileJava NO-SOURCE
> Task :streams:upgrade-system-tests-23:processResources NO-SOURCE
> Task :streams:upgrade-system-tests-23:classes UP-TO-DATE
> Task :streams:upgrade-system-tests-23:checkstyleMain NO-SOURCE
> Task :streams:upgrade-system-tests-23:compileTestJava
> Task :streams:upgrade-system-tests-23:processTestResources NO-SOURCE
> Task :streams:upgrade-system-tests-23:testClasses
> Task :streams:upgrade-system-tests-23:checkstyleTest
> Task :streams:upgrade-system-tests-23:spotbugsMain NO-SOURCE
> Task :streams:upgrade-system-tests-23:test
> Task :streams:upgrade-system-tests-24:compileJava NO-SOURCE
> Task :streams:upgrade-system-tests-24:processResources NO-SOURCE
> Task :streams:upgrade-system-tests-24:classes UP-TO-DATE
> Task :streams:upgrade-system-tests-24:checkstyleMain NO-SOURCE
> Task :streams:upgrade-system-tests-24:compileTestJava
> Task :streams:upgrade-system-tests-24:processTestResources NO-SOURCE
> Task :streams:upgrade-system-tests-24:testClasses
> Task :streams:upgrade-system-tests-24:checkstyleTest
> Task :streams:upgrade-system-tests-24:spotbugsMain NO-SOURCE
> Task :streams:upgrade-system-tests-24:test
> Task :streams:upgrade-system-tests-25:compileJava NO-SOURCE
> Task :streams:upgrade-system-tests-25:processResources NO-SOURCE
> Task :streams:upgrade-system-tests-25:classes UP-TO-DATE
> Task :streams:upgrade-system-tests-25:checkstyleMain NO-SOURCE
> Task :streams:upgrade-system-tests-25:compileTestJava
> Task :streams:upgrade-system-tests-25:processTestResources NO-SOURCE
> Task :streams:upgrade-system-tests-25:testClasses
> Task :streams:upgrade-system-tests-25:checkstyleTest
> Task :streams:upgrade-system-tests-25:spotbugsMain NO-SOURCE
> Task :streams:upgrade-system-tests-25:test
FAILURE: Build completed with 2 failures.
1: Task failed with an exception.
-----------
* What went wrong:
Execution failed for task ':streams:checkstyleMain'.
> Checkstyle rule violations were found. See the report at: file://<https://builds.apache.org/job/kafka-trunk-jdk8/ws/streams/build/reports/checkstyle/main.html>
Checkstyle files with violations: 1
Checkstyle violations by severity: [error:1]
* Try:
Run with --stacktrace option to get the stack trace. Run with --info or --debug option to get more log output. Run with --scan to get full insights.
==============================================================================
2: Task failed with an exception.
-----------
* What went wrong:
Execution failed for task ':core:test'.
> There were failing tests. See the report at: file://<https://builds.apache.org/job/kafka-trunk-jdk8/ws/core/build/reports/tests/test/index.html>
* Try:
Run with --stacktrace option to get the stack trace. Run with --info or --debug option to get more log output. Run with --scan to get full insights.
==============================================================================
* Get more help at https://help.gradle.org
Deprecated Gradle features were used in this build, making it incompatible with Gradle 7.0.
Use '--warning-mode all' to show the individual deprecation warnings.
See https://docs.gradle.org/6.5/userguide/command_line_interface.html#sec:command_line_warnings
BUILD FAILED in 1h 26m 10s
214 actionable tasks: 182 executed, 32 up-to-date
Build step 'Execute shell' marked build as failure
[FINDBUGS] Collecting findbugs analysis files...
Setting GRADLE_4_10_3_HOME=/home/jenkins/tools/gradle/4.10.3
[FINDBUGS] Searching for all files in <https://builds.apache.org/job/kafka-trunk-jdk8/ws/> that match the pattern **/build/reports/*bugs/*.xml
[FINDBUGS] Parsing 19 files in <https://builds.apache.org/job/kafka-trunk-jdk8/ws/>
[FINDBUGS] Successfully parsed file <https://builds.apache.org/job/kafka-trunk-jdk8/ws/clients/build/reports/spotbugs/main.xml> with 0 unique warnings and 0 duplicates.
[FINDBUGS] Successfully parsed file <https://builds.apache.org/job/kafka-trunk-jdk8/ws/connect/api/build/reports/spotbugs/main.xml> with 0 unique warnings and 0 duplicates.
[FINDBUGS] Successfully parsed file <https://builds.apache.org/job/kafka-trunk-jdk8/ws/connect/basic-auth-extension/build/reports/spotbugs/main.xml> with 0 unique warnings and 0 duplicates.
[FINDBUGS] Successfully parsed file <https://builds.apache.org/job/kafka-trunk-jdk8/ws/connect/file/build/reports/spotbugs/main.xml> with 0 unique warnings and 0 duplicates.
[FINDBUGS] Successfully parsed file <https://builds.apache.org/job/kafka-trunk-jdk8/ws/connect/json/build/reports/spotbugs/main.xml> with 0 unique warnings and 0 duplicates.
[FINDBUGS] Successfully parsed file <https://builds.apache.org/job/kafka-trunk-jdk8/ws/connect/mirror-client/build/reports/spotbugs/main.xml> with 0 unique warnings and 0 duplicates.
[FINDBUGS] Successfully parsed file <https://builds.apache.org/job/kafka-trunk-jdk8/ws/connect/mirror/build/reports/spotbugs/main.xml> with 0 unique warnings and 0 duplicates.
[FINDBUGS] Successfully parsed file <https://builds.apache.org/job/kafka-trunk-jdk8/ws/connect/runtime/build/reports/spotbugs/main.xml> with 0 unique warnings and 0 duplicates.
[FINDBUGS] Successfully parsed file <https://builds.apache.org/job/kafka-trunk-jdk8/ws/connect/transforms/build/reports/spotbugs/main.xml> with 0 unique warnings and 0 duplicates.
[FINDBUGS] Successfully parsed file <https://builds.apache.org/job/kafka-trunk-jdk8/ws/core/build/reports/spotbugs/main.xml> with 0 unique warnings and 0 duplicates.
[FINDBUGS] Successfully parsed file <https://builds.apache.org/job/kafka-trunk-jdk8/ws/examples/build/reports/spotbugs/main.xml> with 0 unique warnings and 0 duplicates.
[FINDBUGS] Successfully parsed file <https://builds.apache.org/job/kafka-trunk-jdk8/ws/generator/build/reports/spotbugs/main.xml> with 0 unique warnings and 0 duplicates.
[FINDBUGS] Successfully parsed file <https://builds.apache.org/job/kafka-trunk-jdk8/ws/jmh-benchmarks/build/reports/spotbugs/main.xml> with 0 unique warnings and 0 duplicates.
[FINDBUGS] Successfully parsed file <https://builds.apache.org/job/kafka-trunk-jdk8/ws/log4j-appender/build/reports/spotbugs/main.xml> with 0 unique warnings and 0 duplicates.
[FINDBUGS] Successfully parsed file <https://builds.apache.org/job/kafka-trunk-jdk8/ws/streams/build/reports/spotbugs/main.xml> with 0 unique warnings and 0 duplicates.
[FINDBUGS] Successfully parsed file <https://builds.apache.org/job/kafka-trunk-jdk8/ws/streams/examples/build/reports/spotbugs/main.xml> with 0 unique warnings and 0 duplicates.
[FINDBUGS] Successfully parsed file <https://builds.apache.org/job/kafka-trunk-jdk8/ws/streams/streams-scala/build/reports/spotbugs/main.xml> with 0 unique warnings and 0 duplicates.
[FINDBUGS] Successfully parsed file <https://builds.apache.org/job/kafka-trunk-jdk8/ws/streams/test-utils/build/reports/spotbugs/main.xml> with 0 unique warnings and 0 duplicates.
[FINDBUGS] Successfully parsed file <https://builds.apache.org/job/kafka-trunk-jdk8/ws/tools/build/reports/spotbugs/main.xml> with 0 unique warnings and 0 duplicates.
Setting GRADLE_4_10_3_HOME=/home/jenkins/tools/gradle/4.10.3
No credentials specified
Setting GRADLE_4_10_3_HOME=/home/jenkins/tools/gradle/4.10.3
<Git Blamer> Using GitBlamer to create author and commit information for all warnings.
<Git Blamer> GIT_COMMIT=a0da6785a27b13be173762965402b55860ac5635, workspace=<https://builds.apache.org/job/kafka-trunk-jdk8/ws/>
[FINDBUGS] Computing warning deltas based on reference build #4632
Recording test results
Setting GRADLE_4_10_3_HOME=/home/jenkins/tools/gradle/4.10.3
Setting GRADLE_4_10_3_HOME=/home/jenkins/tools/gradle/4.10.3
Not sending mail to unregistered user noreply@github.com
Build failed in Jenkins: kafka-trunk-jdk8 #4642
Posted by Apache Jenkins Server <je...@builds.apache.org>.
See <https://builds.apache.org/job/kafka-trunk-jdk8/4642/display/redirect?page=changes>
Changes:
[github] HOTFIX: Fix compile error in TopicAdminTest (#8866)
------------------------------------------
[...truncated 3.15 MB...]
org.apache.kafka.streams.TopologyTestDriverTest > shouldUpdateStoreForNewKey[Eos enabled = false] STARTED
org.apache.kafka.streams.TopologyTestDriverTest > shouldUpdateStoreForNewKey[Eos enabled = false] PASSED
org.apache.kafka.streams.TopologyTestDriverTest > shouldSendRecordViaCorrectSourceTopicDeprecated[Eos enabled = false] STARTED
org.apache.kafka.streams.TopologyTestDriverTest > shouldSendRecordViaCorrectSourceTopicDeprecated[Eos enabled = false] PASSED
org.apache.kafka.streams.TopologyTestDriverTest > shouldPunctuateOnWallClockTime[Eos enabled = false] STARTED
org.apache.kafka.streams.TopologyTestDriverTest > shouldPunctuateOnWallClockTime[Eos enabled = false] PASSED
org.apache.kafka.streams.TopologyTestDriverTest > shouldSetRecordMetadata[Eos enabled = false] STARTED
org.apache.kafka.streams.TopologyTestDriverTest > shouldSetRecordMetadata[Eos enabled = false] PASSED
org.apache.kafka.streams.TopologyTestDriverTest > shouldNotUpdateStoreForLargerValue[Eos enabled = false] STARTED
org.apache.kafka.streams.TopologyTestDriverTest > shouldNotUpdateStoreForLargerValue[Eos enabled = false] PASSED
org.apache.kafka.streams.TopologyTestDriverTest > shouldReturnCorrectInMemoryStoreTypeOnly[Eos enabled = false] STARTED
org.apache.kafka.streams.TopologyTestDriverTest > shouldReturnCorrectInMemoryStoreTypeOnly[Eos enabled = false] PASSED
org.apache.kafka.streams.TopologyTestDriverTest > shouldThrowForMissingTime[Eos enabled = false] STARTED
org.apache.kafka.streams.TopologyTestDriverTest > shouldThrowForMissingTime[Eos enabled = false] PASSED
org.apache.kafka.streams.TopologyTestDriverTest > shouldCaptureInternalTopicNamesIfWrittenInto[Eos enabled = false] STARTED
org.apache.kafka.streams.TopologyTestDriverTest > shouldCaptureInternalTopicNamesIfWrittenInto[Eos enabled = false] PASSED
org.apache.kafka.streams.TopologyTestDriverTest > shouldPunctuateOnWallClockTimeDeprecated[Eos enabled = false] STARTED
org.apache.kafka.streams.TopologyTestDriverTest > shouldPunctuateOnWallClockTimeDeprecated[Eos enabled = false] PASSED
org.apache.kafka.streams.TopologyTestDriverTest > shouldProcessRecordForTopic[Eos enabled = false] STARTED
org.apache.kafka.streams.TopologyTestDriverTest > shouldProcessRecordForTopic[Eos enabled = false] PASSED
org.apache.kafka.streams.TopologyTestDriverTest > shouldForwardRecordsFromSubtopologyToSubtopology[Eos enabled = false] STARTED
org.apache.kafka.streams.TopologyTestDriverTest > shouldForwardRecordsFromSubtopologyToSubtopology[Eos enabled = false] PASSED
org.apache.kafka.streams.TopologyTestDriverTest > shouldNotUpdateStoreForSmallerValue[Eos enabled = false] STARTED
org.apache.kafka.streams.TopologyTestDriverTest > shouldNotUpdateStoreForSmallerValue[Eos enabled = false] PASSED
org.apache.kafka.streams.TopologyTestDriverTest > shouldCreateStateDirectoryForStatefulTopology[Eos enabled = false] STARTED
org.apache.kafka.streams.TopologyTestDriverTest > shouldCreateStateDirectoryForStatefulTopology[Eos enabled = false] PASSED
org.apache.kafka.streams.TopologyTestDriverTest > shouldPunctuateIfWallClockTimeAdvances[Eos enabled = false] STARTED
org.apache.kafka.streams.TopologyTestDriverTest > shouldPunctuateIfWallClockTimeAdvances[Eos enabled = false] PASSED
org.apache.kafka.streams.MockTimeTest > shouldGetNanosAsMillis STARTED
org.apache.kafka.streams.MockTimeTest > shouldGetNanosAsMillis PASSED
org.apache.kafka.streams.MockTimeTest > shouldSetStartTime STARTED
org.apache.kafka.streams.MockTimeTest > shouldSetStartTime PASSED
org.apache.kafka.streams.MockTimeTest > shouldNotAllowNegativeSleep STARTED
org.apache.kafka.streams.MockTimeTest > shouldNotAllowNegativeSleep PASSED
org.apache.kafka.streams.MockTimeTest > shouldAdvanceTimeOnSleep STARTED
org.apache.kafka.streams.MockTimeTest > shouldAdvanceTimeOnSleep PASSED
org.apache.kafka.streams.internals.WindowStoreFacadeTest > shouldReturnIsOpen STARTED
org.apache.kafka.streams.internals.WindowStoreFacadeTest > shouldReturnIsOpen PASSED
org.apache.kafka.streams.internals.WindowStoreFacadeTest > shouldReturnName STARTED
org.apache.kafka.streams.internals.WindowStoreFacadeTest > shouldReturnName PASSED
org.apache.kafka.streams.internals.WindowStoreFacadeTest > shouldPutWithUnknownTimestamp STARTED
org.apache.kafka.streams.internals.WindowStoreFacadeTest > shouldPutWithUnknownTimestamp PASSED
org.apache.kafka.streams.internals.WindowStoreFacadeTest > shouldPutWindowStartTimestampWithUnknownTimestamp STARTED
org.apache.kafka.streams.internals.WindowStoreFacadeTest > shouldPutWindowStartTimestampWithUnknownTimestamp PASSED
org.apache.kafka.streams.internals.WindowStoreFacadeTest > shouldReturnIsPersistent STARTED
org.apache.kafka.streams.internals.WindowStoreFacadeTest > shouldReturnIsPersistent PASSED
org.apache.kafka.streams.internals.WindowStoreFacadeTest > shouldForwardClose STARTED
org.apache.kafka.streams.internals.WindowStoreFacadeTest > shouldForwardClose PASSED
org.apache.kafka.streams.internals.WindowStoreFacadeTest > shouldForwardFlush STARTED
org.apache.kafka.streams.internals.WindowStoreFacadeTest > shouldForwardFlush PASSED
org.apache.kafka.streams.internals.WindowStoreFacadeTest > shouldForwardInit STARTED
org.apache.kafka.streams.internals.WindowStoreFacadeTest > shouldForwardInit PASSED
org.apache.kafka.streams.test.TestRecordTest > testConsumerRecord STARTED
org.apache.kafka.streams.test.TestRecordTest > testConsumerRecord PASSED
org.apache.kafka.streams.test.TestRecordTest > testToString STARTED
org.apache.kafka.streams.test.TestRecordTest > testToString PASSED
org.apache.kafka.streams.test.TestRecordTest > testInvalidRecords STARTED
org.apache.kafka.streams.test.TestRecordTest > testInvalidRecords PASSED
org.apache.kafka.streams.test.TestRecordTest > testPartialConstructorEquals STARTED
org.apache.kafka.streams.test.TestRecordTest > testPartialConstructorEquals PASSED
org.apache.kafka.streams.test.TestRecordTest > testMultiFieldMatcher STARTED
org.apache.kafka.streams.test.TestRecordTest > testMultiFieldMatcher PASSED
org.apache.kafka.streams.test.TestRecordTest > testFields STARTED
org.apache.kafka.streams.test.TestRecordTest > testFields PASSED
org.apache.kafka.streams.test.TestRecordTest > testProducerRecord STARTED
org.apache.kafka.streams.test.TestRecordTest > testProducerRecord PASSED
org.apache.kafka.streams.test.TestRecordTest > testEqualsAndHashCode STARTED
org.apache.kafka.streams.test.TestRecordTest > testEqualsAndHashCode PASSED
> Task :streams:upgrade-system-tests-20:compileJava NO-SOURCE
> Task :streams:upgrade-system-tests-20:processResources NO-SOURCE
> Task :streams:upgrade-system-tests-20:classes UP-TO-DATE
> Task :streams:upgrade-system-tests-20:checkstyleMain NO-SOURCE
> Task :streams:upgrade-system-tests-20:compileTestJava
> Task :streams:upgrade-system-tests-20:processTestResources NO-SOURCE
> Task :streams:upgrade-system-tests-20:testClasses
> Task :streams:upgrade-system-tests-20:checkstyleTest
> Task :streams:upgrade-system-tests-20:spotbugsMain NO-SOURCE
> Task :streams:upgrade-system-tests-20:test
> Task :streams:upgrade-system-tests-21:compileJava NO-SOURCE
> Task :streams:upgrade-system-tests-21:processResources NO-SOURCE
> Task :streams:upgrade-system-tests-21:classes UP-TO-DATE
> Task :streams:upgrade-system-tests-21:checkstyleMain NO-SOURCE
> Task :streams:upgrade-system-tests-21:compileTestJava
> Task :streams:upgrade-system-tests-21:processTestResources NO-SOURCE
> Task :streams:upgrade-system-tests-21:testClasses
> Task :streams:upgrade-system-tests-21:checkstyleTest
> Task :streams:upgrade-system-tests-21:spotbugsMain NO-SOURCE
> Task :streams:upgrade-system-tests-21:test
> Task :streams:upgrade-system-tests-22:compileJava NO-SOURCE
> Task :streams:upgrade-system-tests-22:processResources NO-SOURCE
> Task :streams:upgrade-system-tests-22:classes UP-TO-DATE
> Task :streams:upgrade-system-tests-22:checkstyleMain NO-SOURCE
> Task :streams:upgrade-system-tests-22:compileTestJava
> Task :streams:upgrade-system-tests-22:processTestResources NO-SOURCE
> Task :streams:upgrade-system-tests-22:testClasses
> Task :streams:upgrade-system-tests-22:checkstyleTest
> Task :streams:upgrade-system-tests-22:spotbugsMain NO-SOURCE
> Task :streams:upgrade-system-tests-22:test
> Task :streams:upgrade-system-tests-23:compileJava NO-SOURCE
> Task :streams:upgrade-system-tests-23:processResources NO-SOURCE
> Task :streams:upgrade-system-tests-23:classes UP-TO-DATE
> Task :streams:upgrade-system-tests-23:checkstyleMain NO-SOURCE
> Task :streams:upgrade-system-tests-23:compileTestJava
> Task :streams:upgrade-system-tests-23:processTestResources NO-SOURCE
> Task :streams:upgrade-system-tests-23:testClasses
> Task :streams:upgrade-system-tests-23:checkstyleTest
> Task :streams:upgrade-system-tests-23:spotbugsMain NO-SOURCE
> Task :streams:upgrade-system-tests-23:test
> Task :streams:upgrade-system-tests-24:compileJava NO-SOURCE
> Task :streams:upgrade-system-tests-24:processResources NO-SOURCE
> Task :streams:upgrade-system-tests-24:classes UP-TO-DATE
> Task :streams:upgrade-system-tests-24:checkstyleMain NO-SOURCE
> Task :streams:upgrade-system-tests-24:compileTestJava
> Task :streams:upgrade-system-tests-24:processTestResources NO-SOURCE
> Task :streams:upgrade-system-tests-24:testClasses
> Task :streams:upgrade-system-tests-24:checkstyleTest
> Task :streams:upgrade-system-tests-24:spotbugsMain NO-SOURCE
> Task :streams:upgrade-system-tests-24:test
> Task :streams:upgrade-system-tests-25:compileJava NO-SOURCE
> Task :streams:upgrade-system-tests-25:processResources NO-SOURCE
> Task :streams:upgrade-system-tests-25:classes UP-TO-DATE
> Task :streams:upgrade-system-tests-25:checkstyleMain NO-SOURCE
> Task :streams:upgrade-system-tests-25:compileTestJava
> Task :streams:upgrade-system-tests-25:processTestResources NO-SOURCE
> Task :streams:upgrade-system-tests-25:testClasses
> Task :streams:upgrade-system-tests-25:checkstyleTest
> Task :streams:upgrade-system-tests-25:spotbugsMain NO-SOURCE
> Task :streams:upgrade-system-tests-25:test
FAILURE: Build failed with an exception.
* What went wrong:
Execution failed for task ':core:test'.
> There were failing tests. See the report at: file://<https://builds.apache.org/job/kafka-trunk-jdk8/ws/core/build/reports/tests/test/index.html>
* Try:
Run with --stacktrace option to get the stack trace. Run with --info or --debug option to get more log output. Run with --scan to get full insights.
* Get more help at https://help.gradle.org
Deprecated Gradle features were used in this build, making it incompatible with Gradle 7.0.
Use '--warning-mode all' to show the individual deprecation warnings.
See https://docs.gradle.org/6.5/userguide/command_line_interface.html#sec:command_line_warnings
BUILD FAILED in 1h 44m 28s
215 actionable tasks: 183 executed, 32 up-to-date
Build step 'Execute shell' marked build as failure
[FINDBUGS] Collecting findbugs analysis files...
Setting GRADLE_4_10_3_HOME=/home/jenkins/tools/gradle/4.10.3
[FINDBUGS] Searching for all files in <https://builds.apache.org/job/kafka-trunk-jdk8/ws/> that match the pattern **/build/reports/*bugs/*.xml
[FINDBUGS] Parsing 19 files in <https://builds.apache.org/job/kafka-trunk-jdk8/ws/>
[FINDBUGS] Successfully parsed file <https://builds.apache.org/job/kafka-trunk-jdk8/ws/clients/build/reports/spotbugs/main.xml> with 0 unique warnings and 0 duplicates.
[FINDBUGS] Successfully parsed file <https://builds.apache.org/job/kafka-trunk-jdk8/ws/connect/api/build/reports/spotbugs/main.xml> with 0 unique warnings and 0 duplicates.
[FINDBUGS] Successfully parsed file <https://builds.apache.org/job/kafka-trunk-jdk8/ws/connect/basic-auth-extension/build/reports/spotbugs/main.xml> with 0 unique warnings and 0 duplicates.
[FINDBUGS] Successfully parsed file <https://builds.apache.org/job/kafka-trunk-jdk8/ws/connect/file/build/reports/spotbugs/main.xml> with 0 unique warnings and 0 duplicates.
[FINDBUGS] Successfully parsed file <https://builds.apache.org/job/kafka-trunk-jdk8/ws/connect/json/build/reports/spotbugs/main.xml> with 0 unique warnings and 0 duplicates.
[FINDBUGS] Successfully parsed file <https://builds.apache.org/job/kafka-trunk-jdk8/ws/connect/mirror-client/build/reports/spotbugs/main.xml> with 0 unique warnings and 0 duplicates.
[FINDBUGS] Successfully parsed file <https://builds.apache.org/job/kafka-trunk-jdk8/ws/connect/mirror/build/reports/spotbugs/main.xml> with 0 unique warnings and 0 duplicates.
[FINDBUGS] Successfully parsed file <https://builds.apache.org/job/kafka-trunk-jdk8/ws/connect/runtime/build/reports/spotbugs/main.xml> with 0 unique warnings and 0 duplicates.
[FINDBUGS] Successfully parsed file <https://builds.apache.org/job/kafka-trunk-jdk8/ws/connect/transforms/build/reports/spotbugs/main.xml> with 0 unique warnings and 0 duplicates.
[FINDBUGS] Successfully parsed file <https://builds.apache.org/job/kafka-trunk-jdk8/ws/core/build/reports/spotbugs/main.xml> with 0 unique warnings and 0 duplicates.
[FINDBUGS] Successfully parsed file <https://builds.apache.org/job/kafka-trunk-jdk8/ws/examples/build/reports/spotbugs/main.xml> with 0 unique warnings and 0 duplicates.
[FINDBUGS] Successfully parsed file <https://builds.apache.org/job/kafka-trunk-jdk8/ws/generator/build/reports/spotbugs/main.xml> with 0 unique warnings and 0 duplicates.
[FINDBUGS] Successfully parsed file <https://builds.apache.org/job/kafka-trunk-jdk8/ws/jmh-benchmarks/build/reports/spotbugs/main.xml> with 0 unique warnings and 0 duplicates.
[FINDBUGS] Successfully parsed file <https://builds.apache.org/job/kafka-trunk-jdk8/ws/log4j-appender/build/reports/spotbugs/main.xml> with 0 unique warnings and 0 duplicates.
[FINDBUGS] Successfully parsed file <https://builds.apache.org/job/kafka-trunk-jdk8/ws/streams/build/reports/spotbugs/main.xml> with 0 unique warnings and 0 duplicates.
[FINDBUGS] Successfully parsed file <https://builds.apache.org/job/kafka-trunk-jdk8/ws/streams/examples/build/reports/spotbugs/main.xml> with 0 unique warnings and 0 duplicates.
[FINDBUGS] Successfully parsed file <https://builds.apache.org/job/kafka-trunk-jdk8/ws/streams/streams-scala/build/reports/spotbugs/main.xml> with 0 unique warnings and 0 duplicates.
[FINDBUGS] Successfully parsed file <https://builds.apache.org/job/kafka-trunk-jdk8/ws/streams/test-utils/build/reports/spotbugs/main.xml> with 0 unique warnings and 0 duplicates.
[FINDBUGS] Successfully parsed file <https://builds.apache.org/job/kafka-trunk-jdk8/ws/tools/build/reports/spotbugs/main.xml> with 0 unique warnings and 0 duplicates.
Setting GRADLE_4_10_3_HOME=/home/jenkins/tools/gradle/4.10.3
No credentials specified
Setting GRADLE_4_10_3_HOME=/home/jenkins/tools/gradle/4.10.3
<Git Blamer> Using GitBlamer to create author and commit information for all warnings.
<Git Blamer> GIT_COMMIT=88fe466f03ff61d684c5b7b1f20558181a8f2078, workspace=<https://builds.apache.org/job/kafka-trunk-jdk8/ws/>
[FINDBUGS] Computing warning deltas based on reference build #4632
Recording test results
Setting GRADLE_4_10_3_HOME=/home/jenkins/tools/gradle/4.10.3
Setting GRADLE_4_10_3_HOME=/home/jenkins/tools/gradle/4.10.3
Not sending mail to unregistered user noreply@github.com
Build failed in Jenkins: kafka-trunk-jdk8 #4641
Posted by Apache Jenkins Server <je...@builds.apache.org>.
See <https://builds.apache.org/job/kafka-trunk-jdk8/4641/display/redirect?page=changes>
Changes:
[github] KAFKA-10144: clean up corrupted standby tasks before attempting a commit
------------------------------------------
[...truncated 3.00 MB...]
org.apache.kafka.streams.TopologyTestDriverTest > shouldReturnAllStoresNames[Eos enabled = false] PASSED
org.apache.kafka.streams.TopologyTestDriverTest > shouldPassRecordHeadersIntoSerializersAndDeserializers[Eos enabled = false] STARTED
org.apache.kafka.streams.TopologyTestDriverTest > shouldPassRecordHeadersIntoSerializersAndDeserializers[Eos enabled = false] PASSED
org.apache.kafka.streams.TopologyTestDriverTest > shouldProcessConsumerRecordList[Eos enabled = false] STARTED
org.apache.kafka.streams.TopologyTestDriverTest > shouldProcessConsumerRecordList[Eos enabled = false] PASSED
org.apache.kafka.streams.TopologyTestDriverTest > shouldUseSinkSpecificSerializers[Eos enabled = false] STARTED
org.apache.kafka.streams.TopologyTestDriverTest > shouldUseSinkSpecificSerializers[Eos enabled = false] PASSED
org.apache.kafka.streams.TopologyTestDriverTest > shouldFlushStoreForFirstInput[Eos enabled = false] STARTED
org.apache.kafka.streams.TopologyTestDriverTest > shouldFlushStoreForFirstInput[Eos enabled = false] PASSED
org.apache.kafka.streams.TopologyTestDriverTest > shouldProcessFromSourceThatMatchPattern[Eos enabled = false] STARTED
org.apache.kafka.streams.TopologyTestDriverTest > shouldProcessFromSourceThatMatchPattern[Eos enabled = false] PASSED
org.apache.kafka.streams.TopologyTestDriverTest > shouldCaptureSinkTopicNamesIfWrittenInto[Eos enabled = false] STARTED
org.apache.kafka.streams.TopologyTestDriverTest > shouldCaptureSinkTopicNamesIfWrittenInto[Eos enabled = false] PASSED
org.apache.kafka.streams.TopologyTestDriverTest > shouldUpdateStoreForNewKey[Eos enabled = false] STARTED
org.apache.kafka.streams.TopologyTestDriverTest > shouldUpdateStoreForNewKey[Eos enabled = false] PASSED
org.apache.kafka.streams.TopologyTestDriverTest > shouldSendRecordViaCorrectSourceTopicDeprecated[Eos enabled = false] STARTED
org.apache.kafka.streams.TopologyTestDriverTest > shouldSendRecordViaCorrectSourceTopicDeprecated[Eos enabled = false] PASSED
org.apache.kafka.streams.TopologyTestDriverTest > shouldPunctuateOnWallClockTime[Eos enabled = false] STARTED
org.apache.kafka.streams.TopologyTestDriverTest > shouldPunctuateOnWallClockTime[Eos enabled = false] PASSED
org.apache.kafka.streams.TopologyTestDriverTest > shouldSetRecordMetadata[Eos enabled = false] STARTED
org.apache.kafka.streams.TopologyTestDriverTest > shouldSetRecordMetadata[Eos enabled = false] PASSED
org.apache.kafka.streams.TopologyTestDriverTest > shouldNotUpdateStoreForLargerValue[Eos enabled = false] STARTED
org.apache.kafka.streams.TopologyTestDriverTest > shouldNotUpdateStoreForLargerValue[Eos enabled = false] PASSED
org.apache.kafka.streams.TopologyTestDriverTest > shouldReturnCorrectInMemoryStoreTypeOnly[Eos enabled = false] STARTED
org.apache.kafka.streams.TopologyTestDriverTest > shouldReturnCorrectInMemoryStoreTypeOnly[Eos enabled = false] PASSED
org.apache.kafka.streams.TopologyTestDriverTest > shouldThrowForMissingTime[Eos enabled = false] STARTED
org.apache.kafka.streams.TopologyTestDriverTest > shouldThrowForMissingTime[Eos enabled = false] PASSED
org.apache.kafka.streams.TopologyTestDriverTest > shouldCaptureInternalTopicNamesIfWrittenInto[Eos enabled = false] STARTED
org.apache.kafka.streams.TopologyTestDriverTest > shouldCaptureInternalTopicNamesIfWrittenInto[Eos enabled = false] PASSED
org.apache.kafka.streams.TopologyTestDriverTest > shouldPunctuateOnWallClockTimeDeprecated[Eos enabled = false] STARTED
org.apache.kafka.streams.TopologyTestDriverTest > shouldPunctuateOnWallClockTimeDeprecated[Eos enabled = false] PASSED
org.apache.kafka.streams.TopologyTestDriverTest > shouldProcessRecordForTopic[Eos enabled = false] STARTED
org.apache.kafka.streams.TopologyTestDriverTest > shouldProcessRecordForTopic[Eos enabled = false] PASSED
org.apache.kafka.streams.TopologyTestDriverTest > shouldForwardRecordsFromSubtopologyToSubtopology[Eos enabled = false] STARTED
org.apache.kafka.streams.TopologyTestDriverTest > shouldForwardRecordsFromSubtopologyToSubtopology[Eos enabled = false] PASSED
org.apache.kafka.streams.TopologyTestDriverTest > shouldNotUpdateStoreForSmallerValue[Eos enabled = false] STARTED
org.apache.kafka.streams.TopologyTestDriverTest > shouldNotUpdateStoreForSmallerValue[Eos enabled = false] PASSED
org.apache.kafka.streams.TopologyTestDriverTest > shouldCreateStateDirectoryForStatefulTopology[Eos enabled = false] STARTED
org.apache.kafka.streams.TopologyTestDriverTest > shouldCreateStateDirectoryForStatefulTopology[Eos enabled = false] PASSED
org.apache.kafka.streams.TopologyTestDriverTest > shouldPunctuateIfWallClockTimeAdvances[Eos enabled = false] STARTED
org.apache.kafka.streams.TopologyTestDriverTest > shouldPunctuateIfWallClockTimeAdvances[Eos enabled = false] PASSED
org.apache.kafka.streams.MockTimeTest > shouldGetNanosAsMillis STARTED
org.apache.kafka.streams.MockTimeTest > shouldGetNanosAsMillis PASSED
org.apache.kafka.streams.MockTimeTest > shouldSetStartTime STARTED
org.apache.kafka.streams.MockTimeTest > shouldSetStartTime PASSED
org.apache.kafka.streams.MockTimeTest > shouldNotAllowNegativeSleep STARTED
org.apache.kafka.streams.MockTimeTest > shouldNotAllowNegativeSleep PASSED
org.apache.kafka.streams.MockTimeTest > shouldAdvanceTimeOnSleep STARTED
org.apache.kafka.streams.MockTimeTest > shouldAdvanceTimeOnSleep PASSED
org.apache.kafka.streams.internals.WindowStoreFacadeTest > shouldReturnIsOpen STARTED
org.apache.kafka.streams.internals.WindowStoreFacadeTest > shouldReturnIsOpen PASSED
org.apache.kafka.streams.internals.WindowStoreFacadeTest > shouldReturnName STARTED
org.apache.kafka.streams.internals.WindowStoreFacadeTest > shouldReturnName PASSED
org.apache.kafka.streams.internals.WindowStoreFacadeTest > shouldPutWithUnknownTimestamp STARTED
org.apache.kafka.streams.internals.WindowStoreFacadeTest > shouldPutWithUnknownTimestamp PASSED
org.apache.kafka.streams.internals.WindowStoreFacadeTest > shouldPutWindowStartTimestampWithUnknownTimestamp STARTED
org.apache.kafka.streams.internals.WindowStoreFacadeTest > shouldPutWindowStartTimestampWithUnknownTimestamp PASSED
org.apache.kafka.streams.internals.WindowStoreFacadeTest > shouldReturnIsPersistent STARTED
org.apache.kafka.streams.internals.WindowStoreFacadeTest > shouldReturnIsPersistent PASSED
org.apache.kafka.streams.internals.WindowStoreFacadeTest > shouldForwardClose STARTED
org.apache.kafka.streams.internals.WindowStoreFacadeTest > shouldForwardClose PASSED
org.apache.kafka.streams.internals.WindowStoreFacadeTest > shouldForwardFlush STARTED
org.apache.kafka.streams.internals.WindowStoreFacadeTest > shouldForwardFlush PASSED
org.apache.kafka.streams.internals.WindowStoreFacadeTest > shouldForwardInit STARTED
org.apache.kafka.streams.internals.WindowStoreFacadeTest > shouldForwardInit PASSED
org.apache.kafka.streams.test.TestRecordTest > testConsumerRecord STARTED
org.apache.kafka.streams.test.TestRecordTest > testConsumerRecord PASSED
org.apache.kafka.streams.test.TestRecordTest > testToString STARTED
org.apache.kafka.streams.test.TestRecordTest > testToString PASSED
org.apache.kafka.streams.test.TestRecordTest > testInvalidRecords STARTED
org.apache.kafka.streams.test.TestRecordTest > testInvalidRecords PASSED
org.apache.kafka.streams.test.TestRecordTest > testPartialConstructorEquals STARTED
org.apache.kafka.streams.test.TestRecordTest > testPartialConstructorEquals PASSED
org.apache.kafka.streams.test.TestRecordTest > testMultiFieldMatcher STARTED
org.apache.kafka.streams.test.TestRecordTest > testMultiFieldMatcher PASSED
org.apache.kafka.streams.test.TestRecordTest > testFields STARTED
org.apache.kafka.streams.test.TestRecordTest > testFields PASSED
org.apache.kafka.streams.test.TestRecordTest > testProducerRecord STARTED
org.apache.kafka.streams.test.TestRecordTest > testProducerRecord PASSED
org.apache.kafka.streams.test.TestRecordTest > testEqualsAndHashCode STARTED
org.apache.kafka.streams.test.TestRecordTest > testEqualsAndHashCode PASSED
> Task :streams:upgrade-system-tests-23:spotbugsMain NO-SOURCE
> Task :streams:upgrade-system-tests-23:test
> Task :streams:upgrade-system-tests-24:compileJava NO-SOURCE
> Task :streams:upgrade-system-tests-24:processResources NO-SOURCE
> Task :streams:upgrade-system-tests-24:classes UP-TO-DATE
> Task :streams:upgrade-system-tests-24:checkstyleMain NO-SOURCE
> Task :streams:upgrade-system-tests-24:compileTestJava
> Task :streams:upgrade-system-tests-24:processTestResources NO-SOURCE
> Task :streams:upgrade-system-tests-24:testClasses
> Task :streams:upgrade-system-tests-24:checkstyleTest
> Task :streams:upgrade-system-tests-24:spotbugsMain NO-SOURCE
> Task :streams:upgrade-system-tests-24:test
> Task :streams:upgrade-system-tests-25:compileJava NO-SOURCE
> Task :streams:upgrade-system-tests-25:processResources NO-SOURCE
> Task :streams:upgrade-system-tests-25:classes UP-TO-DATE
> Task :streams:upgrade-system-tests-25:checkstyleMain NO-SOURCE
> Task :streams:upgrade-system-tests-25:compileTestJava
> Task :streams:upgrade-system-tests-25:processTestResources NO-SOURCE
> Task :streams:upgrade-system-tests-25:testClasses
> Task :streams:upgrade-system-tests-25:checkstyleTest
> Task :streams:upgrade-system-tests-25:spotbugsMain NO-SOURCE
> Task :streams:upgrade-system-tests-25:test
FAILURE: Build completed with 2 failures.
1: Task failed with an exception.
-----------
* What went wrong:
Execution failed for task ':core:test'.
> There were failing tests. See the report at: file://<https://builds.apache.org/job/kafka-trunk-jdk8/ws/core/build/reports/tests/test/index.html>
* Try:
Run with --stacktrace option to get the stack trace. Run with --info or --debug option to get more log output. Run with --scan to get full insights.
==============================================================================
2: Task failed with an exception.
-----------
* What went wrong:
Execution failed for task ':connect:runtime:compileTestJava'.
> Compilation failed; see the compiler error output for details.
* Try:
Run with --stacktrace option to get the stack trace. Run with --info or --debug option to get more log output. Run with --scan to get full insights.
==============================================================================
* Get more help at https://help.gradle.org
Deprecated Gradle features were used in this build, making it incompatible with Gradle 7.0.
Use '--warning-mode all' to show the individual deprecation warnings.
See https://docs.gradle.org/6.5/userguide/command_line_interface.html#sec:command_line_warnings
BUILD FAILED in 1h 35m 34s
210 actionable tasks: 178 executed, 32 up-to-date
Build step 'Execute shell' marked build as failure
[FINDBUGS] Collecting findbugs analysis files...
Setting GRADLE_4_10_3_HOME=/home/jenkins/tools/gradle/4.10.3
[FINDBUGS] Searching for all files in <https://builds.apache.org/job/kafka-trunk-jdk8/ws/> that match the pattern **/build/reports/*bugs/*.xml
[FINDBUGS] Parsing 19 files in <https://builds.apache.org/job/kafka-trunk-jdk8/ws/>
[FINDBUGS] Successfully parsed file <https://builds.apache.org/job/kafka-trunk-jdk8/ws/clients/build/reports/spotbugs/main.xml> with 0 unique warnings and 0 duplicates.
[FINDBUGS] Successfully parsed file <https://builds.apache.org/job/kafka-trunk-jdk8/ws/connect/api/build/reports/spotbugs/main.xml> with 0 unique warnings and 0 duplicates.
[FINDBUGS] Successfully parsed file <https://builds.apache.org/job/kafka-trunk-jdk8/ws/connect/basic-auth-extension/build/reports/spotbugs/main.xml> with 0 unique warnings and 0 duplicates.
[FINDBUGS] Successfully parsed file <https://builds.apache.org/job/kafka-trunk-jdk8/ws/connect/file/build/reports/spotbugs/main.xml> with 0 unique warnings and 0 duplicates.
[FINDBUGS] Successfully parsed file <https://builds.apache.org/job/kafka-trunk-jdk8/ws/connect/json/build/reports/spotbugs/main.xml> with 0 unique warnings and 0 duplicates.
[FINDBUGS] Successfully parsed file <https://builds.apache.org/job/kafka-trunk-jdk8/ws/connect/mirror-client/build/reports/spotbugs/main.xml> with 0 unique warnings and 0 duplicates.
[FINDBUGS] Successfully parsed file <https://builds.apache.org/job/kafka-trunk-jdk8/ws/connect/mirror/build/reports/spotbugs/main.xml> with 0 unique warnings and 0 duplicates.
[FINDBUGS] Successfully parsed file <https://builds.apache.org/job/kafka-trunk-jdk8/ws/connect/runtime/build/reports/spotbugs/main.xml> with 0 unique warnings and 0 duplicates.
[FINDBUGS] Successfully parsed file <https://builds.apache.org/job/kafka-trunk-jdk8/ws/connect/transforms/build/reports/spotbugs/main.xml> with 0 unique warnings and 0 duplicates.
[FINDBUGS] Successfully parsed file <https://builds.apache.org/job/kafka-trunk-jdk8/ws/core/build/reports/spotbugs/main.xml> with 0 unique warnings and 0 duplicates.
[FINDBUGS] Successfully parsed file <https://builds.apache.org/job/kafka-trunk-jdk8/ws/examples/build/reports/spotbugs/main.xml> with 0 unique warnings and 0 duplicates.
[FINDBUGS] Successfully parsed file <https://builds.apache.org/job/kafka-trunk-jdk8/ws/generator/build/reports/spotbugs/main.xml> with 0 unique warnings and 0 duplicates.
[FINDBUGS] Successfully parsed file <https://builds.apache.org/job/kafka-trunk-jdk8/ws/jmh-benchmarks/build/reports/spotbugs/main.xml> with 0 unique warnings and 0 duplicates.
[FINDBUGS] Successfully parsed file <https://builds.apache.org/job/kafka-trunk-jdk8/ws/log4j-appender/build/reports/spotbugs/main.xml> with 0 unique warnings and 0 duplicates.
[FINDBUGS] Successfully parsed file <https://builds.apache.org/job/kafka-trunk-jdk8/ws/streams/build/reports/spotbugs/main.xml> with 0 unique warnings and 0 duplicates.
[FINDBUGS] Successfully parsed file <https://builds.apache.org/job/kafka-trunk-jdk8/ws/streams/examples/build/reports/spotbugs/main.xml> with 0 unique warnings and 0 duplicates.
[FINDBUGS] Successfully parsed file <https://builds.apache.org/job/kafka-trunk-jdk8/ws/streams/streams-scala/build/reports/spotbugs/main.xml> with 0 unique warnings and 0 duplicates.
[FINDBUGS] Successfully parsed file <https://builds.apache.org/job/kafka-trunk-jdk8/ws/streams/test-utils/build/reports/spotbugs/main.xml> with 0 unique warnings and 0 duplicates.
[FINDBUGS] Successfully parsed file <https://builds.apache.org/job/kafka-trunk-jdk8/ws/tools/build/reports/spotbugs/main.xml> with 0 unique warnings and 0 duplicates.
Setting GRADLE_4_10_3_HOME=/home/jenkins/tools/gradle/4.10.3
No credentials specified
Setting GRADLE_4_10_3_HOME=/home/jenkins/tools/gradle/4.10.3
<Git Blamer> Using GitBlamer to create author and commit information for all warnings.
<Git Blamer> GIT_COMMIT=03ed08d0d17a10ca4f96c8cc0a8694834ae01e6d, workspace=<https://builds.apache.org/job/kafka-trunk-jdk8/ws/>
[FINDBUGS] Computing warning deltas based on reference build #4632
Recording test results
Setting GRADLE_4_10_3_HOME=/home/jenkins/tools/gradle/4.10.3
Setting GRADLE_4_10_3_HOME=/home/jenkins/tools/gradle/4.10.3
Not sending mail to unregistered user noreply@github.com
Build failed in Jenkins: kafka-trunk-jdk8 #4640
Posted by Apache Jenkins Server <je...@builds.apache.org>.
See <https://builds.apache.org/job/kafka-trunk-jdk8/4640/display/redirect?page=changes>
Changes:
[github] KAFKA-9432: automated protocol for DescribeConfigs (#8312)
[github] KAFKA-10157: Fix broken tests due to InterruptedException from
------------------------------------------
[...truncated 3.00 MB...]
org.apache.kafka.streams.TopologyTestDriverTest > shouldSetRecordMetadata[Eos enabled = false] PASSED
org.apache.kafka.streams.TopologyTestDriverTest > shouldNotUpdateStoreForLargerValue[Eos enabled = false] STARTED
org.apache.kafka.streams.TopologyTestDriverTest > shouldNotUpdateStoreForLargerValue[Eos enabled = false] PASSED
org.apache.kafka.streams.TopologyTestDriverTest > shouldReturnCorrectInMemoryStoreTypeOnly[Eos enabled = false] STARTED
org.apache.kafka.streams.TopologyTestDriverTest > shouldReturnCorrectInMemoryStoreTypeOnly[Eos enabled = false] PASSED
org.apache.kafka.streams.TopologyTestDriverTest > shouldThrowForMissingTime[Eos enabled = false] STARTED
org.apache.kafka.streams.TopologyTestDriverTest > shouldThrowForMissingTime[Eos enabled = false] PASSED
org.apache.kafka.streams.TopologyTestDriverTest > shouldCaptureInternalTopicNamesIfWrittenInto[Eos enabled = false] STARTED
org.apache.kafka.streams.TopologyTestDriverTest > shouldCaptureInternalTopicNamesIfWrittenInto[Eos enabled = false] PASSED
org.apache.kafka.streams.TopologyTestDriverTest > shouldPunctuateOnWallClockTimeDeprecated[Eos enabled = false] STARTED
org.apache.kafka.streams.TopologyTestDriverTest > shouldPunctuateOnWallClockTimeDeprecated[Eos enabled = false] PASSED
org.apache.kafka.streams.TopologyTestDriverTest > shouldProcessRecordForTopic[Eos enabled = false] STARTED
org.apache.kafka.streams.TopologyTestDriverTest > shouldProcessRecordForTopic[Eos enabled = false] PASSED
org.apache.kafka.streams.TopologyTestDriverTest > shouldForwardRecordsFromSubtopologyToSubtopology[Eos enabled = false] STARTED
org.apache.kafka.streams.TopologyTestDriverTest > shouldForwardRecordsFromSubtopologyToSubtopology[Eos enabled = false] PASSED
org.apache.kafka.streams.TopologyTestDriverTest > shouldNotUpdateStoreForSmallerValue[Eos enabled = false] STARTED
org.apache.kafka.streams.TopologyTestDriverTest > shouldNotUpdateStoreForSmallerValue[Eos enabled = false] PASSED
org.apache.kafka.streams.TopologyTestDriverTest > shouldCreateStateDirectoryForStatefulTopology[Eos enabled = false] STARTED
org.apache.kafka.streams.TopologyTestDriverTest > shouldCreateStateDirectoryForStatefulTopology[Eos enabled = false] PASSED
org.apache.kafka.streams.TopologyTestDriverTest > shouldPunctuateIfWallClockTimeAdvances[Eos enabled = false] STARTED
org.apache.kafka.streams.TopologyTestDriverTest > shouldPunctuateIfWallClockTimeAdvances[Eos enabled = false] PASSED
org.apache.kafka.streams.MockTimeTest > shouldGetNanosAsMillis STARTED
org.apache.kafka.streams.MockTimeTest > shouldGetNanosAsMillis PASSED
org.apache.kafka.streams.MockTimeTest > shouldSetStartTime STARTED
org.apache.kafka.streams.MockTimeTest > shouldSetStartTime PASSED
org.apache.kafka.streams.MockTimeTest > shouldNotAllowNegativeSleep STARTED
org.apache.kafka.streams.MockTimeTest > shouldNotAllowNegativeSleep PASSED
org.apache.kafka.streams.MockTimeTest > shouldAdvanceTimeOnSleep STARTED
org.apache.kafka.streams.MockTimeTest > shouldAdvanceTimeOnSleep PASSED
org.apache.kafka.streams.internals.WindowStoreFacadeTest > shouldReturnIsOpen STARTED
org.apache.kafka.streams.internals.WindowStoreFacadeTest > shouldReturnIsOpen PASSED
org.apache.kafka.streams.internals.WindowStoreFacadeTest > shouldReturnName STARTED
org.apache.kafka.streams.internals.WindowStoreFacadeTest > shouldReturnName PASSED
org.apache.kafka.streams.internals.WindowStoreFacadeTest > shouldPutWithUnknownTimestamp STARTED
org.apache.kafka.streams.internals.WindowStoreFacadeTest > shouldPutWithUnknownTimestamp PASSED
org.apache.kafka.streams.internals.WindowStoreFacadeTest > shouldPutWindowStartTimestampWithUnknownTimestamp STARTED
org.apache.kafka.streams.internals.WindowStoreFacadeTest > shouldPutWindowStartTimestampWithUnknownTimestamp PASSED
org.apache.kafka.streams.internals.WindowStoreFacadeTest > shouldReturnIsPersistent STARTED
org.apache.kafka.streams.internals.WindowStoreFacadeTest > shouldReturnIsPersistent PASSED
org.apache.kafka.streams.internals.WindowStoreFacadeTest > shouldForwardClose STARTED
org.apache.kafka.streams.internals.WindowStoreFacadeTest > shouldForwardClose PASSED
org.apache.kafka.streams.internals.WindowStoreFacadeTest > shouldForwardFlush STARTED
org.apache.kafka.streams.internals.WindowStoreFacadeTest > shouldForwardFlush PASSED
org.apache.kafka.streams.internals.WindowStoreFacadeTest > shouldForwardInit STARTED
org.apache.kafka.streams.internals.WindowStoreFacadeTest > shouldForwardInit PASSED
org.apache.kafka.streams.test.TestRecordTest > testConsumerRecord STARTED
org.apache.kafka.streams.test.TestRecordTest > testConsumerRecord PASSED
org.apache.kafka.streams.test.TestRecordTest > testToString STARTED
org.apache.kafka.streams.test.TestRecordTest > testToString PASSED
org.apache.kafka.streams.test.TestRecordTest > testInvalidRecords STARTED
org.apache.kafka.streams.test.TestRecordTest > testInvalidRecords PASSED
org.apache.kafka.streams.test.TestRecordTest > testPartialConstructorEquals STARTED
org.apache.kafka.streams.test.TestRecordTest > testPartialConstructorEquals PASSED
org.apache.kafka.streams.test.TestRecordTest > testMultiFieldMatcher STARTED
org.apache.kafka.streams.test.TestRecordTest > testMultiFieldMatcher PASSED
org.apache.kafka.streams.test.TestRecordTest > testFields STARTED
org.apache.kafka.streams.test.TestRecordTest > testFields PASSED
org.apache.kafka.streams.test.TestRecordTest > testProducerRecord STARTED
org.apache.kafka.streams.test.TestRecordTest > testProducerRecord PASSED
org.apache.kafka.streams.test.TestRecordTest > testEqualsAndHashCode STARTED
org.apache.kafka.streams.test.TestRecordTest > testEqualsAndHashCode PASSED
> Task :streams:upgrade-system-tests-11:spotbugsMain NO-SOURCE
> Task :streams:upgrade-system-tests-11:test
> Task :streams:upgrade-system-tests-20:compileJava NO-SOURCE
> Task :streams:upgrade-system-tests-20:processResources NO-SOURCE
> Task :streams:upgrade-system-tests-20:classes UP-TO-DATE
> Task :streams:upgrade-system-tests-20:checkstyleMain NO-SOURCE
> Task :streams:upgrade-system-tests-20:compileTestJava
> Task :streams:upgrade-system-tests-20:processTestResources NO-SOURCE
> Task :streams:upgrade-system-tests-20:testClasses
> Task :streams:upgrade-system-tests-20:checkstyleTest
> Task :streams:upgrade-system-tests-20:spotbugsMain NO-SOURCE
> Task :streams:upgrade-system-tests-20:test
> Task :streams:upgrade-system-tests-21:compileJava NO-SOURCE
> Task :streams:upgrade-system-tests-21:processResources NO-SOURCE
> Task :streams:upgrade-system-tests-21:classes UP-TO-DATE
> Task :streams:upgrade-system-tests-21:checkstyleMain NO-SOURCE
> Task :streams:upgrade-system-tests-21:compileTestJava
> Task :streams:upgrade-system-tests-21:processTestResources NO-SOURCE
> Task :streams:upgrade-system-tests-21:testClasses
> Task :streams:upgrade-system-tests-21:checkstyleTest
> Task :streams:upgrade-system-tests-21:spotbugsMain NO-SOURCE
> Task :streams:upgrade-system-tests-21:test
> Task :streams:upgrade-system-tests-22:compileJava NO-SOURCE
> Task :streams:upgrade-system-tests-22:processResources NO-SOURCE
> Task :streams:upgrade-system-tests-22:classes UP-TO-DATE
> Task :streams:upgrade-system-tests-22:checkstyleMain NO-SOURCE
> Task :streams:upgrade-system-tests-22:compileTestJava
> Task :streams:upgrade-system-tests-22:processTestResources NO-SOURCE
> Task :streams:upgrade-system-tests-22:testClasses
> Task :streams:upgrade-system-tests-22:checkstyleTest
> Task :streams:upgrade-system-tests-22:spotbugsMain NO-SOURCE
> Task :streams:upgrade-system-tests-22:test
> Task :streams:upgrade-system-tests-23:compileJava NO-SOURCE
> Task :streams:upgrade-system-tests-23:processResources NO-SOURCE
> Task :streams:upgrade-system-tests-23:classes UP-TO-DATE
> Task :streams:upgrade-system-tests-23:checkstyleMain NO-SOURCE
> Task :streams:upgrade-system-tests-23:compileTestJava
> Task :streams:upgrade-system-tests-23:processTestResources NO-SOURCE
> Task :streams:upgrade-system-tests-23:testClasses
> Task :streams:upgrade-system-tests-23:checkstyleTest
> Task :streams:upgrade-system-tests-23:spotbugsMain NO-SOURCE
> Task :streams:upgrade-system-tests-23:test
> Task :streams:upgrade-system-tests-24:compileJava NO-SOURCE
> Task :streams:upgrade-system-tests-24:processResources NO-SOURCE
> Task :streams:upgrade-system-tests-24:classes UP-TO-DATE
> Task :streams:upgrade-system-tests-24:checkstyleMain NO-SOURCE
> Task :streams:upgrade-system-tests-24:compileTestJava
> Task :streams:upgrade-system-tests-24:processTestResources NO-SOURCE
> Task :streams:upgrade-system-tests-24:testClasses
> Task :streams:upgrade-system-tests-24:checkstyleTest
> Task :streams:upgrade-system-tests-24:spotbugsMain NO-SOURCE
> Task :streams:upgrade-system-tests-24:test
> Task :streams:upgrade-system-tests-25:compileJava NO-SOURCE
> Task :streams:upgrade-system-tests-25:processResources NO-SOURCE
> Task :streams:upgrade-system-tests-25:classes UP-TO-DATE
> Task :streams:upgrade-system-tests-25:checkstyleMain NO-SOURCE
> Task :streams:upgrade-system-tests-25:compileTestJava
> Task :streams:upgrade-system-tests-25:processTestResources NO-SOURCE
> Task :streams:upgrade-system-tests-25:testClasses
> Task :streams:upgrade-system-tests-25:checkstyleTest
> Task :streams:upgrade-system-tests-25:spotbugsMain NO-SOURCE
> Task :streams:upgrade-system-tests-25:test
FAILURE: Build completed with 2 failures.
1: Task failed with an exception.
-----------
* What went wrong:
Execution failed for task ':core:test'.
> There were failing tests. See the report at: file://<https://builds.apache.org/job/kafka-trunk-jdk8/ws/core/build/reports/tests/test/index.html>
* Try:
Run with --stacktrace option to get the stack trace. Run with --info or --debug option to get more log output. Run with --scan to get full insights.
==============================================================================
2: Task failed with an exception.
-----------
* What went wrong:
Execution failed for task ':connect:runtime:compileTestJava'.
> Compilation failed; see the compiler error output for details.
* Try:
Run with --stacktrace option to get the stack trace. Run with --info or --debug option to get more log output. Run with --scan to get full insights.
==============================================================================
* Get more help at https://help.gradle.org
Deprecated Gradle features were used in this build, making it incompatible with Gradle 7.0.
Use '--warning-mode all' to show the individual deprecation warnings.
See https://docs.gradle.org/6.5/userguide/command_line_interface.html#sec:command_line_warnings
BUILD FAILED in 1h 36m 31s
210 actionable tasks: 178 executed, 32 up-to-date
Build step 'Execute shell' marked build as failure
[FINDBUGS] Collecting findbugs analysis files...
Setting GRADLE_4_10_3_HOME=/home/jenkins/tools/gradle/4.10.3
[FINDBUGS] Searching for all files in <https://builds.apache.org/job/kafka-trunk-jdk8/ws/> that match the pattern **/build/reports/*bugs/*.xml
[FINDBUGS] Parsing 19 files in <https://builds.apache.org/job/kafka-trunk-jdk8/ws/>
[FINDBUGS] Successfully parsed file <https://builds.apache.org/job/kafka-trunk-jdk8/ws/clients/build/reports/spotbugs/main.xml> with 0 unique warnings and 0 duplicates.
[FINDBUGS] Successfully parsed file <https://builds.apache.org/job/kafka-trunk-jdk8/ws/connect/api/build/reports/spotbugs/main.xml> with 0 unique warnings and 0 duplicates.
[FINDBUGS] Successfully parsed file <https://builds.apache.org/job/kafka-trunk-jdk8/ws/connect/basic-auth-extension/build/reports/spotbugs/main.xml> with 0 unique warnings and 0 duplicates.
[FINDBUGS] Successfully parsed file <https://builds.apache.org/job/kafka-trunk-jdk8/ws/connect/file/build/reports/spotbugs/main.xml> with 0 unique warnings and 0 duplicates.
[FINDBUGS] Successfully parsed file <https://builds.apache.org/job/kafka-trunk-jdk8/ws/connect/json/build/reports/spotbugs/main.xml> with 0 unique warnings and 0 duplicates.
[FINDBUGS] Successfully parsed file <https://builds.apache.org/job/kafka-trunk-jdk8/ws/connect/mirror-client/build/reports/spotbugs/main.xml> with 0 unique warnings and 0 duplicates.
[FINDBUGS] Successfully parsed file <https://builds.apache.org/job/kafka-trunk-jdk8/ws/connect/mirror/build/reports/spotbugs/main.xml> with 0 unique warnings and 0 duplicates.
[FINDBUGS] Successfully parsed file <https://builds.apache.org/job/kafka-trunk-jdk8/ws/connect/runtime/build/reports/spotbugs/main.xml> with 0 unique warnings and 0 duplicates.
[FINDBUGS] Successfully parsed file <https://builds.apache.org/job/kafka-trunk-jdk8/ws/connect/transforms/build/reports/spotbugs/main.xml> with 0 unique warnings and 0 duplicates.
[FINDBUGS] Successfully parsed file <https://builds.apache.org/job/kafka-trunk-jdk8/ws/core/build/reports/spotbugs/main.xml> with 0 unique warnings and 0 duplicates.
[FINDBUGS] Successfully parsed file <https://builds.apache.org/job/kafka-trunk-jdk8/ws/examples/build/reports/spotbugs/main.xml> with 0 unique warnings and 0 duplicates.
[FINDBUGS] Successfully parsed file <https://builds.apache.org/job/kafka-trunk-jdk8/ws/generator/build/reports/spotbugs/main.xml> with 0 unique warnings and 0 duplicates.
[FINDBUGS] Successfully parsed file <https://builds.apache.org/job/kafka-trunk-jdk8/ws/jmh-benchmarks/build/reports/spotbugs/main.xml> with 0 unique warnings and 0 duplicates.
[FINDBUGS] Successfully parsed file <https://builds.apache.org/job/kafka-trunk-jdk8/ws/log4j-appender/build/reports/spotbugs/main.xml> with 0 unique warnings and 0 duplicates.
[FINDBUGS] Successfully parsed file <https://builds.apache.org/job/kafka-trunk-jdk8/ws/streams/build/reports/spotbugs/main.xml> with 0 unique warnings and 0 duplicates.
[FINDBUGS] Successfully parsed file <https://builds.apache.org/job/kafka-trunk-jdk8/ws/streams/examples/build/reports/spotbugs/main.xml> with 0 unique warnings and 0 duplicates.
[FINDBUGS] Successfully parsed file <https://builds.apache.org/job/kafka-trunk-jdk8/ws/streams/streams-scala/build/reports/spotbugs/main.xml> with 0 unique warnings and 0 duplicates.
[FINDBUGS] Successfully parsed file <https://builds.apache.org/job/kafka-trunk-jdk8/ws/streams/test-utils/build/reports/spotbugs/main.xml> with 0 unique warnings and 0 duplicates.
[FINDBUGS] Successfully parsed file <https://builds.apache.org/job/kafka-trunk-jdk8/ws/tools/build/reports/spotbugs/main.xml> with 0 unique warnings and 0 duplicates.
Setting GRADLE_4_10_3_HOME=/home/jenkins/tools/gradle/4.10.3
No credentials specified
Setting GRADLE_4_10_3_HOME=/home/jenkins/tools/gradle/4.10.3
<Git Blamer> Using GitBlamer to create author and commit information for all warnings.
<Git Blamer> GIT_COMMIT=3d45e1f09ee91a3233eec9adc416ff9c15c2b5c8, workspace=<https://builds.apache.org/job/kafka-trunk-jdk8/ws/>
[FINDBUGS] Computing warning deltas based on reference build #4632
Recording test results
Setting GRADLE_4_10_3_HOME=/home/jenkins/tools/gradle/4.10.3
Setting GRADLE_4_10_3_HOME=/home/jenkins/tools/gradle/4.10.3
Not sending mail to unregistered user noreply@github.com
Build failed in Jenkins: kafka-trunk-jdk8 #4639
Posted by Apache Jenkins Server <je...@builds.apache.org>.
See <https://builds.apache.org/job/kafka-trunk-jdk8/4639/display/redirect?page=changes>
Changes:
[github] KAFKA-10049: Fixed FKJ bug where wrapped serdes are set incorrectly when
------------------------------------------
[...truncated 2.29 MB...]
org.apache.kafka.streams.MockTimeTest > shouldSetStartTime STARTED
org.apache.kafka.streams.MockTimeTest > shouldSetStartTime PASSED
org.apache.kafka.streams.MockTimeTest > shouldNotAllowNegativeSleep STARTED
org.apache.kafka.streams.MockTimeTest > shouldNotAllowNegativeSleep PASSED
org.apache.kafka.streams.MockTimeTest > shouldAdvanceTimeOnSleep STARTED
org.apache.kafka.streams.MockTimeTest > shouldAdvanceTimeOnSleep PASSED
org.apache.kafka.streams.internals.WindowStoreFacadeTest > shouldReturnIsOpen STARTED
org.apache.kafka.streams.internals.WindowStoreFacadeTest > shouldReturnIsOpen PASSED
org.apache.kafka.streams.internals.WindowStoreFacadeTest > shouldReturnName STARTED
org.apache.kafka.streams.internals.WindowStoreFacadeTest > shouldReturnName PASSED
org.apache.kafka.streams.internals.WindowStoreFacadeTest > shouldPutWithUnknownTimestamp STARTED
org.apache.kafka.streams.internals.WindowStoreFacadeTest > shouldPutWithUnknownTimestamp PASSED
org.apache.kafka.streams.internals.WindowStoreFacadeTest > shouldPutWindowStartTimestampWithUnknownTimestamp STARTED
org.apache.kafka.streams.internals.WindowStoreFacadeTest > shouldPutWindowStartTimestampWithUnknownTimestamp PASSED
org.apache.kafka.streams.internals.WindowStoreFacadeTest > shouldReturnIsPersistent STARTED
org.apache.kafka.streams.internals.WindowStoreFacadeTest > shouldReturnIsPersistent PASSED
org.apache.kafka.streams.internals.WindowStoreFacadeTest > shouldForwardClose STARTED
org.apache.kafka.streams.internals.WindowStoreFacadeTest > shouldForwardClose PASSED
org.apache.kafka.streams.internals.WindowStoreFacadeTest > shouldForwardFlush STARTED
org.apache.kafka.streams.internals.WindowStoreFacadeTest > shouldForwardFlush PASSED
org.apache.kafka.streams.internals.WindowStoreFacadeTest > shouldForwardInit STARTED
org.apache.kafka.streams.internals.WindowStoreFacadeTest > shouldForwardInit PASSED
org.apache.kafka.streams.test.TestRecordTest > testConsumerRecord STARTED
org.apache.kafka.streams.test.TestRecordTest > testConsumerRecord PASSED
org.apache.kafka.streams.test.TestRecordTest > testToString STARTED
org.apache.kafka.streams.test.TestRecordTest > testToString PASSED
org.apache.kafka.streams.test.TestRecordTest > testInvalidRecords STARTED
org.apache.kafka.streams.test.TestRecordTest > testInvalidRecords PASSED
org.apache.kafka.streams.test.TestRecordTest > testPartialConstructorEquals STARTED
org.apache.kafka.streams.test.TestRecordTest > testPartialConstructorEquals PASSED
org.apache.kafka.streams.test.TestRecordTest > testMultiFieldMatcher STARTED
org.apache.kafka.streams.test.TestRecordTest > testMultiFieldMatcher PASSED
org.apache.kafka.streams.test.TestRecordTest > testFields STARTED
org.apache.kafka.streams.test.TestRecordTest > testFields PASSED
org.apache.kafka.streams.test.TestRecordTest > testProducerRecord STARTED
org.apache.kafka.streams.test.TestRecordTest > testProducerRecord PASSED
org.apache.kafka.streams.test.TestRecordTest > testEqualsAndHashCode STARTED
org.apache.kafka.streams.test.TestRecordTest > testEqualsAndHashCode PASSED
> Task :streams:upgrade-system-tests-10:compileJava NO-SOURCE
> Task :streams:upgrade-system-tests-10:processResources NO-SOURCE
> Task :streams:upgrade-system-tests-10:classes UP-TO-DATE
> Task :streams:upgrade-system-tests-10:checkstyleMain NO-SOURCE
> Task :streams:upgrade-system-tests-10:compileTestJava
> Task :streams:upgrade-system-tests-10:processTestResources NO-SOURCE
> Task :streams:upgrade-system-tests-10:testClasses
> Task :streams:upgrade-system-tests-10:checkstyleTest
> Task :streams:upgrade-system-tests-10:spotbugsMain NO-SOURCE
> Task :streams:upgrade-system-tests-10:test
> Task :streams:upgrade-system-tests-11:compileJava NO-SOURCE
> Task :streams:upgrade-system-tests-11:processResources NO-SOURCE
> Task :streams:upgrade-system-tests-11:classes UP-TO-DATE
> Task :streams:upgrade-system-tests-11:checkstyleMain NO-SOURCE
> Task :streams:upgrade-system-tests-11:compileTestJava
> Task :streams:upgrade-system-tests-11:processTestResources NO-SOURCE
> Task :streams:upgrade-system-tests-11:testClasses
> Task :streams:upgrade-system-tests-11:checkstyleTest
> Task :streams:upgrade-system-tests-11:spotbugsMain NO-SOURCE
> Task :streams:upgrade-system-tests-11:test
> Task :streams:upgrade-system-tests-20:compileJava NO-SOURCE
> Task :streams:upgrade-system-tests-20:processResources NO-SOURCE
> Task :streams:upgrade-system-tests-20:classes UP-TO-DATE
> Task :streams:upgrade-system-tests-20:checkstyleMain NO-SOURCE
> Task :streams:upgrade-system-tests-20:compileTestJava
> Task :streams:upgrade-system-tests-20:processTestResources NO-SOURCE
> Task :streams:upgrade-system-tests-20:testClasses
> Task :streams:upgrade-system-tests-20:checkstyleTest
> Task :streams:upgrade-system-tests-20:spotbugsMain NO-SOURCE
> Task :streams:upgrade-system-tests-20:test
> Task :streams:upgrade-system-tests-21:compileJava NO-SOURCE
> Task :streams:upgrade-system-tests-21:processResources NO-SOURCE
> Task :streams:upgrade-system-tests-21:classes UP-TO-DATE
> Task :streams:upgrade-system-tests-21:checkstyleMain NO-SOURCE
> Task :streams:upgrade-system-tests-21:compileTestJava
> Task :streams:upgrade-system-tests-21:processTestResources NO-SOURCE
> Task :streams:upgrade-system-tests-21:testClasses
> Task :streams:upgrade-system-tests-21:checkstyleTest
> Task :streams:upgrade-system-tests-21:spotbugsMain NO-SOURCE
> Task :streams:upgrade-system-tests-21:test
> Task :streams:upgrade-system-tests-22:compileJava NO-SOURCE
> Task :streams:upgrade-system-tests-22:processResources NO-SOURCE
> Task :streams:upgrade-system-tests-22:classes UP-TO-DATE
> Task :streams:upgrade-system-tests-22:checkstyleMain NO-SOURCE
> Task :streams:upgrade-system-tests-22:compileTestJava
> Task :streams:upgrade-system-tests-22:processTestResources NO-SOURCE
> Task :streams:upgrade-system-tests-22:testClasses
> Task :streams:upgrade-system-tests-22:checkstyleTest
> Task :streams:upgrade-system-tests-22:spotbugsMain NO-SOURCE
> Task :streams:upgrade-system-tests-22:test
> Task :streams:upgrade-system-tests-23:compileJava NO-SOURCE
> Task :streams:upgrade-system-tests-23:processResources NO-SOURCE
> Task :streams:upgrade-system-tests-23:classes UP-TO-DATE
> Task :streams:upgrade-system-tests-23:checkstyleMain NO-SOURCE
> Task :streams:upgrade-system-tests-23:compileTestJava
> Task :streams:upgrade-system-tests-23:processTestResources NO-SOURCE
> Task :streams:upgrade-system-tests-23:testClasses
> Task :streams:upgrade-system-tests-23:checkstyleTest
> Task :streams:upgrade-system-tests-23:spotbugsMain NO-SOURCE
> Task :streams:upgrade-system-tests-23:test
> Task :streams:upgrade-system-tests-24:compileJava NO-SOURCE
> Task :streams:upgrade-system-tests-24:processResources NO-SOURCE
> Task :streams:upgrade-system-tests-24:classes UP-TO-DATE
> Task :streams:upgrade-system-tests-24:checkstyleMain NO-SOURCE
> Task :streams:upgrade-system-tests-24:compileTestJava
> Task :streams:upgrade-system-tests-24:processTestResources NO-SOURCE
> Task :streams:upgrade-system-tests-24:testClasses
> Task :streams:upgrade-system-tests-24:checkstyleTest
> Task :streams:upgrade-system-tests-24:spotbugsMain NO-SOURCE
> Task :streams:upgrade-system-tests-24:test
> Task :streams:upgrade-system-tests-25:compileJava NO-SOURCE
> Task :streams:upgrade-system-tests-25:processResources NO-SOURCE
> Task :streams:upgrade-system-tests-25:classes UP-TO-DATE
> Task :streams:upgrade-system-tests-25:checkstyleMain NO-SOURCE
> Task :streams:upgrade-system-tests-25:compileTestJava
> Task :streams:upgrade-system-tests-25:processTestResources NO-SOURCE
> Task :streams:upgrade-system-tests-25:testClasses
> Task :streams:upgrade-system-tests-25:checkstyleTest
> Task :streams:upgrade-system-tests-25:spotbugsMain NO-SOURCE
> Task :streams:upgrade-system-tests-25:test
FAILURE: Build completed with 4 failures.
1: Task failed with an exception.
-----------
* What went wrong:
Execution failed for task ':core:test'.
> Process 'Gradle Test Executor 12' finished with non-zero exit value 1
This problem might be caused by incorrect test process configuration.
Please refer to the test execution section in the User Manual at https://docs.gradle.org/6.5/userguide/java_testing.html#sec:test_execution
* Try:
Run with --stacktrace option to get the stack trace. Run with --info or --debug option to get more log output. Run with --scan to get full insights.
==============================================================================
2: Task failed with an exception.
-----------
* What went wrong:
Execution failed for task ':streams:test'.
> Process 'Gradle Test Executor 21' finished with non-zero exit value 1
This problem might be caused by incorrect test process configuration.
Please refer to the test execution section in the User Manual at https://docs.gradle.org/6.5/userguide/java_testing.html#sec:test_execution
* Try:
Run with --stacktrace option to get the stack trace. Run with --info or --debug option to get more log output. Run with --scan to get full insights.
==============================================================================
3: Task failed with an exception.
-----------
* What went wrong:
Execution failed for task ':connect:mirror:test'.
> Process 'Gradle Test Executor 24' finished with non-zero exit value 1
This problem might be caused by incorrect test process configuration.
Please refer to the test execution section in the User Manual at https://docs.gradle.org/6.5/userguide/java_testing.html#sec:test_execution
* Try:
Run with --stacktrace option to get the stack trace. Run with --info or --debug option to get more log output. Run with --scan to get full insights.
==============================================================================
4: Task failed with an exception.
-----------
* What went wrong:
Execution failed for task ':streams:streams-scala:test'.
> Process 'Gradle Test Executor 33' finished with non-zero exit value 1
This problem might be caused by incorrect test process configuration.
Please refer to the test execution section in the User Manual at https://docs.gradle.org/6.5/userguide/java_testing.html#sec:test_execution
* Try:
Run with --stacktrace option to get the stack trace. Run with --info or --debug option to get more log output. Run with --scan to get full insights.
==============================================================================
* Get more help at https://help.gradle.org
Deprecated Gradle features were used in this build, making it incompatible with Gradle 7.0.
Use '--warning-mode all' to show the individual deprecation warnings.
See https://docs.gradle.org/6.5/userguide/command_line_interface.html#sec:command_line_warnings
BUILD FAILED in 25m 48s
215 actionable tasks: 183 executed, 32 up-to-date
Build step 'Execute shell' marked build as failure
[FINDBUGS] Collecting findbugs analysis files...
Setting GRADLE_4_10_3_HOME=/home/jenkins/tools/gradle/4.10.3
[FINDBUGS] Searching for all files in <https://builds.apache.org/job/kafka-trunk-jdk8/ws/> that match the pattern **/build/reports/*bugs/*.xml
[FINDBUGS] Parsing 19 files in <https://builds.apache.org/job/kafka-trunk-jdk8/ws/>
[FINDBUGS] Successfully parsed file <https://builds.apache.org/job/kafka-trunk-jdk8/ws/clients/build/reports/spotbugs/main.xml> with 0 unique warnings and 0 duplicates.
[FINDBUGS] Successfully parsed file <https://builds.apache.org/job/kafka-trunk-jdk8/ws/connect/api/build/reports/spotbugs/main.xml> with 0 unique warnings and 0 duplicates.
[FINDBUGS] Successfully parsed file <https://builds.apache.org/job/kafka-trunk-jdk8/ws/connect/basic-auth-extension/build/reports/spotbugs/main.xml> with 0 unique warnings and 0 duplicates.
[FINDBUGS] Successfully parsed file <https://builds.apache.org/job/kafka-trunk-jdk8/ws/connect/file/build/reports/spotbugs/main.xml> with 0 unique warnings and 0 duplicates.
[FINDBUGS] Successfully parsed file <https://builds.apache.org/job/kafka-trunk-jdk8/ws/connect/json/build/reports/spotbugs/main.xml> with 0 unique warnings and 0 duplicates.
[FINDBUGS] Successfully parsed file <https://builds.apache.org/job/kafka-trunk-jdk8/ws/connect/mirror-client/build/reports/spotbugs/main.xml> with 0 unique warnings and 0 duplicates.
[FINDBUGS] Successfully parsed file <https://builds.apache.org/job/kafka-trunk-jdk8/ws/connect/mirror/build/reports/spotbugs/main.xml> with 0 unique warnings and 0 duplicates.
[FINDBUGS] Successfully parsed file <https://builds.apache.org/job/kafka-trunk-jdk8/ws/connect/runtime/build/reports/spotbugs/main.xml> with 0 unique warnings and 0 duplicates.
[FINDBUGS] Successfully parsed file <https://builds.apache.org/job/kafka-trunk-jdk8/ws/connect/transforms/build/reports/spotbugs/main.xml> with 0 unique warnings and 0 duplicates.
[FINDBUGS] Successfully parsed file <https://builds.apache.org/job/kafka-trunk-jdk8/ws/core/build/reports/spotbugs/main.xml> with 0 unique warnings and 0 duplicates.
[FINDBUGS] Successfully parsed file <https://builds.apache.org/job/kafka-trunk-jdk8/ws/examples/build/reports/spotbugs/main.xml> with 0 unique warnings and 0 duplicates.
[FINDBUGS] Successfully parsed file <https://builds.apache.org/job/kafka-trunk-jdk8/ws/generator/build/reports/spotbugs/main.xml> with 0 unique warnings and 0 duplicates.
[FINDBUGS] Successfully parsed file <https://builds.apache.org/job/kafka-trunk-jdk8/ws/jmh-benchmarks/build/reports/spotbugs/main.xml> with 0 unique warnings and 0 duplicates.
[FINDBUGS] Successfully parsed file <https://builds.apache.org/job/kafka-trunk-jdk8/ws/log4j-appender/build/reports/spotbugs/main.xml> with 0 unique warnings and 0 duplicates.
[FINDBUGS] Successfully parsed file <https://builds.apache.org/job/kafka-trunk-jdk8/ws/streams/build/reports/spotbugs/main.xml> with 0 unique warnings and 0 duplicates.
[FINDBUGS] Successfully parsed file <https://builds.apache.org/job/kafka-trunk-jdk8/ws/streams/examples/build/reports/spotbugs/main.xml> with 0 unique warnings and 0 duplicates.
[FINDBUGS] Successfully parsed file <https://builds.apache.org/job/kafka-trunk-jdk8/ws/streams/streams-scala/build/reports/spotbugs/main.xml> with 0 unique warnings and 0 duplicates.
[FINDBUGS] Successfully parsed file <https://builds.apache.org/job/kafka-trunk-jdk8/ws/streams/test-utils/build/reports/spotbugs/main.xml> with 0 unique warnings and 0 duplicates.
[FINDBUGS] Successfully parsed file <https://builds.apache.org/job/kafka-trunk-jdk8/ws/tools/build/reports/spotbugs/main.xml> with 0 unique warnings and 0 duplicates.
Setting GRADLE_4_10_3_HOME=/home/jenkins/tools/gradle/4.10.3
No credentials specified
Setting GRADLE_4_10_3_HOME=/home/jenkins/tools/gradle/4.10.3
<Git Blamer> Using GitBlamer to create author and commit information for all warnings.
<Git Blamer> GIT_COMMIT=bcf45b09d34607d53e17d1f75a3097f3a8157903, workspace=<https://builds.apache.org/job/kafka-trunk-jdk8/ws/>
[FINDBUGS] Computing warning deltas based on reference build #4632
Recording test results
Setting GRADLE_4_10_3_HOME=/home/jenkins/tools/gradle/4.10.3
Setting GRADLE_4_10_3_HOME=/home/jenkins/tools/gradle/4.10.3
Not sending mail to unregistered user noreply@github.com