You are viewing a plain text version of this content. The canonical link for it is here.
Posted to builds@lucene.apache.org by Policeman Jenkins Server via builds <bu...@lucene.apache.org> on 2026/01/21 17:11:09 UTC

[JENKINS] Lucene-10.x-Linux (64bit/hotspot/jdk-22.0.2) - Build # 11751 - Unstable!

Build: https://jenkins.thetaphi.de/job/Lucene-10.x-Linux/11751/
Java: 64bit/hotspot/jdk-22.0.2 -XX:+UseCompressedOops -XX:+UseSerialGC

1 tests failed.
FAILED:  org.apache.lucene.search.TestBooleanRewrites.testRandom

Error Message:
java.lang.AssertionError: uTo = 5 < last target = 13

Stack Trace:
java.lang.AssertionError: uTo = 5 < last target = 13
	at __randomizedtesting.SeedInfo.seed([F71A6AD66A5217EC:85564FD9DB32A19F]:0)
	at org.apache.lucene.tests.search.AssertingScorer.getMaxScore(AssertingScorer.java:117)
	at org.apache.lucene.search.ReqExclScorer.getMaxScore(ReqExclScorer.java:85)
	at org.apache.lucene.tests.search.RandomApproximationQuery$RandomApproximationScorer.getMaxScore(RandomApproximationQuery.java:143)
	at org.apache.lucene.tests.search.AssertingScorer.getMaxScore(AssertingScorer.java:120)
	at org.apache.lucene.search.DisjunctionSumScorer.getMaxScore(DisjunctionSumScorer.java:65)
	at org.apache.lucene.search.ReqOptSumScorer.getMaxScore(ReqOptSumScorer.java:276)
	at org.apache.lucene.tests.search.RandomApproximationQuery$RandomApproximationScorer.getMaxScore(RandomApproximationQuery.java:143)
	at org.apache.lucene.tests.search.AssertingScorer.getMaxScore(AssertingScorer.java:120)
	at org.apache.lucene.search.MaxScoreBulkScorer.updateMaxWindowScores(MaxScoreBulkScorer.java:324)
	at org.apache.lucene.search.MaxScoreBulkScorer.score(MaxScoreBulkScorer.java:99)
	at org.apache.lucene.search.ReqExclBulkScorer.score(ReqExclBulkScorer.java:69)
	at org.apache.lucene.tests.search.AssertingBulkScorer.score(AssertingBulkScorer.java:79)
	at org.apache.lucene.search.IndexSearcher.searchLeaf(IndexSearcher.java:849)
	at org.apache.lucene.search.IndexSearcher.search(IndexSearcher.java:809)
	at org.apache.lucene.tests.search.AssertingIndexSearcher.search(AssertingIndexSearcher.java:77)
	at org.apache.lucene.search.IndexSearcher.lambda$search$1(IndexSearcher.java:779)
	at java.base/java.util.concurrent.FutureTask.run(FutureTask.java:317)
	at org.apache.lucene.search.TaskExecutor$Task.run(TaskExecutor.java:173)
	at org.apache.lucene.search.TaskExecutor.invokeAll(TaskExecutor.java:111)
	at org.apache.lucene.search.IndexSearcher.search(IndexSearcher.java:783)
	at org.apache.lucene.search.IndexSearcher.search(IndexSearcher.java:750)
	at org.apache.lucene.search.IndexSearcher.searchAfter(IndexSearcher.java:596)
	at org.apache.lucene.search.IndexSearcher.search(IndexSearcher.java:619)
	at org.apache.lucene.search.TestBooleanRewrites.testRandom(TestBooleanRewrites.java:476)
	at java.base/jdk.internal.reflect.DirectMethodHandleAccessor.invoke(DirectMethodHandleAccessor.java:103)
	at java.base/java.lang.reflect.Method.invoke(Method.java:580)
	at com.carrotsearch.randomizedtesting.RandomizedRunner.invoke(RandomizedRunner.java:1758)
	at com.carrotsearch.randomizedtesting.RandomizedRunner$8.evaluate(RandomizedRunner.java:946)
	at com.carrotsearch.randomizedtesting.RandomizedRunner$9.evaluate(RandomizedRunner.java:982)
	at com.carrotsearch.randomizedtesting.RandomizedRunner$10.evaluate(RandomizedRunner.java:996)
	at org.apache.lucene.tests.util.TestRuleSetupTeardownChained$1.evaluate(TestRuleSetupTeardownChained.java:48)
	at org.apache.lucene.tests.util.AbstractBeforeAfterRule$1.evaluate(AbstractBeforeAfterRule.java:43)
	at org.apache.lucene.tests.util.TestRuleThreadAndTestName$1.evaluate(TestRuleThreadAndTestName.java:45)
	at org.apache.lucene.tests.util.TestRuleIgnoreAfterMaxFailures$1.evaluate(TestRuleIgnoreAfterMaxFailures.java:60)
	at org.apache.lucene.tests.util.TestRuleMarkFailure$1.evaluate(TestRuleMarkFailure.java:44)
	at org.junit.rules.RunRules.evaluate(RunRules.java:20)
	at com.carrotsearch.randomizedtesting.rules.StatementAdapter.evaluate(StatementAdapter.java:36)
	at com.carrotsearch.randomizedtesting.ThreadLeakControl$StatementRunner.run(ThreadLeakControl.java:390)
	at com.carrotsearch.randomizedtesting.ThreadLeakControl.forkTimeoutingTask(ThreadLeakControl.java:843)
	at com.carrotsearch.randomizedtesting.ThreadLeakControl$3.evaluate(ThreadLeakControl.java:490)
	at com.carrotsearch.randomizedtesting.RandomizedRunner.runSingleTest(RandomizedRunner.java:955)
	at com.carrotsearch.randomizedtesting.RandomizedRunner$5.evaluate(RandomizedRunner.java:840)
	at com.carrotsearch.randomizedtesting.RandomizedRunner$6.evaluate(RandomizedRunner.java:891)
	at com.carrotsearch.randomizedtesting.RandomizedRunner$7.evaluate(RandomizedRunner.java:902)
	at org.apache.lucene.tests.util.AbstractBeforeAfterRule$1.evaluate(AbstractBeforeAfterRule.java:43)
	at com.carrotsearch.randomizedtesting.rules.StatementAdapter.evaluate(StatementAdapter.java:36)
	at org.apache.lucene.tests.util.TestRuleStoreClassName$1.evaluate(TestRuleStoreClassName.java:38)
	at com.carrotsearch.randomizedtesting.rules.NoShadowingOrOverridesOnMethodsRule$1.evaluate(NoShadowingOrOverridesOnMethodsRule.java:40)
	at com.carrotsearch.randomizedtesting.rules.NoShadowingOrOverridesOnMethodsRule$1.evaluate(NoShadowingOrOverridesOnMethodsRule.java:40)
	at com.carrotsearch.randomizedtesting.rules.StatementAdapter.evaluate(StatementAdapter.java:36)
	at com.carrotsearch.randomizedtesting.rules.StatementAdapter.evaluate(StatementAdapter.java:36)
	at org.apache.lucene.tests.util.TestRuleAssertionsRequired$1.evaluate(TestRuleAssertionsRequired.java:53)
	at org.apache.lucene.tests.util.AbstractBeforeAfterRule$1.evaluate(AbstractBeforeAfterRule.java:43)
	at org.apache.lucene.tests.util.TestRuleMarkFailure$1.evaluate(TestRuleMarkFailure.java:44)
	at org.apache.lucene.tests.util.TestRuleIgnoreAfterMaxFailures$1.evaluate(TestRuleIgnoreAfterMaxFailures.java:60)
	at org.apache.lucene.tests.util.TestRuleIgnoreTestSuites$1.evaluate(TestRuleIgnoreTestSuites.java:47)
	at org.junit.rules.RunRules.evaluate(RunRules.java:20)
	at com.carrotsearch.randomizedtesting.rules.StatementAdapter.evaluate(StatementAdapter.java:36)
	at com.carrotsearch.randomizedtesting.ThreadLeakControl$StatementRunner.run(ThreadLeakControl.java:390)
	at com.carrotsearch.randomizedtesting.ThreadLeakControl.lambda$forkTimeoutingTask$0(ThreadLeakControl.java:850)
	at java.base/java.lang.Thread.run(Thread.java:1570)