You are viewing a plain text version of this content. The canonical link for it is here.
Posted to dev@lucene.apache.org by Apache Jenkins Server <je...@builds.apache.org> on 2014/03/07 17:41:32 UTC

[JENKINS] Lucene-Solr-Tests-4.x-Java6 - Build # 2330 - Still Failing

Build: https://builds.apache.org/job/Lucene-Solr-Tests-4.x-Java6/2330/

All tests passed

Build Log:
[...truncated 3742 lines...]
    [javac] Compiling 20 source files to /usr/home/hudson/hudson-slave/workspace/Lucene-Solr-Tests-4.x-Java6/lucene/build/misc/classes/java
    [javac] /usr/home/hudson/hudson-slave/workspace/Lucene-Solr-Tests-4.x-Java6/lucene/misc/src/java/org/apache/lucene/index/sorter/Sorter.java:238: cannot find symbol
    [javac] symbol  : method compare(int,int)
    [javac] location: class java.lang.Integer
    [javac]           return Integer.compare(docID1, docID2); // docid order tiebreak
    [javac]                         ^
    [javac] Note: Some input files use or override a deprecated API.
    [javac] Note: Recompile with -Xlint:deprecation for details.
    [javac] 1 error

BUILD FAILED
/usr/home/hudson/hudson-slave/workspace/Lucene-Solr-Tests-4.x-Java6/build.xml:471: The following error occurred while executing this line:
/usr/home/hudson/hudson-slave/workspace/Lucene-Solr-Tests-4.x-Java6/build.xml:451: The following error occurred while executing this line:
/usr/home/hudson/hudson-slave/workspace/Lucene-Solr-Tests-4.x-Java6/build.xml:39: The following error occurred while executing this line:
/usr/home/hudson/hudson-slave/workspace/Lucene-Solr-Tests-4.x-Java6/extra-targets.xml:37: The following error occurred while executing this line:
/usr/home/hudson/hudson-slave/workspace/Lucene-Solr-Tests-4.x-Java6/lucene/build.xml:534: The following error occurred while executing this line:
/usr/home/hudson/hudson-slave/workspace/Lucene-Solr-Tests-4.x-Java6/lucene/common-build.xml:1998: The following error occurred while executing this line:
/usr/home/hudson/hudson-slave/workspace/Lucene-Solr-Tests-4.x-Java6/lucene/module-build.xml:57: The following error occurred while executing this line:
/usr/home/hudson/hudson-slave/workspace/Lucene-Solr-Tests-4.x-Java6/lucene/common-build.xml:471: The following error occurred while executing this line:
/usr/home/hudson/hudson-slave/workspace/Lucene-Solr-Tests-4.x-Java6/lucene/common-build.xml:1736: Compile failed; see the compiler error output for details.

Total time: 12 minutes 23 seconds
Build step 'Invoke Ant' marked build as failure
Archiving artifacts
Recording test results
Email was triggered for: Failure
Sending email for trigger: Failure



[JENKINS] Lucene-Solr-Tests-4.x-Java6 - Build # 2332 - Still Failing

Posted by Apache Jenkins Server <je...@builds.apache.org>.
Build: https://builds.apache.org/job/Lucene-Solr-Tests-4.x-Java6/2332/

1 tests failed.
FAILED:  org.apache.solr.morphlines.cell.SolrCellMorphlineTest.testSolrCellDocumentTypes2

Error Message:
key:ignored_creation_date expected:<[2007-10-01T16:13:56Z]> but was:<[]>

Stack Trace:
java.lang.AssertionError: key:ignored_creation_date expected:<[2007-10-01T16:13:56Z]> but was:<[]>
	at __randomizedtesting.SeedInfo.seed([D3DBC8532DD2F94B:585B73B32A246AB5]:0)
	at org.junit.Assert.fail(Assert.java:93)
	at org.junit.Assert.failNotEquals(Assert.java:647)
	at org.junit.Assert.assertEquals(Assert.java:128)
	at org.apache.solr.morphlines.solr.AbstractSolrMorphlineTestBase.testDocumentTypesInternal(AbstractSolrMorphlineTestBase.java:170)
	at org.apache.solr.morphlines.cell.SolrCellMorphlineTest.testSolrCellDocumentTypes2(SolrCellMorphlineTest.java:255)
	at sun.reflect.NativeMethodAccessorImpl.invoke0(Native Method)
	at sun.reflect.NativeMethodAccessorImpl.invoke(NativeMethodAccessorImpl.java:57)
	at sun.reflect.DelegatingMethodAccessorImpl.invoke(DelegatingMethodAccessorImpl.java:43)
	at java.lang.reflect.Method.invoke(Method.java:616)
	at com.carrotsearch.randomizedtesting.RandomizedRunner.invoke(RandomizedRunner.java:1559)
	at com.carrotsearch.randomizedtesting.RandomizedRunner.access$600(RandomizedRunner.java:79)
	at com.carrotsearch.randomizedtesting.RandomizedRunner$6.evaluate(RandomizedRunner.java:737)
	at com.carrotsearch.randomizedtesting.RandomizedRunner$7.evaluate(RandomizedRunner.java:773)
	at com.carrotsearch.randomizedtesting.RandomizedRunner$8.evaluate(RandomizedRunner.java:787)
	at com.carrotsearch.randomizedtesting.rules.SystemPropertiesRestoreRule$1.evaluate(SystemPropertiesRestoreRule.java:53)
	at org.apache.lucene.util.TestRuleSetupTeardownChained$1.evaluate(TestRuleSetupTeardownChained.java:50)
	at org.apache.lucene.util.TestRuleFieldCacheSanity$1.evaluate(TestRuleFieldCacheSanity.java:51)
	at org.apache.lucene.util.AbstractBeforeAfterRule$1.evaluate(AbstractBeforeAfterRule.java:46)
	at com.carrotsearch.randomizedtesting.rules.SystemPropertiesInvariantRule$1.evaluate(SystemPropertiesInvariantRule.java:55)
	at org.apache.lucene.util.TestRuleThreadAndTestName$1.evaluate(TestRuleThreadAndTestName.java:49)
	at org.apache.lucene.util.TestRuleIgnoreAfterMaxFailures$1.evaluate(TestRuleIgnoreAfterMaxFailures.java:70)
	at org.apache.lucene.util.TestRuleMarkFailure$1.evaluate(TestRuleMarkFailure.java:48)
	at com.carrotsearch.randomizedtesting.rules.StatementAdapter.evaluate(StatementAdapter.java:36)
	at com.carrotsearch.randomizedtesting.ThreadLeakControl$StatementRunner.run(ThreadLeakControl.java:358)
	at com.carrotsearch.randomizedtesting.ThreadLeakControl.forkTimeoutingTask(ThreadLeakControl.java:782)
	at com.carrotsearch.randomizedtesting.ThreadLeakControl$3.evaluate(ThreadLeakControl.java:442)
	at com.carrotsearch.randomizedtesting.RandomizedRunner.runSingleTest(RandomizedRunner.java:746)
	at com.carrotsearch.randomizedtesting.RandomizedRunner$3.evaluate(RandomizedRunner.java:648)
	at com.carrotsearch.randomizedtesting.RandomizedRunner$4.evaluate(RandomizedRunner.java:682)
	at com.carrotsearch.randomizedtesting.RandomizedRunner$5.evaluate(RandomizedRunner.java:693)
	at com.carrotsearch.randomizedtesting.rules.StatementAdapter.evaluate(StatementAdapter.java:36)
	at com.carrotsearch.randomizedtesting.rules.SystemPropertiesRestoreRule$1.evaluate(SystemPropertiesRestoreRule.java:53)
	at org.apache.lucene.util.AbstractBeforeAfterRule$1.evaluate(AbstractBeforeAfterRule.java:46)
	at org.apache.lucene.util.TestRuleStoreClassName$1.evaluate(TestRuleStoreClassName.java:42)
	at com.carrotsearch.randomizedtesting.rules.SystemPropertiesInvariantRule$1.evaluate(SystemPropertiesInvariantRule.java:55)
	at com.carrotsearch.randomizedtesting.rules.NoShadowingOrOverridesOnMethodsRule$1.evaluate(NoShadowingOrOverridesOnMethodsRule.java:39)
	at com.carrotsearch.randomizedtesting.rules.NoShadowingOrOverridesOnMethodsRule$1.evaluate(NoShadowingOrOverridesOnMethodsRule.java:39)
	at com.carrotsearch.randomizedtesting.rules.StatementAdapter.evaluate(StatementAdapter.java:36)
	at org.apache.lucene.util.TestRuleAssertionsRequired$1.evaluate(TestRuleAssertionsRequired.java:43)
	at org.apache.lucene.util.TestRuleMarkFailure$1.evaluate(TestRuleMarkFailure.java:48)
	at org.apache.lucene.util.TestRuleIgnoreAfterMaxFailures$1.evaluate(TestRuleIgnoreAfterMaxFailures.java:70)
	at org.apache.lucene.util.TestRuleIgnoreTestSuites$1.evaluate(TestRuleIgnoreTestSuites.java:55)
	at com.carrotsearch.randomizedtesting.rules.StatementAdapter.evaluate(StatementAdapter.java:36)
	at com.carrotsearch.randomizedtesting.ThreadLeakControl$StatementRunner.run(ThreadLeakControl.java:358)
	at java.lang.Thread.run(Thread.java:679)




Build Log:
[...truncated 17731 lines...]
   [junit4] Suite: org.apache.solr.morphlines.cell.SolrCellMorphlineTest
   [junit4]   2> log4j:WARN No such property [conversionPattern] in org.apache.solr.util.SolrLogLayout.
   [junit4]   2> 2292 T10 oas.SolrTestCaseJ4.buildSSLConfig Randomized ssl (true) and clientAuth (true)
   [junit4]   2> 2410 T10 oas.SolrTestCaseJ4.initCore ####initCore
   [junit4]   2> Creating dataDir: /usr/home/hudson/hudson-slave/workspace/Lucene-Solr-Tests-4.x-Java6/solr/build/contrib/solr-morphlines-cell/test/J0/./solrtest-SolrCellMorphlineTest-1394349807886
   [junit4]   2> 2515 T10 oasc.SolrResourceLoader.<init> new SolrResourceLoader for directory: '/usr/home/hudson/hudson-slave/workspace/Lucene-Solr-Tests-4.x-Java6/solr/contrib/morphlines-core/src/test-files/solr/collection1/'
   [junit4]   2> 4509 T10 oasc.SolrConfig.initLibs Adding specified lib dirs to ClassLoader
   [junit4]   2> 4514 T10 oasc.SolrResourceLoader.addToClassLoader WARN Can't find (or read) directory to add to classloader: ../../../contrib/extraction/lib (resolved as: /usr/home/hudson/hudson-slave/workspace/Lucene-Solr-Tests-4.x-Java6/solr/contrib/morphlines-core/src/test-files/solr/collection1/../../../contrib/extraction/lib).
   [junit4]   2> 4515 T10 oasc.SolrResourceLoader.addToClassLoader WARN Can't find (or read) directory to add to classloader: ../../../dist/ (resolved as: /usr/home/hudson/hudson-slave/workspace/Lucene-Solr-Tests-4.x-Java6/solr/contrib/morphlines-core/src/test-files/solr/collection1/../../../dist).
   [junit4]   2> 4517 T10 oasc.SolrResourceLoader.addToClassLoader WARN Can't find (or read) directory to add to classloader: ../../../contrib/clustering/lib/ (resolved as: /usr/home/hudson/hudson-slave/workspace/Lucene-Solr-Tests-4.x-Java6/solr/contrib/morphlines-core/src/test-files/solr/collection1/../../../contrib/clustering/lib).
   [junit4]   2> 4517 T10 oasc.SolrResourceLoader.addToClassLoader WARN Can't find (or read) directory to add to classloader: ../../../dist/ (resolved as: /usr/home/hudson/hudson-slave/workspace/Lucene-Solr-Tests-4.x-Java6/solr/contrib/morphlines-core/src/test-files/solr/collection1/../../../dist).
   [junit4]   2> 4519 T10 oasc.SolrResourceLoader.addToClassLoader WARN Can't find (or read) directory to add to classloader: ../../../contrib/langid/lib/ (resolved as: /usr/home/hudson/hudson-slave/workspace/Lucene-Solr-Tests-4.x-Java6/solr/contrib/morphlines-core/src/test-files/solr/collection1/../../../contrib/langid/lib).
   [junit4]   2> 4519 T10 oasc.SolrResourceLoader.addToClassLoader WARN Can't find (or read) directory to add to classloader: ../../../dist/ (resolved as: /usr/home/hudson/hudson-slave/workspace/Lucene-Solr-Tests-4.x-Java6/solr/contrib/morphlines-core/src/test-files/solr/collection1/../../../dist).
   [junit4]   2> 4521 T10 oasc.SolrResourceLoader.addToClassLoader WARN Can't find (or read) directory to add to classloader: ../../../contrib/velocity/lib (resolved as: /usr/home/hudson/hudson-slave/workspace/Lucene-Solr-Tests-4.x-Java6/solr/contrib/morphlines-core/src/test-files/solr/collection1/../../../contrib/velocity/lib).
   [junit4]   2> 4521 T10 oasc.SolrResourceLoader.addToClassLoader WARN Can't find (or read) directory to add to classloader: ../../../dist/ (resolved as: /usr/home/hudson/hudson-slave/workspace/Lucene-Solr-Tests-4.x-Java6/solr/contrib/morphlines-core/src/test-files/solr/collection1/../../../dist).
   [junit4]   2> 4522 T10 oasc.SolrResourceLoader.addToClassLoader WARN Can't find (or read) directory to add to classloader: /non/existent/dir/yields/warning (resolved as: /non/existent/dir/yields/warning).
   [junit4]   2> 4755 T10 oasc.SolrConfig.<init> Using Lucene MatchVersion: LUCENE_43
   [junit4]   2> 5184 T10 oasc.SolrConfig.<init> Loaded SolrConfig: solrconfig.xml
   [junit4]   2> 5209 T10 oass.IndexSchema.readSchema Reading Solr Schema from schema.xml
   [junit4]   2> 5302 T10 oass.IndexSchema.readSchema [null] Schema name=example
   [junit4]   2> 7096 T10 oass.IndexSchema.readSchema unique key field: id
   [junit4]   2> 7779 T10 oass.FileExchangeRateProvider.reload Reloading exchange rates from file currency.xml
   [junit4]   2> 7807 T10 oass.FileExchangeRateProvider.reload Reloading exchange rates from file currency.xml
   [junit4]   2> 8033 T10 oasc.SolrResourceLoader.locateSolrHome JNDI not configured for solr (NoInitialContextEx)
   [junit4]   2> 8034 T10 oasc.SolrResourceLoader.locateSolrHome using system property solr.solr.home: /usr/home/hudson/hudson-slave/workspace/Lucene-Solr-Tests-4.x-Java6/solr/contrib/morphlines-core/src/test-files/solr
   [junit4]   2> 8035 T10 oasc.SolrResourceLoader.<init> new SolrResourceLoader for directory: '/usr/home/hudson/hudson-slave/workspace/Lucene-Solr-Tests-4.x-Java6/solr/contrib/morphlines-core/src/test-files/solr/'
   [junit4]   2> 8305 T10 oasc.CoreContainer.<init> New CoreContainer 1294965028
   [junit4]   2> 8305 T10 oasc.CoreContainer.load Loading cores into CoreContainer [instanceDir=/usr/home/hudson/hudson-slave/workspace/Lucene-Solr-Tests-4.x-Java6/solr/contrib/morphlines-core/src/test-files/solr/]
   [junit4]   2> 8383 T10 oashc.HttpShardHandlerFactory.getParameter Setting socketTimeout to: 0
   [junit4]   2> 8383 T10 oashc.HttpShardHandlerFactory.getParameter Setting urlScheme to: null
   [junit4]   2> 8393 T10 oashc.HttpShardHandlerFactory.getParameter Setting connTimeout to: 0
   [junit4]   2> 8393 T10 oashc.HttpShardHandlerFactory.getParameter Setting maxConnectionsPerHost to: 20
   [junit4]   2> 8394 T10 oashc.HttpShardHandlerFactory.getParameter Setting corePoolSize to: 0
   [junit4]   2> 8394 T10 oashc.HttpShardHandlerFactory.getParameter Setting maximumPoolSize to: 2147483647
   [junit4]   2> 8395 T10 oashc.HttpShardHandlerFactory.getParameter Setting maxThreadIdleTime to: 5
   [junit4]   2> 8395 T10 oashc.HttpShardHandlerFactory.getParameter Setting sizeOfQueue to: -1
   [junit4]   2> 8396 T10 oashc.HttpShardHandlerFactory.getParameter Setting fairnessPolicy to: false
   [junit4]   2> 9063 T10 oasl.LogWatcher.createWatcher SLF4J impl is org.slf4j.impl.Log4jLoggerFactory
   [junit4]   2> 9068 T10 oasl.LogWatcher.newRegisteredLogWatcher Registering Log Listener [Log4j (org.slf4j.impl.Log4jLoggerFactory)]
   [junit4]   2> 9075 T10 oasc.CoreContainer.load Host Name: 
   [junit4]   2> 9483 T11 oasc.CoreContainer.create Creating SolrCore 'collection1' using instanceDir: /usr/home/hudson/hudson-slave/workspace/Lucene-Solr-Tests-4.x-Java6/solr/contrib/morphlines-core/src/test-files/solr/collection1
   [junit4]   2> 9484 T11 oasc.SolrResourceLoader.<init> new SolrResourceLoader for directory: '/usr/home/hudson/hudson-slave/workspace/Lucene-Solr-Tests-4.x-Java6/solr/contrib/morphlines-core/src/test-files/solr/collection1/'
   [junit4]   2> 9654 T11 oasc.SolrConfig.initLibs Adding specified lib dirs to ClassLoader
   [junit4]   2> 9656 T11 oasc.SolrResourceLoader.addToClassLoader WARN Can't find (or read) directory to add to classloader: ../../../contrib/extraction/lib (resolved as: /usr/home/hudson/hudson-slave/workspace/Lucene-Solr-Tests-4.x-Java6/solr/contrib/morphlines-core/src/test-files/solr/collection1/../../../contrib/extraction/lib).
   [junit4]   2> 9658 T11 oasc.SolrResourceLoader.addToClassLoader WARN Can't find (or read) directory to add to classloader: ../../../dist/ (resolved as: /usr/home/hudson/hudson-slave/workspace/Lucene-Solr-Tests-4.x-Java6/solr/contrib/morphlines-core/src/test-files/solr/collection1/../../../dist).
   [junit4]   2> 9659 T11 oasc.SolrResourceLoader.addToClassLoader WARN Can't find (or read) directory to add to classloader: ../../../contrib/clustering/lib/ (resolved as: /usr/home/hudson/hudson-slave/workspace/Lucene-Solr-Tests-4.x-Java6/solr/contrib/morphlines-core/src/test-files/solr/collection1/../../../contrib/clustering/lib).
   [junit4]   2> 9660 T11 oasc.SolrResourceLoader.addToClassLoader WARN Can't find (or read) directory to add to classloader: ../../../dist/ (resolved as: /usr/home/hudson/hudson-slave/workspace/Lucene-Solr-Tests-4.x-Java6/solr/contrib/morphlines-core/src/test-files/solr/collection1/../../../dist).
   [junit4]   2> 9662 T11 oasc.SolrResourceLoader.addToClassLoader WARN Can't find (or read) directory to add to classloader: ../../../contrib/langid/lib/ (resolved as: /usr/home/hudson/hudson-slave/workspace/Lucene-Solr-Tests-4.x-Java6/solr/contrib/morphlines-core/src/test-files/solr/collection1/../../../contrib/langid/lib).
   [junit4]   2> 9663 T11 oasc.SolrResourceLoader.addToClassLoader WARN Can't find (or read) directory to add to classloader: ../../../dist/ (resolved as: /usr/home/hudson/hudson-slave/workspace/Lucene-Solr-Tests-4.x-Java6/solr/contrib/morphlines-core/src/test-files/solr/collection1/../../../dist).
   [junit4]   2> 9664 T11 oasc.SolrResourceLoader.addToClassLoader WARN Can't find (or read) directory to add to classloader: ../../../contrib/velocity/lib (resolved as: /usr/home/hudson/hudson-slave/workspace/Lucene-Solr-Tests-4.x-Java6/solr/contrib/morphlines-core/src/test-files/solr/collection1/../../../contrib/velocity/lib).
   [junit4]   2> 9665 T11 oasc.SolrResourceLoader.addToClassLoader WARN Can't find (or read) directory to add to classloader: ../../../dist/ (resolved as: /usr/home/hudson/hudson-slave/workspace/Lucene-Solr-Tests-4.x-Java6/solr/contrib/morphlines-core/src/test-files/solr/collection1/../../../dist).
   [junit4]   2> 9666 T11 oasc.SolrResourceLoader.addToClassLoader WARN Can't find (or read) directory to add to classloader: /non/existent/dir/yields/warning (resolved as: /non/existent/dir/yields/warning).
   [junit4]   2> 9770 T11 oasc.SolrConfig.<init> Using Lucene MatchVersion: LUCENE_43
   [junit4]   2> 9925 T11 oasc.SolrConfig.<init> Loaded SolrConfig: solrconfig.xml
   [junit4]   2> 9928 T11 oass.IndexSchema.readSchema Reading Solr Schema from schema.xml
   [junit4]   2> 10009 T11 oass.IndexSchema.readSchema [collection1] Schema name=example
   [junit4]   2> 11006 T11 oass.IndexSchema.readSchema unique key field: id
   [junit4]   2> 11049 T11 oass.FileExchangeRateProvider.reload Reloading exchange rates from file currency.xml
   [junit4]   2> 11063 T11 oass.FileExchangeRateProvider.reload Reloading exchange rates from file currency.xml
   [junit4]   2> 11375 T11 oasc.SolrCore.initDirectoryFactory org.apache.solr.core.MockDirectoryFactory
   [junit4]   2> 11433 T11 oasc.SolrCore.<init> [collection1] Opening new SolrCore at /usr/home/hudson/hudson-slave/workspace/Lucene-Solr-Tests-4.x-Java6/solr/contrib/morphlines-core/src/test-files/solr/collection1/, dataDir=/usr/home/hudson/hudson-slave/workspace/Lucene-Solr-Tests-4.x-Java6/solr/build/contrib/solr-morphlines-cell/test/J0/./solrtest-SolrCellMorphlineTest-1394349807886/
   [junit4]   2> 11440 T11 oasc.JmxMonitoredMap.<init> No JMX servers found, not exposing Solr information with JMX.
   [junit4]   2> 11528 T11 oasc.SolrCore.initListeners [collection1] Added SolrEventListener for newSearcher: org.apache.solr.core.QuerySenderListener{queries=[]}
   [junit4]   2> 11529 T11 oasc.SolrCore.initListeners [collection1] Added SolrEventListener for firstSearcher: org.apache.solr.core.QuerySenderListener{queries=[{q=static firstSearcher warming in solrconfig.xml}]}
   [junit4]   2> 11724 T11 oasc.CachingDirectoryFactory.get return new directory for /usr/home/hudson/hudson-slave/workspace/Lucene-Solr-Tests-4.x-Java6/solr/build/contrib/solr-morphlines-cell/test/J0/./solrtest-SolrCellMorphlineTest-1394349807886
   [junit4]   2> 11724 T11 oasc.SolrCore.getNewIndexDir New index directory detected: old=null new=/usr/home/hudson/hudson-slave/workspace/Lucene-Solr-Tests-4.x-Java6/solr/build/contrib/solr-morphlines-cell/test/J0/./solrtest-SolrCellMorphlineTest-1394349807886/index/
   [junit4]   2> 11725 T11 oasc.SolrCore.initIndex WARN [collection1] Solr index directory '/usr/home/hudson/hudson-slave/workspace/Lucene-Solr-Tests-4.x-Java6/solr/build/contrib/solr-morphlines-cell/test/J0/./solrtest-SolrCellMorphlineTest-1394349807886/index' doesn't exist. Creating new index...
   [junit4]   2> 11746 T11 oasc.CachingDirectoryFactory.get return new directory for /usr/home/hudson/hudson-slave/workspace/Lucene-Solr-Tests-4.x-Java6/solr/build/contrib/solr-morphlines-cell/test/J0/./solrtest-SolrCellMorphlineTest-1394349807886/index
   [junit4]   2> 11984 T11 oasc.SolrDeletionPolicy.onCommit SolrDeletionPolicy.onCommit: commits: num=1
   [junit4]   2> 		commit{dir=BaseDirectoryWrapper(RAMDirectory@7c40627c lockFactory=NativeFSLockFactory@/usr/home/hudson/hudson-slave/workspace/Lucene-Solr-Tests-4.x-Java6/solr/build/contrib/solr-morphlines-cell/test/J0/./solrtest-SolrCellMorphlineTest-1394349807886/index),segFN=segments_1,generation=1}
   [junit4]   2> 11990 T11 oasc.SolrDeletionPolicy.updateCommits newest commit generation = 1
   [junit4]   2> 12065 T11 oasc.SolrCore.initWriters created json: solr.JSONResponseWriter
   [junit4]   2> 12066 T11 oasc.SolrCore.initWriters adding lazy queryResponseWriter: solr.VelocityResponseWriter
   [junit4]   2> 12072 T11 oasc.SolrCore.initWriters created velocity: solr.VelocityResponseWriter
   [junit4]   2> 12151 T11 oasc.SolrCore.initWriters created xslt: solr.XSLTResponseWriter
   [junit4]   2> 12152 T11 oasr.XSLTResponseWriter.init xsltCacheLifetimeSeconds=5
   [junit4]   2> 13503 T11 oasc.SolrCore.loadUpdateProcessorChains no updateRequestProcessorChain defined as default, creating implicit default
   [junit4]   2> 13632 T11 oasc.RequestHandlers.initHandlersFromConfig created /select: solr.SearchHandler
   [junit4]   2> 13632 T11 oasc.RequestHandlers.initHandlersFromConfig created /query: solr.SearchHandler
   [junit4]   2> 13658 T11 oasc.RequestHandlers.initHandlersFromConfig created /get: solr.RealTimeGetHandler
   [junit4]   2> 13659 T11 oasc.RequestHandlers.initHandlersFromConfig created /browse: solr.SearchHandler
   [junit4]   2> 13695 T11 oasc.RequestHandlers.initHandlersFromConfig created /update: solr.UpdateRequestHandler
   [junit4]   2> 13721 T11 oasc.SolrResourceLoader.findClass WARN Solr loaded a deprecated plugin/analysis class [solr.JsonUpdateRequestHandler]. Please consult documentation how to replace it accordingly.
   [junit4]   2> 13722 T11 oasc.RequestHandlers.initHandlersFromConfig created /update/json: solr.JsonUpdateRequestHandler
   [junit4]   2> 13747 T11 oasc.SolrResourceLoader.findClass WARN Solr loaded a deprecated plugin/analysis class [solr.CSVRequestHandler]. Please consult documentation how to replace it accordingly.
   [junit4]   2> 13748 T11 oasc.RequestHandlers.initHandlersFromConfig created /update/csv: solr.CSVRequestHandler
   [junit4]   2> 13748 T11 oasc.RequestHandlers.initHandlersFromConfig adding lazy requestHandler: solr.FieldAnalysisRequestHandler
   [junit4]   2> 13752 T11 oasc.RequestHandlers.initHandlersFromConfig created /analysis/field: solr.FieldAnalysisRequestHandler
   [junit4]   2> 13752 T11 oasc.RequestHandlers.initHandlersFromConfig adding lazy requestHandler: solr.DocumentAnalysisRequestHandler
   [junit4]   2> 13753 T11 oasc.RequestHandlers.initHandlersFromConfig created /analysis/document: solr.DocumentAnalysisRequestHandler
   [junit4]   2> 13785 T11 oasc.RequestHandlers.initHandlersFromConfig created /admin/: solr.admin.AdminHandlers
   [junit4]   2> 13811 T11 oasc.RequestHandlers.initHandlersFromConfig created /admin/ping: solr.PingRequestHandler
   [junit4]   2> 13837 T11 oasc.RequestHandlers.initHandlersFromConfig created /debug/dump: solr.DumpRequestHandler
   [junit4]   2> 13884 T11 oasc.RequestHandlers.initHandlersFromConfig created /replication: solr.ReplicationHandler
   [junit4]   2> 13884 T11 oasc.RequestHandlers.initHandlersFromConfig adding lazy requestHandler: solr.SearchHandler
   [junit4]   2> 13885 T11 oasc.RequestHandlers.initHandlersFromConfig created /spell: solr.SearchHandler
   [junit4]   2> 13885 T11 oasc.RequestHandlers.initHandlersFromConfig adding lazy requestHandler: solr.SearchHandler
   [junit4]   2> 13886 T11 oasc.RequestHandlers.initHandlersFromConfig created /tvrh: solr.SearchHandler
   [junit4]   2> 13886 T11 oasc.RequestHandlers.initHandlersFromConfig adding lazy requestHandler: solr.SearchHandler
   [junit4]   2> 13886 T11 oasc.RequestHandlers.initHandlersFromConfig created /terms: solr.SearchHandler
   [junit4]   2> 13887 T11 oasc.RequestHandlers.initHandlersFromConfig adding lazy requestHandler: solr.SearchHandler
   [junit4]   2> 13887 T11 oasc.RequestHandlers.initHandlersFromConfig created /elevate: solr.SearchHandler
   [junit4]   2> 14027 T11 oashl.XMLLoader.init xsltCacheLifetimeSeconds=60
   [junit4]   2> 14048 T11 oashl.XMLLoader.init xsltCacheLifetimeSeconds=60
   [junit4]   2> 14050 T11 oashl.XMLLoader.init xsltCacheLifetimeSeconds=60
   [junit4]   2> 14150 T11 oasu.CommitTracker.<init> Hard AutoCommit: if uncommited for 60000ms; 
   [junit4]   2> 14151 T11 oasu.CommitTracker.<init> Soft AutoCommit: if uncommited for 1000ms; 
   [junit4]   2> 14153 T11 oasc.SolrDeletionPolicy.onInit SolrDeletionPolicy.onInit: commits: num=1
   [junit4]   2> 		commit{dir=BaseDirectoryWrapper(RAMDirectory@7c40627c lockFactory=NativeFSLockFactory@/usr/home/hudson/hudson-slave/workspace/Lucene-Solr-Tests-4.x-Java6/solr/build/contrib/solr-morphlines-cell/test/J0/./solrtest-SolrCellMorphlineTest-1394349807886/index),segFN=segments_1,generation=1}
   [junit4]   2> 14153 T11 oasc.SolrDeletionPolicy.updateCommits newest commit generation = 1
   [junit4]   2> 14207 T11 oass.SolrIndexSearcher.<init> Opening Searcher@3aeebf17[collection1] main
   [junit4]   2> 14245 T11 oashc.SpellCheckComponent.inform Initializing spell checkers
   [junit4]   2> 14346 T11 oass.DirectSolrSpellChecker.init init: {name=default,field=name,classname=solr.DirectSolrSpellChecker,distanceMeasure=internal,accuracy=0.5,maxEdits=2,minPrefix=1,maxInspections=5,minQueryLength=4,maxQueryFrequency=0.01}
   [junit4]   2> 14443 T11 oashc.SpellCheckComponent.inform No queryConverter defined, using default converter
   [junit4]   2> 14460 T11 oashc.QueryElevationComponent.inform Loading QueryElevation from: /usr/home/hudson/hudson-slave/workspace/Lucene-Solr-Tests-4.x-Java6/solr/contrib/morphlines-core/src/test-files/solr/collection1/conf/elevate.xml
   [junit4]   2> 14727 T11 oash.ReplicationHandler.inform Commits will be reserved for  10000
   [junit4]   2> 14728 T12 oasc.QuerySenderListener.newSearcher QuerySenderListener sending requests to Searcher@3aeebf17[collection1] main{StandardDirectoryReader(segments_1:1:nrt)}
   [junit4]   2> 14732 T11 oasc.CoreContainer.registerCore registering core: collection1
   [junit4]   2> 14779 T10 oas.SolrTestCaseJ4.initCore ####initCore end
   [junit4]   2> 14953 T10 oas.SolrTestCaseJ4.setUp ###Starting testSolrCellDocumentTypes2
   [junit4]   2> ASYNC  NEW_CORE C0 name=collection1 org.apache.solr.core.SolrCore@520b1684
   [junit4]   2> 15659 T12 C0 oasc.SolrCore.execute [collection1] webapp=null path=null params={event=firstSearcher&q=static+firstSearcher+warming+in+solrconfig.xml&distrib=false} hits=0 status=0 QTime=905 
   [junit4]   2> 15697 T12 oasc.QuerySenderListener.newSearcher QuerySenderListener done.
   [junit4]   2> 15698 T12 oashc.SpellCheckComponent$SpellCheckerListener.newSearcher Loading spell index for spellchecker: default
   [junit4]   2> 15698 T12 oashc.SpellCheckComponent$SpellCheckerListener.newSearcher Loading spell index for spellchecker: wordbreak
   [junit4]   2> 15699 T12 oasc.SolrCore.registerSearcher [collection1] Registered new searcher Searcher@3aeebf17[collection1] main{StandardDirectoryReader(segments_1:1:nrt)}
   [junit4]   2> 16240 T10 C0 oasup.LogUpdateProcessor.finish [collection1] webapp=null path=/update params={} {deleteByQuery=*:* (-1462081758108319744)} 0 1145
   [junit4]   2> 16251 T10 C0 oasu.DirectUpdateHandler2.commit start commit{,optimize=false,openSearcher=true,waitSearcher=true,expungeDeletes=false,softCommit=false,prepareCommit=false}
   [junit4]   2> 16253 T10 C0 oasu.DirectUpdateHandler2.commit No uncommitted changes. Skipping IW.commit.
   [junit4]   2> 16255 T10 C0 oasc.SolrCore.openNewSearcher SolrIndexSearcher has not changed - not re-opening: org.apache.solr.search.SolrIndexSearcher
   [junit4]   2> 16256 T12 oasc.SolrCore.registerSearcher [collection1] Registered new searcher Searcher@3aeebf17[collection1] main{StandardDirectoryReader(segments_1:1:nrt)}
   [junit4]   2> 16256 T10 C0 oasu.DirectUpdateHandler2.commit end_commit_flush
   [junit4]   2> 16258 T10 C0 oasup.LogUpdateProcessor.finish [collection1] webapp=null path=/update params={commit=true&softCommit=false&waitSearcher=true} {commit=} 0 8
   [junit4]   2> 17232 T10 okma.MorphlineContext.importCommandBuilders Importing commands
   [junit4]   2> 21769 T10 okma.MorphlineContext.importCommandBuilders Done importing commands
   [junit4]   2> 27969 T10 oasc.SolrResourceLoader.<init> new SolrResourceLoader for directory: '/usr/home/hudson/hudson-slave/workspace/Lucene-Solr-Tests-4.x-Java6/solr/contrib/morphlines-core/src/test-files/solr/collection1/'
   [junit4]   2> 28069 T10 oasc.SolrConfig.initLibs Adding specified lib dirs to ClassLoader
   [junit4]   2> 28071 T10 oasc.SolrResourceLoader.addToClassLoader WARN Can't find (or read) directory to add to classloader: ../../../contrib/extraction/lib (resolved as: /usr/home/hudson/hudson-slave/workspace/Lucene-Solr-Tests-4.x-Java6/solr/contrib/morphlines-core/src/test-files/solr/collection1/../../../contrib/extraction/lib).
   [junit4]   2> 28072 T10 oasc.SolrResourceLoader.addToClassLoader WARN Can't find (or read) directory to add to classloader: ../../../dist/ (resolved as: /usr/home/hudson/hudson-slave/workspace/Lucene-Solr-Tests-4.x-Java6/solr/contrib/morphlines-core/src/test-files/solr/collection1/../../../dist).
   [junit4]   2> 28074 T10 oasc.SolrResourceLoader.addToClassLoader WARN Can't find (or read) directory to add to classloader: ../../../contrib/clustering/lib/ (resolved as: /usr/home/hudson/hudson-slave/workspace/Lucene-Solr-Tests-4.x-Java6/solr/contrib/morphlines-core/src/test-files/solr/collection1/../../../contrib/clustering/lib).
   [junit4]   2> 28074 T10 oasc.SolrResourceLoader.addToClassLoader WARN Can't find (or read) directory to add to classloader: ../../../dist/ (resolved as: /usr/home/hudson/hudson-slave/workspace/Lucene-Solr-Tests-4.x-Java6/solr/contrib/morphlines-core/src/test-files/solr/collection1/../../../dist).
   [junit4]   2> 28076 T10 oasc.SolrResourceLoader.addToClassLoader WARN Can't find (or read) directory to add to classloader: ../../../contrib/langid/lib/ (resolved as: /usr/home/hudson/hudson-slave/workspace/Lucene-Solr-Tests-4.x-Java6/solr/contrib/morphlines-core/src/test-files/solr/collection1/../../../contrib/langid/lib).
   [junit4]   2> 28077 T10 oasc.SolrResourceLoader.addToClassLoader WARN Can't find (or read) directory to add to classloader: ../../../dist/ (resolved as: /usr/home/hudson/hudson-slave/workspace/Lucene-Solr-Tests-4.x-Java6/solr/contrib/morphlines-core/src/test-files/solr/collection1/../../../dist).
   [junit4]   2> 28078 T10 oasc.SolrResourceLoader.addToClassLoader WARN Can't find (or read) directory to add to classloader: ../../../contrib/velocity/lib (resolved as: /usr/home/hudson/hudson-slave/workspace/Lucene-Solr-Tests-4.x-Java6/solr/contrib/morphlines-core/src/test-files/solr/collection1/../../../contrib/velocity/lib).
   [junit4]   2> 28079 T10 oasc.SolrResourceLoader.addToClassLoader WARN Can't find (or read) directory to add to classloader: ../../../dist/ (resolved as: /usr/home/hudson/hudson-slave/workspace/Lucene-Solr-Tests-4.x-Java6/solr/contrib/morphlines-core/src/test-files/solr/collection1/../../../dist).
   [junit4]   2> 28080 T10 oasc.SolrResourceLoader.addToClassLoader WARN Can't find (or read) directory to add to classloader: /non/existent/dir/yields/warning (resolved as: /non/existent/dir/yields/warning).
   [junit4]   2> 28138 T10 oasc.SolrConfig.<init> Using Lucene MatchVersion: LUCENE_43
   [junit4]   2> 28259 T10 oasc.SolrConfig.<init> Loaded SolrConfig: solrconfig.xml
   [junit4]   2> 28260 T10 oass.IndexSchema.readSchema Reading Solr Schema from schema.xml
   [junit4]   2> 28303 T10 oass.IndexSchema.readSchema [null] Schema name=example
   [junit4]   2> 28972 T10 oass.IndexSchema.readSchema unique key field: id
   [junit4]   2> 28999 T10 oass.FileExchangeRateProvider.reload Reloading exchange rates from file currency.xml
   [junit4]   2> 29007 T10 oass.FileExchangeRateProvider.reload Reloading exchange rates from file currency.xml
   [junit4]   2> 29101 T10 oasc.SolrResourceLoader.<init> new SolrResourceLoader for directory: '/usr/home/hudson/hudson-slave/workspace/Lucene-Solr-Tests-4.x-Java6/solr/contrib/morphlines-core/src/test-files/solr/collection1/'
   [junit4]   2> 29195 T10 oasc.SolrConfig.initLibs Adding specified lib dirs to ClassLoader
   [junit4]   2> 29197 T10 oasc.SolrResourceLoader.addToClassLoader WARN Can't find (or read) directory to add to classloader: ../../../contrib/extraction/lib (resolved as: /usr/home/hudson/hudson-slave/workspace/Lucene-Solr-Tests-4.x-Java6/solr/contrib/morphlines-core/src/test-files/solr/collection1/../../../contrib/extraction/lib).
   [junit4]   2> 29198 T10 oasc.SolrResourceLoader.addToClassLoader WARN Can't find (or read) directory to add to classloader: ../../../dist/ (resolved as: /usr/home/hudson/hudson-slave/workspace/Lucene-Solr-Tests-4.x-Java6/solr/contrib/morphlines-core/src/test-files/solr/collection1/../../../dist).
   [junit4]   2> 29199 T10 oasc.SolrResourceLoader.addToClassLoader WARN Can't find (or read) directory to add to classloader: ../../../contrib/clustering/lib/ (resolved as: /usr/home/hudson/hudson-slave/workspace/Lucene-Solr-Tests-4.x-Java6/solr/contrib/morphlines-core/src/test-files/solr/collection1/../../../contrib/clustering/lib).
   [junit4]   2> 29200 T10 oasc.SolrResourceLoader.addToClassLoader WARN Can't find (or read) directory to add to classloader: ../../../dist/ (resolved as: /usr/home/hudson/hudson-slave/workspace/Lucene-Solr-Tests-4.x-Java6/solr/contrib/morphlines-core/src/test-files/solr/collection1/../../../dist).
   [junit4]   2> 29201 T10 oasc.SolrResourceLoader.addToClassLoader WARN Can't find (or read) directory to add to classloader: ../../../contrib/langid/lib/ (resolved as: /usr/home/hudson/hudson-slave/workspace/Lucene-Solr-Tests-4.x-Java6/solr/contrib/morphlines-core/src/test-files/solr/collection1/../../../contrib/langid/lib).
   [junit4]   2> 29202 T10 oasc.SolrResourceLoader.addToClassLoader WARN Can't find (or read) directory to add to classloader: ../../../dist/ (resolved as: /usr/home/hudson/hudson-slave/workspace/Lucene-Solr-Tests-4.x-Java6/solr/contrib/morphlines-core/src/test-files/solr/collection1/../../../dist).
   [junit4]   2> 29203 T10 oasc.SolrResourceLoader.addToClassLoader WARN Can't find (or read) directory to add to classloader: ../../../contrib/velocity/lib (resolved as: /usr/home/hudson/hudson-slave/workspace/Lucene-Solr-Tests-4.x-Java6/solr/contrib/morphlines-core/src/test-files/solr/collection1/../../../contrib/velocity/lib).
   [junit4]   2> 29204 T10 oasc.SolrResourceLoader.addToClassLoader WARN Can't find (or read) directory to add to classloader: ../../../dist/ (resolved as: /usr/home/hudson/hudson-slave/workspace/Lucene-Solr-Tests-4.x-Java6/solr/contrib/morphlines-core/src/test-files/solr/collection1/../../../dist).
   [junit4]   2> 29204 T10 oasc.SolrResourceLoader.addToClassLoader WARN Can't find (or read) directory to add to classloader: /non/existent/dir/yields/warning (resolved as: /non/existent/dir/yields/warning).
   [junit4]   2> 29253 T10 oasc.SolrConfig.<init> Using Lucene MatchVersion: LUCENE_43
   [junit4]   2> 29382 T10 oasc.SolrConfig.<init> Loaded SolrConfig: solrconfig.xml
   [junit4]   2> 29383 T10 oass.IndexSchema.readSchema Reading Solr Schema from schema.xml
   [junit4]   2> 29418 T10 oass.IndexSchema.readSchema [null] Schema name=example
   [junit4]   2> 30070 T10 oass.IndexSchema.readSchema unique key field: id
   [junit4]   2> 30098 T10 oass.FileExchangeRateProvider.reload Reloading exchange rates from file currency.xml
   [junit4]   2> 30106 T10 oass.FileExchangeRateProvider.reload Reloading exchange rates from file currency.xml
   [junit4]   2> 33202 T10 oasc.SolrResourceLoader.<init> new SolrResourceLoader for directory: '/usr/home/hudson/hudson-slave/workspace/Lucene-Solr-Tests-4.x-Java6/solr/contrib/morphlines-core/src/test-files/solr/collection1/'
   [junit4]   2> 33288 T10 oasc.SolrConfig.initLibs Adding specified lib dirs to ClassLoader
   [junit4]   2> 33289 T10 oasc.SolrResourceLoader.addToClassLoader WARN Can't find (or read) directory to add to classloader: ../../../contrib/extraction/lib (resolved as: /usr/home/hudson/hudson-slave/workspace/Lucene-Solr-Tests-4.x-Java6/solr/contrib/morphlines-core/src/test-files/solr/collection1/../../../contrib/extraction/lib).
   [junit4]   2> 33290 T10 oasc.SolrResourceLoader.addToClassLoader WARN Can't find (or read) directory to add to classloader: ../../../dist/ (resolved as: /usr/home/hudson/hudson-slave/workspace/Lucene-Solr-Tests-4.x-Java6/solr/contrib/morphlines-core/src/test-files/solr/collection1/../../../dist).
   [junit4]   2> 33291 T10 oasc.SolrResourceLoader.addToClassLoader WARN Can't find (or read) directory to add to classloader: ../../../contrib/clustering/lib/ (resolved as: /usr/home/hudson/hudson-slave/workspace/Lucene-Solr-Tests-4.x-Java6/solr/contrib/morphlines-core/src/test-files/solr/collection1/../../../contrib/clustering/lib).
   [junit4]   2> 33292 T10 oasc.SolrResourceLoader.addToClassLoader WARN Can't find (or read) directory to add to classloader: ../../../dist/ (resolved as: /usr/home/hudson/hudson-slave/workspace/Lucene-Solr-Tests-4.x-Java6/solr/contrib/morphlines-core/src/test-files/solr/collection1/../../../dist).
   [junit4]   2> 33293 T10 oasc.SolrResourceLoader.addToClassLoader WARN Can't find (or read) directory to add to classloader: ../../../contrib/langid/lib/ (resolved as: /usr/home/hudson/hudson-slave/workspace/Lucene-Solr-Tests-4.x-Java6/solr/contrib/morphlines-core/src/test-files/solr/collection1/../../../contrib/langid/lib).
   [junit4]   2> 33294 T10 oasc.SolrResourceLoader.addToClassLoader WARN Can't find (or read) directory to add to classloader: ../../../dist/ (resolved as: /usr/home/hudson/hudson-slave/workspace/Lucene-Solr-Tests-4.x-Java6/solr/contrib/morphlines-core/src/test-files/solr/collection1/../../../dist).
   [junit4]   2> 33295 T10 oasc.SolrResourceLoader.addToClassLoader WARN Can't find (or read) directory to add to classloader: ../../../contrib/velocity/lib (resolved as: /usr/home/hudson/hudson-slave/workspace/Lucene-Solr-Tests-4.x-Java6/solr/contrib/morphlines-core/src/test-files/solr/collection1/../../../contrib/velocity/lib).
   [junit4]   2> 33295 T10 oasc.SolrResourceLoader.addToClassLoader WARN Can't find (or read) directory to add to classloader: ../../../dist/ (resolved as: /usr/home/hudson/hudson-slave/workspace/Lucene-Solr-Tests-4.x-Java6/solr/contrib/morphlines-core/src/test-files/solr/collection1/../../../dist).
   [junit4]   2> 33296 T10 oasc.SolrResourceLoader.addToClassLoader WARN Can't find (or read) directory to add to classloader: /non/existent/dir/yields/warning (resolved as: /non/existent/dir/yields/warning).
   [junit4]   2> 33345 T10 oasc.SolrConfig.<init> Using Lucene MatchVersion: LUCENE_43
   [junit4]   2> 33438 T10 oasc.SolrConfig.<init> Loaded SolrConfig: solrconfig.xml
   [junit4]   2> 33440 T10 oass.IndexSchema.readSchema Reading Solr Schema from schema.xml
   [junit4]   2> 33469 T10 oass.IndexSchema.readSchema [null] Schema name=example
   [junit4]   2> 34337 T10 oass.IndexSchema.readSchema unique key field: id
   [junit4]   2> 34374 T10 oass.FileExchangeRateProvider.reload Reloading exchange rates from file currency.xml
   [junit4]   2> 34386 T10 oass.FileExchangeRateProvider.reload Reloading exchange rates from file currency.xml
   [junit4]   2> 34526 T10 oasc.SolrResourceLoader.<init> new SolrResourceLoader for directory: '/usr/home/hudson/hudson-slave/workspace/Lucene-Solr-Tests-4.x-Java6/solr/contrib/morphlines-core/src/test-files/solr/collection1/'
   [junit4]   2> 34654 T10 oasc.SolrConfig.initLibs Adding specified lib dirs to ClassLoader
   [junit4]   2> 34656 T10 oasc.SolrResourceLoader.addToClassLoader WARN Can't find (or read) directory to add to classloader: ../../../contrib/extraction/lib (resolved as: /usr/home/hudson/hudson-slave/workspace/Lucene-Solr-Tests-4.x-Java6/solr/contrib/morphlines-core/src/test-files/solr/collection1/../../../contrib/extraction/lib).
   [junit4]   2> 34658 T10 oasc.SolrResourceLoader.addToClassLoader WARN Can't find (or read) directory to add to classloader: ../../../dist/ (resolved as: /usr/home/hudson/hudson-slave/workspace/Lucene-Solr-Tests-4.x-Java6/solr/contrib/morphlines-core/src/test-files/solr/collection1/../../../dist).
   [junit4]   2> 34659 T10 oasc.SolrResourceLoader.addToClassLoader WARN Can't find (or read) directory to add to classloader: ../../../contrib/clustering/lib/ (resolved as: /usr/home/hudson/hudson-slave/workspace/Lucene-Solr-Tests-4.x-Java6/solr/contrib/morphlines-core/src/test-files/solr/collection1/../../../contrib/clustering/lib).
   [junit4]   2> 34660 T10 oasc.SolrResourceLoader.addToClassLoader WARN Can't find (or read) directory to add to classloader: ../../../dist/ (resolved as: /usr/home/hudson/hudson-slave/workspace/Lucene-Solr-Tests-4.x-Java6/solr/contrib/morphlines-core/src/test-files/solr/collection1/../../../dist).
   [junit4]   2> 34662 T10 oasc.SolrResourceLoader.addToClassLoader WARN Can't find (or read) directory to add to classloader: ../../../contrib/langid/lib/ (resolved as: /usr/home/hudson/hudson-slave/workspace/Lucene-Solr-Tests-4.x-Java6/solr/contrib/morphlines-core/src/test-files/solr/collection1/../../../contrib/langid/lib).
   [junit4]   2> 34663 T10 oasc.SolrResourceLoader.addToClassLoader WARN Can't find (or read) directory to add to classloader: ../../../dist/ (resolved as: /usr/home/hudson/hudson-slave/workspace/Lucene-Solr-Tests-4.x-Java6/solr/contrib/morphlines-core/src/test-files/solr/collection1/../../../dist).
   [junit4]   2> 34665 T10 oasc.SolrResourceLoader.addToClassLoader WARN Can't find (or read) directory to add to classloader: ../../../contrib/velocity/lib (resolved as: /usr/home/hudson/hudson-slave/workspace/Lucene-Solr-Tests-4.x-Java6/solr/contrib/morphlines-core/src/test-files/solr/collection1/../../../contrib/velocity/lib).
   [junit4]   2> 34666 T10 oasc.SolrResourceLoader.addToClassLoader WARN Can't find (or read) directory to add to classloader: ../../../dist/ (resolved as: /usr/home/hudson/hudson-slave/workspace/Lucene-Solr-Tests-4.x-Java6/solr/contrib/morphlines-core/src/test-files/solr/collection1/../../../dist).
   [junit4]   2> 34666 T10 oasc.SolrResourceLoader.addToClassLoader WARN Can't find (or read) directory to add to classloader: /non/existent/dir/yields/warning (resolved as: /non/existent/dir/yields/warning).
   [junit4]   2> 34739 T10 oasc.SolrConfig.<init> Using Lucene MatchVersion: LUCENE_43
   [junit4]   2> 34878 T10 oasc.SolrConfig.<init> Loaded SolrConfig: solrconfig.xml
   [junit4]   2> 34880 T10 oass.IndexSchema.readSchema Reading Solr Schema from schema.xml
   [junit4]   2> 34919 T10 oass.IndexSchema.readSchema [null] Schema name=example
   [junit4]   2> 35688 T10 oass.IndexSchema.readSchema unique key field: id
   [junit4]   2> 35712 T10 oass.FileExchangeRateProvider.reload Reloading exchange rates from file currency.xml
   [junit4]   2> 35718 T10 oass.FileExchangeRateProvider.reload Reloading exchange rates from file currency.xml
   [junit4]   2> 36501 T10 oasc.SolrResourceLoader.<init> new SolrResourceLoader for directory: '/usr/home/hudson/hudson-slave/workspace/Lucene-Solr-Tests-4.x-Java6/solr/contrib/morphlines-core/src/test-files/solr/collection1/'
   [junit4]   2> 36582 T10 oasc.SolrConfig.initLibs Adding specified lib dirs to ClassLoader
   [junit4]   2> 36584 T10 oasc.SolrResourceLoader.addToClassLoader WARN Can't find (or read) directory to add to classloader: ../../../contrib/extraction/lib (resolved as: /usr/home/hudson/hudson-slave/workspace/Lucene-Solr-Tests-4.x-Java6/solr/contrib/morphlines-core/src/test-files/solr/collection1/../../../contrib/extraction/lib).
   [junit4]   2> 36585 T10 oasc.SolrResourceLoader.addToClassLoader WARN Can't find (or read) directory to add to classloader: ../../../dist/ (resolved as: /usr/home/hudson/hudson-slave/workspace/Lucene-Solr-Tests-4.x-Java6/solr/contrib/morphlines-core/src/test-files/solr/collection1/../../../dist).
   [junit4]   2> 36586 T10 oasc.SolrResourceLoader.addToClassLoader WARN Can't find (or read) directory to add to classloader: ../../../contrib/clustering/lib/ (resolved as: /usr/home/hudson/hudson-slave/workspace/Lucene-Solr-Tests-4.x-Java6/solr/contrib/morphlines-core/src/test-files/solr/collection1/../../../contrib/clustering/lib).
   [junit4]   2> 36586 T10 oasc.SolrResourceLoader.addToClassLoader WARN Can't find (or read) directory to add to classloader: ../../../dist/ (resolved as: /usr/home/hudson/hudson-slave/workspace/Lucene-Solr-Tests-4.x-Java6/solr/contrib/morphlines-core/src/test-files/solr/collection1/../../../dist).
   [junit4]   2> 36587 T10 oasc.SolrResourceLoader.addToClassLoader WARN Can't find (or read) directory to add to classloader: ../../../contrib/langid/lib/ (resolved as: /usr/home/hudson/hudson-slave/workspace/Lucene-Solr-Tests-4.x-Java6/solr/contrib/morphlines-core/src/test-files/solr/collection1/../../../contrib/langid/lib).
   [junit4]   2> 36588 T10 oasc.SolrResourceLoader.addToClassLoader WARN Can't find (or read) directory to add to classloader: ../../../dist/ (resolved as: /usr/home/hudson/hudson-slave/workspace/Lucene-Solr-Tests-4.x-Java6/solr/contrib/morphlines-core/src/test-files/solr/collection1/../../../dist).
   [junit4]   2> 36589 T10 oasc.SolrResourceLoader.addToClassLoader WARN Can't find (or read) directory to add to classloader: ../../../contrib/velocity/lib (resolved as: /usr/home/hudson/hudson-slave/workspace/Lucene-Solr-Tests-4.x-Java6/solr/contrib/morphlines-core/src/test-files/solr/collection1/../../../contrib/velocity/lib).
   [junit4]   2> 36590 T10 oasc.SolrResourceLoader.addToClassLoader WARN Can't find (or read) directory to add to classloader: ../../../dist/ (resolved as: /usr/home/hudson/hudson-slave/workspace/Lucene-Solr-Tests-4.x-Java6/solr/contrib/morphlines-core/src/test-files/solr/collection1/../../../dist).
   [junit4]   2> 36590 T10 oasc.SolrResourceLoader.addToClassLoader WARN Can't find (or read) directory to add to classloader: /non/existent/dir/yields/warning (resolved as: /non/existent/dir/yields/warning).
   [junit4]   2> 36646 T10 oasc.SolrConfig.<init> Using Lucene MatchVersion: LUCENE_43
   [junit4]   2> 36737 T10 oasc.SolrConfig.<init> Loaded SolrConfig: solrconfig.xml
   [junit4]   2> 36738 T10 oass.IndexSchema.readSchema Reading Solr Schema from schema.xml
   [junit4]   2> 36762 T10 oass.IndexSchema.readSchema [null] Schema name=example
   [junit4]   2> 37400 T10 oass.IndexSchema.readSchema unique key field: id
   [junit4]   2> 37423 T10 oass.FileExchangeRateProvider.reload Reloading exchange rates from file currency.xml
   [junit4]   2> 37430 T10 oass.FileExchangeRateProvider.reload Reloading exchange rates from file currency.xml
   [junit4]   2> ASYNC  NEW_CORE C1 name=collection1 org.apache.solr.core.SolrCore@520b1684
   [junit4]   2> 37490 T10 C1 oasup.LogUpdateProcessor.finish [collection1] webapp=null path=/update params={} {deleteByQuery=*:* (-1462081780935819264)} 0 2
   [junit4]   2> 37491 T10 C1 oasu.DirectUpdateHandler2.commit start commit{,optimize=false,openSearcher=true,waitSearcher=true,expungeDeletes=false,softCommit=false,prepareCommit=false}
   [junit4]   2> 37491 T10 C1 oasu.DirectUpdateHandler2.commit No uncommitted changes. Skipping IW.commit.
   [junit4]   2> 37492 T10 C1 oasc.SolrCore.openNewSearcher SolrIndexSearcher has not changed - not re-opening: org.apache.solr.search.SolrIndexSearcher
   [junit4]   2> 37493 T10 C1 oasu.DirectUpdateHandler2.commit end_commit_flush
   [junit4]   2> 37493 T12 oasc.SolrCore.registerSearcher [collection1] Registered new searcher Searcher@3aeebf17[collection1] main{StandardDirectoryReader(segments_1:1:nrt)}
   [junit4]   2> 37494 T10 C1 oasup.LogUpdateProcessor.finish [collection1] webapp=null path=/update params={commit=true&softCommit=false&waitSearcher=true} {commit=} 0 3
   [junit4]   2> 39905 T10 C1 oasup.LogUpdateProcessor.finish [collection1] webapp=null path=/update params={} {add=[testPPT_various.ppt#0 (1462081783220666368)]} 0 240
   [junit4]   2> 39919 T10 C1 oasu.DirectUpdateHandler2.commit start commit{,optimize=false,openSearcher=true,waitSearcher=true,expungeDeletes=false,softCommit=true,prepareCommit=false}
   [junit4]   2> 40214 T10 C1 oass.SolrIndexSearcher.<init> Opening Searcher@2f581b9f[collection1] main
   [junit4]   2> 40222 T10 C1 oasu.DirectUpdateHandler2.commit end_commit_flush
   [junit4]   2> 40226 T12 oasc.QuerySenderListener.newSearcher QuerySenderListener sending requests to Searcher@2f581b9f[collection1] main{StandardDirectoryReader(segments_1:3:nrt _0(4.8):C1)}
   [junit4]   2> 40226 T12 oasc.QuerySenderListener.newSearcher QuerySenderListener done.
   [junit4]   2> 40227 T12 oasc.SolrCore.registerSearcher [collection1] Registered new searcher Searcher@2f581b9f[collection1] main{StandardDirectoryReader(segments_1:3:nrt _0(4.8):C1)}
   [junit4]   2> 40228 T10 C1 oasup.LogUpdateProcessor.finish [collection1] webapp=null path=/update params={commit=true&softCommit=true&waitSearcher=true} {commit=} 0 309
   [junit4]   2> 40300 T10 C1 oasc.SolrCore.execute [collection1] webapp=null path=/select params={q=*%3A*&rows=2147483647} hits=1 status=0 QTime=56 
   [junit4]   2> ASYNC  NEW_CORE C2 name=collection1 org.apache.solr.core.SolrCore@520b1684
   [junit4]   2> 45853 T10 C2 oasup.LogUpdateProcessor.finish [collection1] webapp=null path=/update params={} {add=[testPPT_various.pptx#0 (1462081789702963200)]} 0 6
   [junit4]   2> 45855 T10 C2 oasu.DirectUpdateHandler2.commit start commit{,optimize=false,openSearcher=true,waitSearcher=true,expungeDeletes=false,softCommit=true,prepareCommit=false}
   [junit4]   2> 45919 T10 C2 oass.SolrIndexSearcher.<init> Opening Searcher@6ba8fb1b[collection1] main
   [junit4]   2> 45920 T10 C2 oasu.DirectUpdateHandler2.commit end_commit_flush
   [junit4]   2> 45920 T12 oasc.QuerySenderListener.newSearcher QuerySenderListener sending requests to Searcher@6ba8fb1b[collection1] main{StandardDirectoryReader(segments_1:5:nrt _0(4.8):C1 _1(4.8):C1)}
   [junit4]   2> 45922 T12 oasc.QuerySenderListener.newSearcher QuerySenderListener done.
   [junit4]   2> 45922 T12 oasc.SolrCore.registerSearcher [collection1] Registered new searcher Searcher@6ba8fb1b[collection1] main{StandardDirectoryReader(segments_1:5:nrt _0(4.8):C1 _1(4.8):C1)}
   [junit4]   2> 45925 T10 C2 oasup.LogUpdateProcessor.finish [collection1] webapp=null path=/update params={commit=true&softCommit=true&waitSearcher=true} {commit=} 0 70
   [junit4]   2> 45926 T10 C2 oasc.SolrCore.execute [collection1] webapp=null path=/select params={q=*%3A*&rows=2147483647} hits=2 status=0 QTime=0 
   [junit4]   2> 46745 T10 C2 oasup.LogUpdateProcessor.finish [collection1] webapp=null path=/update params={} {add=[testEXCEL.xlsx#0 (1462081790639341568)]} 0 3
   [junit4]   2> 46746 T10 C2 oasu.DirectUpdateHandler2.commit start commit{,optimize=false,openSearcher=true,waitSearcher=true,expungeDeletes=false,softCommit=true,prepareCommit=false}
   [junit4]   2> 46752 T10 C2 oass.SolrIndexSearcher.<init> Opening Searcher@29214726[collection1] main
   [junit4]   2> 46753 T10 C2 oasu.DirectUpdateHandler2.commit end_commit_flush
   [junit4]   2> 46753 T12 oasc.QuerySenderListener.newSearcher QuerySenderListener sending requests to Searcher@29214726[collection1] main{StandardDirectoryReader(segments_1:7:nrt _0(4.8):C1 _1(4.8):C1 _2(4.8):C1)}
   [junit4]   2> 46755 T12 oasc.QuerySenderListener.newSearcher QuerySenderListener done.
   [junit4]   2> 46755 T12 oasc.SolrCore.registerSearcher [collection1] Registered new searcher Searcher@29214726[collection1] main{StandardDirectoryReader(segments_1:7:nrt _0(4.8):C1 _1(4.8):C1 _2(4.8):C1)}
   [junit4]   2> 46757 T10 C2 oasup.LogUpdateProcessor.finish [collection1] webapp=null path=/update params={commit=true&softCommit=true&waitSearcher=true} {commit=} 0 11
   [junit4]   2> 46758 T10 C2 oasc.SolrCore.execute [collection1] webapp=null path=/select params={q=*%3A*&rows=2147483647} hits=3 status=0 QTime=1 
   [junit4]   2> 46764 T10 oas.SolrTestCaseJ4.tearDown ###Ending testSolrCellDocumentTypes2
   [junit4]   2> NOTE: reproduce with: ant test  -Dtestcase=SolrCellMorphlineTest -Dtests.method=testSolrCellDocumentTypes2 -Dtests.seed=D3DBC8532DD2F94B -Dtests.multiplier=3 -Dtests.slow=true -Dtests.locale=ar_LB -Dtests.timezone=Etc/GMT+5 -Dtests.file.encoding=ISO8859-1
   [junit4] FAILURE 32.0s | SolrCellMorphlineTest.testSolrCellDocumentTypes2 <<<
   [junit4]    > Throwable #1: java.lang.AssertionError: key:ignored_creation_date expected:<[2007-10-01T16:13:56Z]> but was:<[]>
   [junit4]    > 	at __randomizedtesting.SeedInfo.seed([D3DBC8532DD2F94B:585B73B32A246AB5]:0)
   [junit4]    > 	at org.apache.solr.morphlines.solr.AbstractSolrMorphlineTestBase.testDocumentTypesInternal(AbstractSolrMorphlineTestBase.java:170)
   [junit4]    > 	at org.apache.solr.morphlines.cell.SolrCellMorphlineTest.testSolrCellDocumentTypes2(SolrCellMorphlineTest.java:255)
   [junit4]    > 	at java.lang.Thread.run(Thread.java:679)
   [junit4]   2> 46835 T10 oas.SolrTestCaseJ4.setUp ###Starting testSolrCellXML
   [junit4]   2> 46973 T10 C2 oass.SolrIndexSearcher.<init> Opening Searcher@384e23c3[collection1] realtime
   [junit4]   2> 46974 T10 C2 oasup.LogUpdateProcessor.finish [collection1] webapp=null path=/update params={} {deleteByQuery=*:* (-1462081790737907712)} 0 138
   [junit4]   2> 46975 T10 C2 oasu.DirectUpdateHandler2.commit start commit{,optimize=false,openSearcher=true,waitSearcher=true,expungeDeletes=false,softCommit=false,prepareCommit=false}
   [junit4]   2> 46975 T10 C2 oasc.SolrDeletionPolicy.onCommit SolrDeletionPolicy.onCommit: commits: num=2
   [junit4]   2> 		commit{dir=BaseDirectoryWrapper(RAMDirectory@7c40627c lockFactory=NativeFSLockFactory@/usr/home/hudson/hudson-slave/workspace/Lucene-Solr-Tests-4.x-Java6/solr/build/contrib/solr-morphlines-cell/test/J0/./solrtest-SolrCellMorphlineTest-1394349807886/index),segFN=segments_1,generation=1}
   [junit4]   2> 		commit{dir=BaseDirectoryWrapper(RAMDirectory@7c40627c lockFactory=NativeFSLockFactory@/usr/home/hudson/hudson-slave/workspace/Lucene-Solr-Tests-4.x-Java6/solr/build/contrib/solr-morphlines-cell/test/J0/./solrtest-SolrCellMorphlineTest-1394349807886/index),segFN=segments_2,generation=2}
   [junit4]   2> 46976 T10 C2 oasc.SolrDeletionPolicy.updateCommits newest commit generation = 2
   [junit4]   2> 46977 T10 C2 oasc.SolrCore.openNewSearcher SolrIndexSearcher has not changed - not re-opening: org.apache.solr.search.SolrIndexSearcher
   [junit4]   2> 46978 T10 C2 oasu.DirectUpdateHandler2.commit end_commit_flush
   [junit4]   2> 46978 T12 oasc.QuerySenderListener.newSearcher QuerySenderListener sending requests to Searcher@384e23c3[collection1] realtime{StandardDirectoryReader(segments_1:9:nrt)}
   [junit4]   2> 46979 T12 oasc.QuerySenderListener.newSearcher QuerySenderListener done.
   [junit4]   2> 46979 T12 oasc.SolrCore.registerSearcher [collection1] Registered new searcher Searcher@384e23c3[collection1] realtime{StandardDirectoryReader(segments_1:9:nrt)}
   [junit4]   2> 46981 T10 C2 oasup.LogUpdateProcessor.finish [collection1] webapp=null path=/update params={commit=true&softCommit=false&waitSearcher=true} {commit=} 0 6
   [junit4]   2> 46995 T10 okma.MorphlineContext.importCommandBuilders Importing commands
   [junit4]   2> 48491 T10 okma.MorphlineContext.importCommandBuilders Done importing commands
   [junit4]   2> 48502 T10 oasc.SolrResourceLoader.<init> new SolrResourceLoader for directory: '/usr/home/hudson/hudson-slave/workspace/Lucene-Solr-Tests-4.x-Java6/solr/contrib/morphlines-core/src/test-files/solr/collection1/'
   [junit4]   2> 48609 T10 oasc.SolrConfig.initLibs Adding specified lib dirs to ClassLoader
   [junit4]   2> 48611 T10 oasc.SolrResourceLoader.addToClassLoader WARN Can't find (or read) directory to add to classloader: ../../../contrib/extraction/lib (resolved as: /usr/home/hudson/hudson-slave/workspace/Lucene-Solr-Tests-4.x-Java6/solr/contrib/morphlines-core/src/test-files/solr/collection1/../../../contrib/extraction/lib).
   [junit4]   2> 48612 T10 oasc.SolrResourceLoader.addToClassLoader WARN Can't find (or read) directory to add to classloader: ../../../dist/ (resolved as: /usr/home/hudson/hudson-slave/workspace/Lucene-Solr-Tests-4.x-Java6/solr/contrib/morphlines-core/src/test-files/solr/collection1/../../../dist).
   [junit4]   2> 48613 T10 oasc.SolrResourceLoader.addToClassLoader WARN Can't find (or read) directory to add to classloader: ../../../contrib/clustering/lib/ (resolved as: /usr/home/hudson/hudson-slave/workspace/Lucene-Solr-Tests-4.x-Java6/solr/contrib/morphlines-core/src/test-files/solr/collection1/../../../contrib/clustering/lib).
   [junit4]   2> 48614 T10 oasc.SolrResourceLoader.addToClassLoader WARN Can't find (or read) directory to add to classloader: ../../../dist/ (resolved as: /usr/home/hudson/hudson-slave/workspace/Lucene-Solr-Tests-4.x-Java6/solr/contrib/morphlines-core/src/test-files/solr/collection1/../../../dist).
   [junit4]   2> 48616 T10 oasc.SolrResourceLoader.addToClassLoader WARN Can't find (or read) directory to add to classloader: ../../../contrib/langid/lib/ (resolved as: /usr/home/hudson/hudson-slave/workspace/Lucene-Solr-Tests-4.x-Java6/solr/contrib/morphlines-core/src/test-files/solr/collection1/../../../contrib/langid/lib).
   [junit4]   2> 48616 T10 oasc.SolrResourceLoader.addToClassLoader WARN Can't find (or read) directory to add to classloader: ../../../dist/ (resolved as: /usr/home/hudson/hudson-slave/workspace/Lucene-Solr-Tests-4.x-Java6/solr/contrib/morphlines-core/src/test-files/solr/collection1/../../../dist).
   [junit4]   2> 48618 T10 oasc.SolrResourceLoader.addToClassLoader WARN Can't find (or read) directory to add to classloader: ../../../contrib/velocity/lib (resolved as: /usr/home/hudson/hudson-slave/workspace/Lucene-Solr-Tests-4.x-Java6/solr/contrib/morphlines-core/src/test-files/solr/collection1/../../../contrib/velocity/lib).
   [junit4]   2> 48618 T10 oasc.SolrResourceLoader.addToClassLoader WARN Can't find (or read) directory to add to classloader: ../../../dist/ (resolved as: /usr/home/hudson/hudson-slave/workspace/Lucene-Solr-Tests-4.x-Java6/solr/contrib/morphlines-core/src/test-files/solr/collection1/../../../dist).
   [junit4]   2> 48619 T10 oasc.SolrResourceLoader.addToClassLoader WARN Can't find (or read) directory to add to classloader: /non/existent/dir/yields/warning (resolved as: /non/existent/dir/yields/warning).
   [junit4]   2> 48683 T10 oasc.SolrConfig.<init> Using Lucene MatchVersion: LUCENE_43
   [junit4]   2> 48807 T10 oasc.SolrConfig.<init> Loaded SolrConfig: solrconfig.xml
   [junit4]   2> 48809 T10 oass.IndexSchema.readSchema Reading Solr Schema from schema.xml
   [junit4]   2> 48831 T10 oass.IndexSchema.readSchema [null] Schema name=example
   [junit4]   2> 49504 T10 oass.IndexSchema.readSchema unique key field: id
   [junit4]   2> 49528 T10 oass.FileExchangeRateProvider.reload Reloading exchange rates from file currency.xml
   [junit4]   2> 49534 T10 oass.FileExchangeRateProvider.reload Reloading exchange rates from file currency.xml
   [junit4]   2> 49584 T10 oasc.SolrResourceLoader.<init> new SolrResourceLoader for directory: '/usr/home/hudson/hudson-slave/workspace/Lucene-Solr-Tests-4.x-Java6/solr/contrib/morphlines-core/src/test-files/solr/collection1/'
   [junit4]   2> 49660 T10 oasc.SolrConfig.initLibs Adding specified lib dirs to ClassLoader
   [junit4]   2> 49661 T10 oasc.SolrResourceLoader.addToClassLoader WARN Can't find (or read) directory to add to classloader: ../../../contrib/extraction/lib (resolved as: /usr/home/hudson/hudson-slave/workspace/Lucene-Solr-Tests-4.x-Java6/solr/contrib/morphlines-core/src/test-files/solr/collection1/../../../contrib/extraction/lib).
   [junit4]   2> 49662 T10 oasc.SolrResourceLoader.addToClassLoader WARN Can't find (or read) directory to add to classloader: ../../../dist/ (resolved as: /usr/home/hudson/hudson-slave/workspace/Lucene-Solr-Tests-4.x-Java6/solr/contrib/morphlines-core/src/test-files/solr/collection1/../../../dist).
   [junit4]   2> 49663 T10 oasc.SolrResourceLoader.addToClassLoader WARN Can't find (or read) directory to add to classloader: ../../../contrib/clustering/lib/ (resolved as: /usr/home/hudson/hudson-slave/workspace/Lucene-Solr-Tests-4.x-Java6/solr/contrib/morphlines-core/src/test-files/solr/collection1/../../../contrib/clustering/lib).
   [junit4]   2> 49664 T10 oasc.SolrResourceLoader.addToClassLoader WARN Can't find (or read) directory to add to classloader: ../../../dist/ (resolved as: /usr/home/hudson/hudson-slave/workspace/Lucene-Solr-Tests-4.x-Java6/solr/contrib/morphlines-core/src/test-files/solr/collection1/../../../dist).
   [junit4]   2> 49665 T10 oasc.SolrResourceLoader.addToClassLoader WARN Can't find (or read) directory to add to classloader: ../../../contrib/langid/lib/ (resolved as: /usr/home/hudson/hudson-slave/workspace/Lucene-Solr-Tests-4.x-Java6/solr/contrib/morphlines-core/src/test-files/solr/collection1/../../../contrib/langid/lib).
   [junit4]   2> 49666 T10 oasc.SolrResourceLoader.addToClassLoader WARN Can't find (or read) directory to add to classloader: ../../../dist/ (resolved as: /usr/home/hudson/hudson-slave/workspace/Lucene-Solr-Tests-4.x-Java6/solr/contrib/morphlines-core/src/test-files/solr/collection1/../../../dist).
   [junit4]   2> 49667 T10 oasc.SolrResourceLoader.addToClassLoader WARN Can't find (or read) directory to add to classloader: ../../../contrib/velocity/lib (resolved as: /usr/home/hudson/hudson-slave/workspace/Lucene-Solr-Tests-4.x-Java6/solr/contrib/morphlines-core/src/test-files/solr/collection1/../../../contrib/velocity/lib).
   [junit4]   2> 49668 T10 oasc.SolrResourceLoader.addToClassLoader WARN Can't find (or read) directory to add to classloader: ../../../dist/ (resolved as: /usr/home/hudson/hudson-slave/workspace/Lucene-Solr-Tests-4.x-Java6/solr/contrib/morphlines-core/src/test-files/solr/collection1/../../../dist).
   [junit4]   2> 49668 T10 oasc.SolrResourceLoader.addToClassLoader WARN Can't find (or read) directory to add to classloader: /non/existent/dir/yields/warning (resolved as: /non/existent/dir/yields/warning).
   [junit4]   2> 49716 T10 oasc.SolrConfig.<init> Using Lucene MatchVersion: LUCENE_43
   [junit4]   2> 49809 T10 oasc.SolrConfig.<init> Loaded SolrConfig: solrconfig.xml
   [junit4]   2> 49811 T10 oass.IndexSchema.readSchema Reading Solr Schema from schema.xml
   [junit4]   2> 49826 T10 oass.IndexSchema.readSchema [null] Schema name=example
   [junit4]   2> 50493 T10 oass.IndexSchema.readSchema unique key field: id
   [junit4]   2> 50529 T10 oass.FileExchangeRateProvider.reload Reloading exchange rates from file currency.xml
   [junit4]   2> 50538 T10 oass.FileExchangeRateProvider.reload Reloading exchange rates from file currency.xml
   [junit4]   2> 50584 T10 oasc.SolrResourceLoader.<init> new SolrResourceLoader for directory: '/usr/home/hudson/hudson-slave/workspace/Lucene-Solr-Tests-4.x-Java6/solr/contrib/morphlines-core/src/test-files/solr/collection1/'
   [junit4]   2> 50703 T10 oasc.SolrConfig.initLibs Adding specified lib dirs to ClassLoader
   [junit4]   2> 50705 T10 oasc.SolrResourceLoader.addToClassLoader WARN Can't find (or read) directory to add to classloader: ../../../contrib/extraction/lib (resolved as: /usr/home/hudson/hudson-slave/workspace/Lucene-Solr-Tests-4.x-Java6/solr/contrib/morphlines-core/src/test-files/solr/collection1/../../../contrib/extraction/lib).
   [junit4]   2> 50707 T10 oasc.SolrResourceLoader.addToClassLoader WARN Can't find (or read) directory to add to classloader: ../../../dist/ (resolved as: /usr/home/hudson/hudson-slave/workspace/Lucene-Solr-Tests-4.x-Java6/solr/contrib/morphlines-core/src/test-files/solr/collection1/../../../dist).
   [junit4]   2> 50708 T10 oasc.SolrResourceLoader.addToClassLoader WARN Can't find (or read) directory to add to classloader: ../../../contrib/clustering/lib/ (resolved as: /usr/home/hudson/hudson-slave/workspace/Lucene-Solr-Tests-4.x-Java6/solr/contrib/morphlines-core/src/test-files/solr/collection1/../../../contrib/clustering/lib).
   [junit4]   2> 50709 T10 oasc.SolrResourceLoader.addToClassLoader WARN Can't find (or read) directory to add to classloader: ../../../dist/ (resolved as: /usr/home/hudson/hudson-slave/workspace/Lucene-Solr-Tests-4.x-Java6/solr/contrib/morphlines-core/src/test-files/solr/collection1/../../../dist).
   [junit4]   2> 50711 T10 oasc.SolrResourceLoader.addToClassLoader WARN Can't find (or read) directory to add to classloader: ../../../contrib/langid/lib/ (resolved as: /usr/home/hudson/hudson-slave/workspace/Lucene-Solr-Tests-4.x-Java6/solr/contrib/morphlines-core/src/test-files/solr/collection1/../../../contrib/langid/lib).
   [junit4]   2> 50712 T10 oasc.SolrResourceLoader.addToClassLoader WARN Can't find (or read) directory to add to classloader: ../../../dist/ (resolved as: /usr/home/hudson/hudson-slave/workspace/Lucene-Solr-Tests-4.x-Java6/solr/contrib/morphlines-core/src/test-files/solr/collection1/../../../dist).
   [junit4]   2> 50714 T10 oasc.SolrResourceLoader.addToClassLoader WARN Can't find (or read) directory to add to classloader: ../../../contrib/velocity/lib (resolved as: /usr/home/hudson/hudson-slave/workspace/Lucene-Solr-Tests-4.x-Java6/solr/contrib/morphlines-core/src/test-files/solr/collection1/../../../contrib/velocity/lib).
   [junit4]   2> 50715 T10 oasc.SolrResourceLoader.addToClassLoader WARN Can't find (or read) directory to add to classloader: ../../../dist/ (resolved as: /usr/home/hudson/hudson-slave/workspace/Lucene-Solr-Tests-4.x-Java6/solr/contrib/morphlines-core/src/test-files/solr/collection1/../../../dist).
   [junit4]   2> 50716 T10 oasc.SolrResourceLoader.addToClassLoader WARN Can't find (or read) directory to add to classloader: /non/existent/dir/yields/warning (resolved as: /non/existent/dir/yields/warning).
   [junit4]   2> 50788 T10 oasc.SolrConfig.<init> Using Lucene MatchVersion: LUCENE_43
   [junit4]   2> 50926 T10 oasc.SolrConfig.<init> Loaded SolrConfig: solrconfig.xml
   [junit4]   2> 50928 T10 oass.IndexSchema.readSchema Reading Solr Schema from schema.xml
   [junit4]   2> 50949 T10 oass.IndexSchema.readSchema [null] Schema name=example
   [junit4]   2> 51848 T10 oass.IndexSchema.readSchema unique key field: id
   [junit4]   2> 51887 T10 oass.FileExchangeRateProvider.reload Reloading exchange rates from file currency.xml
   [junit4]   2> 51896 T10 oass.FileExchangeRateProvider.reload Reloading exchange rates from file currency.xml
   [junit4]   2> ASYNC  NEW_CORE C3 name=collection1 org.apache.solr.core.SolrCore@520b1684
   [junit4]   2> 51945 T10 C3 oasup.LogUpdateProcessor.finish [collection1] webapp=null path=/update params={} {deleteByQuery=*:* (-1462081796092985344)} 0 1
   [junit4]   2> 51946 T10 C3 oasu.DirectUpdateHandler2.commit start commit{,optimize=false,openSearcher=true,waitSearcher=true,expungeDeletes=false,softCommit=false,prepareCommit=false}
   [junit4]   2> 51947 T10 C3 oasu.DirectUpdateHandler2.commit No uncommitted changes. Skipping IW.commit.
   [junit4]   2> 51948 T10 C3 oasc.SolrCore.openNewSearcher SolrIndexSearcher has not changed - not re-opening: org.apache.solr.search.SolrIndexSearcher
   [junit4]   2> 51948 T10 C3 oasu.DirectUpdateHandler2.commit end_commit_flush
   [junit4]   2> 51948 T12 oasc.SolrCore.registerSearcher [collection1] Registered new searcher Searcher@384e23c3[collection1] realtime{StandardDirectoryReader(segments_1:9:nrt)}
   [junit4]   2> 51950 T10 C3 oasup.LogUpdateProcessor.finish [collection1] webapp=null path=/update params={commit=true&softCommit=false&waitSearcher=true} {commit=} 0 4
   [junit4]   2> 51994 T10 C3 oasup.LogUpdateProcessor.finish [collection1] webapp=null path=/update params={} {add=[testXML2.xml#0 (1462081796144365568)]} 0 2
   [junit4]   2> 51995 T10 C3 oasu.DirectUpdateHandler2.commit start commit{,optimize=false,openSearcher=true,waitSearcher=true,expungeDeletes=false,softCommit=true,prepareCommit=false}
   [junit4]   2> 51999 T10 C3 oass.SolrIndexSearcher.<init> Opening Searcher@33dd66fd[collection1] main
   [junit4]   2> 52000 T10 C3 oasu.DirectUpdateHandler2.commit end_commit_flush
   [junit4]   2> 52000 T12 oasc.SolrException.log ERROR java.lang.ArrayIndexOutOfBoundsException: 0
   [junit4]   2> 		at org.apache.solr.search.SolrIndexSearcher.warm(SolrIndexSearcher.java:2161)
   [junit4]   2> 		at org.apache.solr.core.SolrCore$4.call(SolrCore.java:1693)
   [junit4]   2> 		at java.util.concurrent.FutureTask$Sync.innerRun(FutureTask.java:334)
   [junit4]   2> 		at java.util.concurrent.FutureTask.run(FutureTask.java:166)
   [junit4]   2> 		at java.util.concurrent.ThreadPoolExecutor.runWorker(ThreadPoolExecutor.java:1146)
   [junit4]   2> 		at java.util.concurrent.ThreadPoolExecutor$Worker.run(ThreadPoolExecutor.java:615)
   [junit4]   2> 		at java.lang.Thread.run(Thread.java:679)
   [junit4]   2> 	
   [junit4]   2> 52002 T12 oasc.QuerySenderListener.newSearcher QuerySenderListener sending requests to Searcher@33dd66fd[collection1] main{StandardDirectoryReader(segments_2:11:nrt _3(4.8):C1)}
   [junit4]   2> 52002 T12 oasc.QuerySenderListener.newSearcher QuerySenderListener done.
   [junit4]   2> 52003 T12 oasc.SolrCore.registerSearcher [collection1] Registered new searcher Searcher@33dd66fd[collection1] main{StandardDirectoryReader(segments_2:11:nrt _3(4.8):C1)}
   [junit4]   2> 52004 T10 C3 oasup.LogUpdateProcessor.finish [collection1] webapp=null path=/update params={commit=true&softCommit=true&waitSearcher=true} {commit=} 0 8
   [junit4]   2> 52005 T10 C3 oasc.SolrCore.execute [collection1] webapp=null path=/select params={q=*%3A*&rows=2147483647} hits=1 status=0 QTime=1 
   [junit4]   2> 52006 T10 C3 oasu.DirectUpdateHandler2.commit start commit{,optimize=false,openSearcher=true,waitSearcher=true,expungeDeletes=false,softCommit=true,prepareCommit=false}
   [junit4]   2> 52007 T10 C3 oasc.SolrCore.openNewSearcher SolrIndexSearcher has not changed - not re-opening: org.apache.solr.search.SolrIndexSearcher
   [junit4]   2> 52008 T10 C3 oasu.DirectUpdateHandler2.commit end_commit_flush
   [junit4]   2> 52008 T12 oasc.SolrCore.registerSearcher [collection1] Registered new searcher Searcher@33dd66fd[collection1] main{StandardDirectoryReader(segments_2:11:nrt _3(4.8):C1)}
   [junit4]   2> 52009 T10 C3 oasup.LogUpdateProcessor.finish [collection1] webapp=null path=/update params={commit=true&softCommit=true&waitSearcher=true} {commit=} 0 3
   [junit4]   2> 52010 T10 C3 oasc.SolrCore.execute [collection1] webapp=null path=/select params={q=*%3A*&rows=2147483647} hits=1 status=0 QTime=0 
   [junit4]   2> 52011 T10 oas.SolrTestCaseJ4.tearDown ###Ending testSolrCellXML
   [junit4]   2> 52039 T10 oas.SolrTestCaseJ4.setUp ###Starting testTransformValue
   [junit4]   2> 52041 T10 C3 oass.SolrIndexSearcher.<init> Opening Searcher@69a66ce8[collection1] realtime
   [junit4]   2> 52042 T10 C3 oasup.LogUpdateProcessor.finish [collection1] webapp=null path=/update params={} {deleteByQuery=*:* (-1462081796194697216)} 0 2
   [junit4]   2> 52043 T10 C3 oasu.DirectUpdateHandler2.commit start commit{,optimize=false,openSearcher=true,waitSearcher=true,expungeDeletes=false,softCommit=false,prepareCommit=false}
   [junit4]   2> 52044 T10 C3 oasc.SolrDeletionPolicy.onCommit SolrDeletionPolicy.onCommit: commits: num=2
   [junit4]   2> 		commit{dir=BaseDirectoryWrapper(RAMDirectory@7c40627c lockFactory=NativeFSLockFactory@/usr/home/hudson/hudson-slave/workspace/Lucene-Solr-Tests-4.x-Java6/solr/build/contrib/solr-morphlines-cell/test/J0/./solrtest-SolrCellMorphlineTest-1394349807886/index),segFN=segments_2,generation=2}
   [junit4]   2> 		commit{dir=BaseDirectoryWrapper(RAMDirectory@7c40627c lockFactory=NativeFSLockFactory@/usr/home/hudson/hudson-slave/workspace/Lucene-Solr-Tests-4.x-Java6/solr/build/contrib/solr-morphlines-cell/test/J0/./solrtest-SolrCellMorphlineTest-1394349807886/index),segFN=segments_3,generation=3}
   [junit4]   2> 52045 T10 C3 oasc.SolrDeletionPolicy.updateCommits newest commit generation = 3
   [junit4]   2> 52046 T10 C3 oasc.SolrCore.openNewSearcher SolrIndexSearcher has not changed - not re-opening: org.apache.solr.search.SolrIndexSearcher
   [junit4]   2> 52047 T12 oasc.QuerySenderListener.newSearcher QuerySenderListener sending requests to Searcher@69a66ce8[collection1] realtime{StandardDirectoryReader(segments_2:13:nrt)}
   [junit4]   2> 52047 T10 C3 oasu.DirectUpdateHandler2.commit end_commit_flush
   [junit4]   2> 52047 T12 oasc.QuerySenderListener.newSearcher QuerySenderListener done.
   [junit4]   2> 52049 T12 oasc.SolrCore.registerSearcher [collection1] Registered new searcher Searcher@69a66ce8[collection1] realtime{StandardDirectoryReader(segments_2:13:nrt)}
   [junit4]   2> 52050 T10 C3 oasup.LogUpdateProcessor.finish [collection1] webapp=null path=/update params={commit=true&softCommit=false&waitSearcher=true} {commit=} 0 7
   [junit4]   2> 52060 T10 oas.SolrTestCaseJ4.tearDown ###Ending testTransformValue
   [junit4]   2> 52070 T10 oas.SolrTestCaseJ4.setUp ###Starting testSolrCellDocumentTypes
   [junit4]   2> 52072 T10 C3 oasup.LogUpdateProcessor.finish [collection1] webapp=null path=/update params={} {deleteByQuery=*:* (-1462081796227203072)} 0 1
   [junit4]   2> 52073 T10 C3 oasu.DirectUpdateHandler2.commit start commit{,optimize=false,openSearcher=true,waitSearcher=true,expungeDeletes=false,softCommit=false,prepareCommit=false}
   [junit4]   2> 52073 T10 C3 oasu.DirectUpdateHandler2.commit No uncommitted changes. Skipping IW.commit.
   [junit4]   2> 52074 T10 C3 oasc.SolrCore.openNewSearcher SolrIndexSearcher has not changed - not re-opening: org.apache.solr.search.SolrIndexSearcher
   [junit4]   2> 52075 T10 C3 oasu.DirectUpdateHandler2.commit end_commit_flush
   [junit4]   2> 52075 T12 oasc.SolrCore.registerSearcher [collection1] Registered new searcher Searcher@69a66ce8[collection1] realtime{StandardDirectoryReader(segments_2:13:nrt)}
   [junit4]   2> 52076 T10 C3 oasup.LogUpdateProcessor.finish [collection1] webapp=null path=/update params={commit=true&softCommit=false&waitSearcher=true} {commit=} 0 3
   [junit4]   2> 52104 T10 okma.MorphlineContext.importCommandBuilders Importing commands
   [junit4]   2> 53734 T10 okma.MorphlineContext.importCommandBuilders Done importing commands
   [junit4]   2> 54610 T10 oasc.SolrResourceLoader.<init> new SolrResourceLoader for directory: '/usr/home/hudson/hudson-slave/workspace/Lucene-Solr-Tests-4.x-Java6/solr/contrib/morphlines-core/src/test-files/solr/collection1/'
   [junit4]   2> 54682 T10 oasc.SolrConfig.initLibs Adding specified lib dirs to ClassLoader
   [junit4]   2> 54684 T10 oasc.SolrResourceLoader.addToClassLoader WARN Can't find (or read) directory to add to classloader: ../../../contrib/extraction/lib (resolved as: /usr/home/hudson/hudson-slave/workspace/Lucene-Solr-Tests-4.x-Java6/solr/contrib/morphlines-core/src/test-files/solr/collection1/../../../contrib/extraction/lib).
   [junit4]   2> 54685 T10 oasc.SolrResourceLoader.addToClassLoader WARN Can't find (or read) directory to add to classloader: ../../../dist/ (resolved as: /usr/home/hudson/hudson-slave/workspace/Lucene-Solr-Tests-4.x-Java6/solr/contrib/morphlines-core/src/test-files/solr/collection1/../../../dist).
   [junit4]   2> 54686 T10 oasc.SolrResourceLoader.addToClassLoader WARN Can't find (or read) directory to add to classloader: ../../../contrib/clustering/lib/ (resolved as: /usr/home/hudson/hudson-slave/workspace/Lucene-Solr-Tests-4.x-Java6/solr/contrib/morphlines-core/src/test-files/solr/collection1/../../../contrib/clustering/lib).
   [junit4]   2> 54687 T10 oasc.SolrResourceLoader.addToClassLoader WARN Can't find (or read) directory to add to classloader: ../../../dist/ (resolved as: /usr/home/hudson/hudson-slave/workspace/Lucene-Solr-Tests-4.x-Java6/solr/contrib/morphlines-core/src/test-files/solr/collection1/../../../dist).
   [junit4]   2> 54688 T10 oasc.SolrResourceLoader.addToClassLoader WARN Can't find (or read) directory to add to classloader: ../../../contrib/langid/lib/ (resolved as: /usr/home/hudson/hudson-slave/workspace/Lucene-Solr-Tests-4.x-Java6/solr/contrib/morphlines-core/src/test-files/solr/collection1/../../../contrib/langid/lib).
   [junit4]   2> 54688 T10 oasc.SolrResourceLoader.addToClassLoader WARN Can't find (or read) directory to add to classloader: ../../../dist/ (resolved as: /usr/home/hudson/hudson-slave/workspace/Lucene-Solr-Tests-4.x-Java6/solr/contrib/morphlines-core/src/test-files/solr/collection1/../../../dist).
   [junit4]   2> 54689 T10 oasc.SolrResourceLoader.addToClassLoader WARN Can't find (or read) directory to add to classloader: ../../../contrib/velocity/lib (resolved as: /usr/home/hudson/hudson-slave/workspace/Lucene-Solr-Tests-4.x-Java6/solr/contrib/morphlines-core/src/test-files/solr/collection1/../../../contrib/velocity/lib).
   [junit4]   2> 54690 T10 oasc.SolrResourceLoader.addToClassLoader WARN Can't find (or read) directory to add to classloader: ../../../dist/ (resolved as: /usr/home/hudson/hudson-slave/workspace/Lucene-Solr-Tests-4.x-Java6/solr/contrib/morphlines-core/src/test-files/solr/collection1/../../../dist).
   [junit4]   2> 54690 T10 oasc.SolrResourceLoader.addToClassLoader WARN Can't find (or read) directory to add to classloader: /non/existent/dir/yields/warning (resolved as: /non/existent/dir/yields/warning).
   [junit4]   2> 54739 T10 oasc.SolrConfig.<init> Using Lucene MatchVersion: LUCENE_43
   [junit4]   2> 54855 T10 oasc.SolrConfig.<init> Loaded SolrConfig: solrconfig.xml
   [junit4]   2> 54857 T10 oass.IndexSchema.readSchema Reading Solr Schema from schema.xml
   [junit4]   2> 54870 T10 oass.IndexSchema.readSchema [null] Schema name=example
   [junit4]   2> 55597 T10 oass.IndexSchema.readSchema unique key field: id
   [junit4]   2> 55631 T10 oass.FileExchangeRateProvider.reload Reloading exchange rates from file currency.xml
   [junit4]   2> 55640 T10 oass.FileExchangeRateProvider.reload Reloading exchange rates from file currency.xml
   [junit4]   2> 55685 T10 oasc.SolrResourceLoader.<init> new SolrResourceLoader for directory: '/usr/home/hudson/hudson-slave/workspace/Lucene-Solr-Tests-4.x-Java6/solr/contrib/morphlines-core/src/test-files/solr/collection1/'
   [junit4]   2> 55732 T10 oasc.SolrConfig.initLibs Adding specified lib dirs to ClassLoader
   [junit4]   2> 55733 T10 oasc.SolrResourceLoader.addToClassLoader WARN Can't find (or read) directory to add to classloader: ../../../contrib/extraction/lib (resolved as: /usr/home/hudson/hudson-slave/workspace/Lucene-Solr-Tests-4.x-Java6/solr/contrib/morphlines-core/src/test-files/solr/collection1/../../../contrib/extraction/lib).
   [junit4]   2> 55734 T10 oasc.SolrResourceLoader.addToClassLoader WARN Can't find (or read) directory to add to classloader: ../../../dist/ (resolved as: /usr/home/hudson/hudson-slave/workspace/Lucene-Solr-Tests-4.x-Java6/solr/contrib/morphlines-core/src/test-files/solr/collection1/../../../dist).
   [junit4]   2> 55735 T10 oasc.SolrResourceLoader.addToClassLoader WARN Can't find (or read) directory to add to classloader: ../../../contrib/clustering/lib/ (resolved as: /usr/home/hudson/hudson-slave/workspace/Lucene-Solr-Tests-4.x-Java6/solr/contrib/morphlines-core/src/test-files/solr/collection1/../../../contrib/clustering/lib).
   [junit4]   2> 55736 T10 oasc.SolrResourceLoader.addToClassLoader WARN Can't find (or read) directory to add to classloader: ../../../dist/ (resolved as: /usr/home/hudson/hudson-slave/workspace/Lucene-Solr-Tests-4.x-Java6/solr/contrib/morphlines-core/src/test-files/solr/collection1/../../../dist).
   [junit4]   2> 55737 T10 oasc.SolrResourceLoader.addToClassLoader WARN Can't find (or read) directory to add to classloader: ../../../contrib/langid/lib/ (resolved as: /usr/home/hudson/hudson-slave/workspace/Lucene-Solr-Tests-4.x-Java6/solr/contrib/morphlines-core/src/test-files/solr/collection1/../../../contrib/langid/lib).
   [junit4]   2> 55738 T10 oasc.SolrResourceLoader.addToClassLoader WARN Can't find (or read) directory to add to classloader: ../../../dist/ (resolved as: /usr/home/hudson/hudson-slave/workspace/Lucene-Solr-Tests-4.x-Java6/solr/contrib/morphlines-core/src/test-files/solr/collection1/../../../dist).
   [junit4]   2> 55739 T10 oasc.SolrResourceLoader.addToClassLoader WARN Can't find (or read) directory to add to classloader: ../../../contrib/velocity/lib (resolved as: /usr/home/hudson/hudson-slave/workspace/Lucene-Solr-Tests-4.x-Java6/solr/contrib/morphlines-core/src/test-files/solr/collection1/../../../contrib/velocity/lib).
   [junit4]   2> 55740 T10 oasc.SolrResourceLoader.addToClassLoader WARN Can't find (or read) directory to add to classloader: ../../../dist/ (resolved as: /usr/home/hudson/hudson-slave/workspace/Lucene-Solr-Tests-4.x-Java6/solr/contrib/morphlines-core/src/test-files/solr/collection1/../../../dist).
   [junit4]   2> 55740 T10 oasc.SolrResourceLoader.addToClassLoader WARN Can't find (or read) directory to add to classloader: /non/existent/dir/yields/warning (resolved as: /non/existent/dir/yields/warning).
   [junit4]   2> 55841 T10 oasc.SolrConfig.<init> Using Lucene MatchVersion: LUCENE_43
   [junit4]   2> 55932 T10 oasc.SolrConfig.<init> Loaded SolrConfig: solrconfig.xml
   [junit4]   2> 55933 T10 oass.IndexSchema.readSchema Reading Solr Schema from schema.xml
   [junit4]   2> 55964 T10 oass.IndexSchema.readSchema [null] Schema name=example
   [junit4]   2> 56699 T10 oass.IndexSchema.readSchema unique key field: id
   [junit4]   2> 56730 T10 oass.FileExchangeRateProvider.reload Reloading exchange rates from file currency.xml
   [junit4]   2> 56745 T10 oass.FileExchangeRateProvider.reload Reloading exchange rates from file currency.xml
   [junit4]   2> 56782 T10 oasc.SolrResourceLoader.<init> new SolrResourceLoader for directory: '/usr/home/hudson/hudson-slave/workspace/Lucene-Solr-Tests-4.x-Java6/solr/contrib/morphlines-core/src/test-files/solr/collection1/'
   [junit4]   2> 56816 T10 oasc.SolrConfig.initLibs Adding specified lib dirs to ClassLoader
   [junit4]   2> 56818 T10 oasc.SolrResourceLoader.addToClassLoader WARN Can't find (or read) directory to add to classloader: ../../../contrib/extraction/lib (resolved as: /usr/home/hudson/hudson-slave/workspace/Lucene-Solr-Tests-4.x-Java6/solr/contrib/morphlines-core/src/test-files/solr/collection1/../../../contrib/extraction/lib).
   [junit4]   2> 56818 T10 oasc.SolrResourceLoader.addToClassLoader WARN Can't find (or read) directory to add to classloader: ../../../dist/ (resolved as: /usr/home/hudson/hudson-slave/workspace/Lucene-Solr-Tests-4.x-Java6/solr/contrib/morphlines-core/src/test-files/solr/collection1/../../../dist).
   [junit4]   2> 56819 T10 oasc.SolrResourceLoader.addToClassLoader WARN Can't find (or read) directory to add to classloader: ../../../contrib/clustering/lib/ (resolved as: /usr/home/hudson/hudson-slave/workspace/Lucene-Solr-Tests-4.x-Java6/solr/contrib/morphlines-core/src/test-files/solr/collection1/../../../contrib/clustering/lib).
   [junit4]   2> 56820 T10 oasc.SolrResourceLoader.addToClassLoader WARN Can't find (or read) directory to add to classloader: ../../../dist/ (resolved as: /usr/home/hudson/hudson-slave/workspace/Lucene-Solr-Tests-4.x-Java6/solr/contrib/morphlines-core/src/test-files/solr/collection1/../../../dist).
   [junit4]   2> 56821 T10 oasc.SolrResourceLoader.addToClassLoader WARN Can't find (or read) directory to add to classloader: ../../../contrib/langid/lib/ (resolved as: /usr/home/hudson/hudson-slave/workspace/Lucene-Solr-Tests-4.x-Java6/solr/contrib/morphlines-core/src/test-files/solr/collection1/../../../contrib/langid/lib).
   [junit4]   2> 56822 T10 oasc.SolrResourceLoader.addToClassLoader WARN Can't find (or read) directory to add to classloader: ../../../dist/ (resolved as: /usr/home/hudson/hudson-slave/workspace/Lucene-Solr-Tests-4.x-Java6/solr/contrib/morphlines-core/src/test-files/solr/collection1/../../../dist).
   [junit4]   2> 56823 T10 oasc.SolrResourceLoader.addToClassLoader WARN Can't find (or read) directory to add to classloader: ../../../contrib/velocity/lib (resolved as: /usr/home/hudson/hudson-slave/workspace/Lucene-Solr-Tests-4.x-Java6/solr/contrib/morphlines-core/src/test-files/solr/collection1/../../../contrib/velocity/lib).
   [junit4]   2> 56823 T10 oasc.SolrResourceLoader.addToClassLoader WARN Can't find (or read) directory to add to classloader: ../../../dist/ (resolved as: /usr/home/hudson/hudson-slave/workspace/Lucene-Solr-Tests-4.x-Java6/solr/contrib/morphlines-core/src/test-files/solr/collection1/../../../dist).
   [junit4]   2> 56824 T10 oasc.SolrResourceLoader.addToClassLoader WARN Can't find (or read) directory to add to classloader: /non/existent/dir/yields/warning (resolved as: /non/existent/dir/yields/warning).
   [junit4]   2> 56869 T10 oasc.SolrConfig.<init> Using Lucene MatchVersion: LUCENE_43
   [junit4]   2> 56959 T10 oasc.SolrConfig.<init> Loaded SolrConfig: solrconfig.xml
   [junit4]   2> 56960 T10 oass.IndexSchema.readSchema Reading Solr Schema from schema.xml
   [junit4]   2> 56972 T10 oass.IndexSchema.readSchema [null] Schema name=example
   [junit4]   2> 57571 T10 oass.IndexSchema.readSchema unique key field: id
   [junit4]   2> 57590 T10 oass.FileExchangeRateProvider.reload Reloading exchange rates from file currency.xml
   [junit4]   2> 57598 T10 oass.FileExchangeRateProvider.reload Reloading exchange rates from file currency.xml
   [junit4]   2> 57627 T10 oasc.SolrResourceLoader.<init> new SolrResourceLoader for directory: '/usr/home/hudson/hudson-slave/workspace/Lucene-Solr-Tests-4.x-Java6/solr/contrib/morphlines-core/src/test-files/solr/collection1/'
   [junit4]   2> 57655 T10 oasc.SolrConfig.initLibs Adding specified lib dirs to ClassLoader
   [junit4]   2> 57656 T10 oasc.SolrResourceLoader.addToClassLoader WARN Can't find (or read) directory to add to classloader: ../../../contrib/extraction/lib (resolved as: /usr/home/hudson/hudson-slave/workspace/Lucene-Solr-Tests-4.x-Java6/solr/contrib/morphlines-core/src/test-files/solr/collection1/../../../contrib/extraction/lib).
   [junit4]   2> 57657 T10 oasc.SolrResourceLoader.addToClassLoader WARN Can't find (or read) directory to add to classloader: ../../../dist/ (resolved as: /usr/home/hudson/hudson-slave/workspace/Lucene-Solr-Tests-4.x-Java6/solr/contrib/morphlines-core/src/test-files/solr/collection1/../../../dist).
   [junit4]   2> 57657 T10 oasc.SolrResourceLoader.addToClassLoader WARN Can't find (or read) directory to add to classloader: ../../../contrib/clustering/lib/ (resolved as: /usr/home/hudson/hudson-slave/workspace/Lucene-Solr-Tests-4.x-Java6/solr/contrib/morphlines-core/src/test-files/solr/collection1/../../../contrib/clustering/lib).
   [junit4]   2> 57658 T10 oasc.SolrResourceLoader.addToClassLoader WARN Can't find (or read) directory to add to classloader: ../../../dist/ (resolved as: /usr/home/hudson/hudson-slave/workspace/Lucene-Solr-Tests-4.x-Java6/solr/contrib/morphlines-core/src/test-files/solr/collection1/../../../dist).
   [junit4]   2> 57658 T10 oasc.SolrResourceLoader.addToClassLoader WARN Can't find (or read) directory to add to classloader: ../../../contrib/langid/lib/ (resolved as: /usr/home/hudson/hudson-slave/workspace/Lucene-Solr-Tests-4.x-Java6/solr/contrib/morphlines-core/src/test-files/solr/collection1/../../../contrib/langid/lib).
   [junit4]   2> 57659 T10 oasc.SolrResourceLoader.addToClassLoader WARN Can't find (or read) directory to add to classloader: ../../../dist/ (resolved as: /usr/home/hudson/hudson-slave/workspace/Lucene-Solr-Tests-4.x-Java6/solr/contrib/morphlines-core/src/test-files/solr/collection1/../../../dist).
   [junit4]   2> 57659 T10 oasc.SolrResourceLoader.addToClassLoader WARN Can't find (or read) directory to add to classloader: ../../../contrib/velocity/lib (resolved as: /usr/home/hudson/hudson-slave/workspace/Lucene-Solr-Tests-4.x-Java6/solr/contrib/morphlines-core/src/test-files/solr/collection1/../../../contrib/velocity/lib).
   [junit4]   2> 57660 T10 oasc.SolrResourceLoader.addToClassLoader WARN Can't find (or read) directory to add to classloader: ../../../dist/ (resolved as: /usr/home/hudson/hudson-slave/workspace/Lucene-Solr-Tests-4.x-Java6/solr/contrib/morphlines-core/src/test-files/solr/collection1/../../../dist).
   [junit4]   2> 57660 T10 oasc.SolrResourceLoader.addToClassLoader WARN Can't find (or read) directory to add to classloader: /non/existent/dir/yields/warning (resolved as: /non/existent/dir/yields/warning).
   [junit4]   2> 57734 T10 oasc.SolrConfig.<init> Using Lucene MatchVersion: LUCENE_43
   [junit4]   2> 57822 T10 oasc.SolrConfig.<init> Loaded SolrConfig: solrconfig.xml
   [junit4]   2> 57824 T10 oass.IndexSchema.readSchema Reading Solr Schema from schema.xml
   [junit4]   2> 57852 T10 oass.IndexSchema.readSchema [null] Schema name=example
   [junit4]   2> 58455 T10 oass.IndexSchema.readSchema unique key field: id
   [junit4]   2> 58474 T10 oass.FileExchangeRateProvider.reload Reloading exchange rates from file currency.xml
   [junit4]   2> 58481 T10 oass.FileExchangeRateProvider.reload Reloading exchange rates from file currency.xml
   [junit4]   2> 58518 T10 oasc.SolrResourceLoader.<init> new SolrResourceLoader for directory: '/usr/home/hudson/hudson-slave/workspace/Lucene-Solr-Tests-4.x-Java6/solr/contrib/morphlines-core/src/test-files/solr/collection1/'
   [junit4]   2> 58546 T10 oasc.SolrConfig.initLibs Adding specified lib dirs to ClassLoader
   [junit4]   2> 58548 T10 oasc.SolrResourceLoader.addToClassLoader WARN Can't find (or read) directory to add to classloader: ../../../contrib/extraction/lib (resolved as: /usr/home/hudson/hudson-slave/workspace/Lucene-Solr-Tests-4.x-Java6/solr/contrib/morphlines-core/src/test-files/solr/collection1/../../../contrib/extraction/lib).
   [junit4]   2> 58549 T10 oasc.SolrResourceLoader.addToClassLoader WARN Can't find (or read) directory to add to classloader: ../../../dist/ (resolved as: /usr/home/hudson/hudson-slave/workspace/Lucene-Solr-Tests-4.x-Java6/solr/contrib/morphlines-core/src/test-files/solr/collection1/../../../dist).
   [junit4]   2> 58550 T10 oasc.SolrResourceLoader.addToClassLoader WARN Can't find (or read) directory to add to classloader: ../../../contrib/clustering/lib/ (resolved as: /usr/home/hudson/hudson-slave/workspace/Lucene-Solr-Tests-4.x-Java6/solr/contrib/morphlines-core/src/test-files/solr/collection1/../../../contrib/clustering/lib).
   [junit4]   2> 58550 T10 oasc.SolrResourceLoader.addToClassLoader WARN Can't find (or read) directory to add to classloader: ../../../dist/ (resolved as: /usr/home/hudson/hudson-slave/workspace/Lucene-Solr-Tests-4.x-Java6/solr/contrib/morphlines-core/src/test-files/solr/collection1/../../../dist).
   [junit4]   2> 58551 T10 oasc.SolrResourceLoader.addToClassLoader WARN Can't find (or read) directory to add to classloader: ../../../contrib/langid/lib/ (resolved as: /usr/home/hudson/hudson-slave/workspace/Lucene-Solr-Tests-4.x-Java6/solr/contrib/morphlines-core/src/test-files/solr/collection1/../../../contrib/langid/lib).
   [junit4]   2> 58552 T10 oasc.SolrResourceLoader.addToClassLoader WARN Can't find (or read) directory to add to classloader: ../../../dist/ (resolved as: /usr/home/hudson/hudson-slave/workspace/Lucene-Solr-Tests-4.x-Java6/solr/contrib/morphlines-core/src/test-files/solr/collection1/../../../dist).
   [junit4]   2> 58553 T10 oasc.SolrResourceLoader.addToClassLoader WARN Can't find (or read) directory to add to classloader: ../../../contrib/velocity/lib (resolved as: /usr/home/hudson/hudson-slave/workspace/Lucene-Solr-Tests-4.x-Java6/solr/contrib/morphlines-core/src/test-files/solr/collection1/../../../contrib/velocity/lib).
   [junit4]   2> 58553 T10 oasc.SolrResourceLoader.addToClassLoader WARN Can't find (or read) directory to add to classloader: ../../../dist/ (resolved as: /usr/home/hudson/hudson-slave/workspace/Lucene-Solr-Tests-4.x-Java6/solr/contrib/morphlines-core/src/test-files/solr/collection1/../../../dist).
   [junit4]   2> 58554 T10 oasc.SolrResourceLoader.addToClassLoader WARN Can't find (or read) directory to add to classloader: /non/existent/dir/yields/warning (resolved as: /non/existent/dir/yields/warning).
   [junit4]   2> 58626 T10 oasc.SolrConfig.<init> Using Lucene MatchVersion: LUCENE_43
   [junit4]   2> 58715 T10 oasc.SolrConfig.<init> Loaded SolrConfig: solrconfig.xml
   [junit4]   2> 58717 T10 oass.IndexSchema.readSchema Reading Solr Schema from schema.xml
   [junit4]   2> 58745 T10 oass.IndexSchema.readSchema [null] Schema name=example
   [j

[...truncated too long message...]

wSearcher QuerySenderListener sending requests to Searcher@4dd3c6fd[collection1] main{StandardDirectoryReader(segments_4:53:nrt _m(4.8):C1)}
   [junit4]   2> 74476 T12 oasc.QuerySenderListener.newSearcher QuerySenderListener done.
   [junit4]   2> 74476 T12 oasc.SolrCore.registerSearcher [collection1] Registered new searcher Searcher@4dd3c6fd[collection1] main{StandardDirectoryReader(segments_4:53:nrt _m(4.8):C1)}
   [junit4]   2> 74477 T10 C7 oasup.LogUpdateProcessor.finish [collection1] webapp=null path=/update params={commit=true&softCommit=true&waitSearcher=true} {commit=} 0 6
   [junit4]   2> 74478 T10 C7 oasc.SolrCore.execute [collection1] webapp=null path=/select params={q=*%3A*&rows=2147483647} hits=1 status=0 QTime=0 
   [junit4]   2> 74502 T10 C7 oasup.LogUpdateProcessor.finish [collection1] webapp=null path=/update params={} {add=[testJPEG_EXIF.jpg.gz#0 (1462081819745714176)]} 0 4
   [junit4]   2> 74503 T10 C7 oasu.DirectUpdateHandler2.commit start commit{,optimize=false,openSearcher=true,waitSearcher=true,expungeDeletes=false,softCommit=true,prepareCommit=false}
   [junit4]   2> 74506 T10 C7 oass.SolrIndexSearcher.<init> Opening Searcher@2fd90a6e[collection1] main
   [junit4]   2> 74506 T10 C7 oasu.DirectUpdateHandler2.commit end_commit_flush
   [junit4]   2> 74506 T12 oasc.QuerySenderListener.newSearcher QuerySenderListener sending requests to Searcher@2fd90a6e[collection1] main{StandardDirectoryReader(segments_4:55:nrt _m(4.8):C1 _n(4.8):C1)}
   [junit4]   2> 74507 T12 oasc.QuerySenderListener.newSearcher QuerySenderListener done.
   [junit4]   2> 74508 T12 oasc.SolrCore.registerSearcher [collection1] Registered new searcher Searcher@2fd90a6e[collection1] main{StandardDirectoryReader(segments_4:55:nrt _m(4.8):C1 _n(4.8):C1)}
   [junit4]   2> 74508 T10 C7 oasup.LogUpdateProcessor.finish [collection1] webapp=null path=/update params={commit=true&softCommit=true&waitSearcher=true} {commit=} 0 5
   [junit4]   2> 74509 T10 C7 oasc.SolrCore.execute [collection1] webapp=null path=/select params={q=*%3A*&rows=2147483647} hits=2 status=0 QTime=0 
   [junit4]   2> 74535 T10 C7 oasup.LogUpdateProcessor.finish [collection1] webapp=null path=/update params={} {add=[f45029e6-74a7-4719-96f8-55aa70c12997#0 (1462081819780317184)]} 0 5
   [junit4]   2> 74537 T10 C7 oasu.DirectUpdateHandler2.commit start commit{,optimize=false,openSearcher=true,waitSearcher=true,expungeDeletes=false,softCommit=true,prepareCommit=false}
   [junit4]   2> 74539 T10 C7 oass.SolrIndexSearcher.<init> Opening Searcher@4cdd09a6[collection1] main
   [junit4]   2> 74540 T10 C7 oasu.DirectUpdateHandler2.commit end_commit_flush
   [junit4]   2> 74540 T12 oasc.QuerySenderListener.newSearcher QuerySenderListener sending requests to Searcher@4cdd09a6[collection1] main{StandardDirectoryReader(segments_4:57:nrt _m(4.8):C1 _n(4.8):C1 _o(4.8):C1)}
   [junit4]   2> 74541 T12 oasc.QuerySenderListener.newSearcher QuerySenderListener done.
   [junit4]   2> 74541 T12 oasc.SolrCore.registerSearcher [collection1] Registered new searcher Searcher@4cdd09a6[collection1] main{StandardDirectoryReader(segments_4:57:nrt _m(4.8):C1 _n(4.8):C1 _o(4.8):C1)}
   [junit4]   2> 74542 T10 C7 oasup.LogUpdateProcessor.finish [collection1] webapp=null path=/update params={commit=true&softCommit=true&waitSearcher=true} {commit=} 0 6
   [junit4]   2> 74543 T10 C7 oasc.SolrCore.execute [collection1] webapp=null path=/select params={q=*%3A*&rows=2147483647} hits=3 status=0 QTime=1 
   [junit4]   2> 74544 T10 C7 oasu.DirectUpdateHandler2.commit start commit{,optimize=false,openSearcher=true,waitSearcher=true,expungeDeletes=false,softCommit=true,prepareCommit=false}
   [junit4]   2> 74544 T10 C7 oasc.SolrCore.openNewSearcher SolrIndexSearcher has not changed - not re-opening: org.apache.solr.search.SolrIndexSearcher
   [junit4]   2> 74545 T10 C7 oasu.DirectUpdateHandler2.commit end_commit_flush
   [junit4]   2> 74545 T12 oasc.SolrCore.registerSearcher [collection1] Registered new searcher Searcher@4cdd09a6[collection1] main{StandardDirectoryReader(segments_4:57:nrt _m(4.8):C1 _n(4.8):C1 _o(4.8):C1)}
   [junit4]   2> 74546 T10 C7 oasup.LogUpdateProcessor.finish [collection1] webapp=null path=/update params={commit=true&softCommit=true&waitSearcher=true} {commit=} 0 1
   [junit4]   2> 74546 T10 C7 oasc.SolrCore.execute [collection1] webapp=null path=/select params={q=*%3A*&rows=2147483647} hits=3 status=0 QTime=0 
   [junit4]   2> 74547 T10 oas.SolrTestCaseJ4.tearDown ###Ending testSolrCellJPGCompressed
   [junit4]   2> 74551 T10 oas.SolrTestCaseJ4.deleteCore ###deleteCore
   [junit4]   2> 74551 T10 oasc.CoreContainer.shutdown Shutting down CoreContainer instance=1294965028
   [junit4]   2> 74552 T10 oasc.SolrCore.close [collection1]  CLOSING SolrCore org.apache.solr.core.SolrCore@520b1684
   [junit4]   2> 74554 T10 oasu.DirectUpdateHandler2.close closing DirectUpdateHandler2{commits=36,autocommit maxTime=60000ms,autocommits=0,soft autocommit maxTime=1000ms,soft autocommits=0,optimizes=0,rollbacks=0,expungeDeletes=0,docsPending=3,adds=0,deletesById=0,deletesByQuery=0,errors=0,cumulative_adds=41,cumulative_deletesById=0,cumulative_deletesByQuery=9,cumulative_errors=0,transaction_logs_total_size=52492,transaction_logs_total_number=9}
   [junit4]   2> 74555 T10 oasu.SolrCoreState.decrefSolrCoreState Closing SolrCoreState
   [junit4]   2> 74555 T10 oasu.DefaultSolrCoreState.closeIndexWriter SolrCoreState ref count has reached 0 - closing IndexWriter
   [junit4]   2> 74556 T10 oasu.DefaultSolrCoreState.closeIndexWriter closing IndexWriter with IndexWriterCloser
   [junit4]   2> 74565 T10 C7 oasc.SolrDeletionPolicy.onCommit SolrDeletionPolicy.onCommit: commits: num=2
   [junit4]   2> 		commit{dir=BaseDirectoryWrapper(RAMDirectory@7c40627c lockFactory=NativeFSLockFactory@/usr/home/hudson/hudson-slave/workspace/Lucene-Solr-Tests-4.x-Java6/solr/build/contrib/solr-morphlines-cell/test/J0/./solrtest-SolrCellMorphlineTest-1394349807886/index),segFN=segments_4,generation=4}
   [junit4]   2> 		commit{dir=BaseDirectoryWrapper(RAMDirectory@7c40627c lockFactory=NativeFSLockFactory@/usr/home/hudson/hudson-slave/workspace/Lucene-Solr-Tests-4.x-Java6/solr/build/contrib/solr-morphlines-cell/test/J0/./solrtest-SolrCellMorphlineTest-1394349807886/index),segFN=segments_5,generation=5}
   [junit4]   2> 74566 T10 C7 oasc.SolrDeletionPolicy.updateCommits newest commit generation = 5
   [junit4]   2> 74568 T10 oasc.SolrCore.closeSearcher [collection1] Closing main searcher on request.
   [junit4]   2> 74568 T10 oasc.CachingDirectoryFactory.close Closing MockDirectoryFactory - 2 directories currently being tracked
   [junit4]   2> 74569 T10 oasc.CachingDirectoryFactory.closeCacheValue looking to close /usr/home/hudson/hudson-slave/workspace/Lucene-Solr-Tests-4.x-Java6/solr/build/contrib/solr-morphlines-cell/test/J0/./solrtest-SolrCellMorphlineTest-1394349807886 [CachedDir<<refCount=0;path=/usr/home/hudson/hudson-slave/workspace/Lucene-Solr-Tests-4.x-Java6/solr/build/contrib/solr-morphlines-cell/test/J0/./solrtest-SolrCellMorphlineTest-1394349807886;done=false>>]
   [junit4]   2> 74570 T10 oasc.CachingDirectoryFactory.close Closing directory: /usr/home/hudson/hudson-slave/workspace/Lucene-Solr-Tests-4.x-Java6/solr/build/contrib/solr-morphlines-cell/test/J0/./solrtest-SolrCellMorphlineTest-1394349807886
   [junit4]   2> 74571 T10 oasc.CachingDirectoryFactory.closeCacheValue looking to close /usr/home/hudson/hudson-slave/workspace/Lucene-Solr-Tests-4.x-Java6/solr/build/contrib/solr-morphlines-cell/test/J0/./solrtest-SolrCellMorphlineTest-1394349807886/index [CachedDir<<refCount=0;path=/usr/home/hudson/hudson-slave/workspace/Lucene-Solr-Tests-4.x-Java6/solr/build/contrib/solr-morphlines-cell/test/J0/./solrtest-SolrCellMorphlineTest-1394349807886/index;done=false>>]
   [junit4]   2> 74571 T10 oasc.CachingDirectoryFactory.close Closing directory: /usr/home/hudson/hudson-slave/workspace/Lucene-Solr-Tests-4.x-Java6/solr/build/contrib/solr-morphlines-cell/test/J0/./solrtest-SolrCellMorphlineTest-1394349807886/index
   [junit4]   2> NOTE: test params are: codec=Lucene42, sim=DefaultSimilarity, locale=ar_LB, timezone=Etc/GMT+5
   [junit4]   2> NOTE: FreeBSD 9.1-RELEASE-p3 amd64/Sun Microsystems Inc. 1.6.0_32 (64-bit)/cpus=16,threads=1,free=235757824,total=434241536
   [junit4]   2> NOTE: All tests run in this JVM: [SolrCellMorphlineTest]
   [junit4] Completed in 75.35s, 5 tests, 1 failure <<< FAILURES!

[...truncated 9 lines...]
BUILD FAILED
/usr/home/hudson/hudson-slave/workspace/Lucene-Solr-Tests-4.x-Java6/build.xml:471: The following error occurred while executing this line:
/usr/home/hudson/hudson-slave/workspace/Lucene-Solr-Tests-4.x-Java6/build.xml:451: The following error occurred while executing this line:
/usr/home/hudson/hudson-slave/workspace/Lucene-Solr-Tests-4.x-Java6/build.xml:39: The following error occurred while executing this line:
/usr/home/hudson/hudson-slave/workspace/Lucene-Solr-Tests-4.x-Java6/extra-targets.xml:37: The following error occurred while executing this line:
/usr/home/hudson/hudson-slave/workspace/Lucene-Solr-Tests-4.x-Java6/solr/build.xml:209: The following error occurred while executing this line:
/usr/home/hudson/hudson-slave/workspace/Lucene-Solr-Tests-4.x-Java6/solr/common-build.xml:440: The following error occurred while executing this line:
/usr/home/hudson/hudson-slave/workspace/Lucene-Solr-Tests-4.x-Java6/solr/common-build.xml:490: The following error occurred while executing this line:
/usr/home/hudson/hudson-slave/workspace/Lucene-Solr-Tests-4.x-Java6/lucene/common-build.xml:1278: The following error occurred while executing this line:
/usr/home/hudson/hudson-slave/workspace/Lucene-Solr-Tests-4.x-Java6/lucene/common-build.xml:911: There were test failures: 1 suite, 5 tests, 1 failure

Total time: 95 minutes 36 seconds
Build step 'Invoke Ant' marked build as failure
Archiving artifacts
Recording test results
Email was triggered for: Failure
Sending email for trigger: Failure



[JENKINS] Lucene-Solr-Tests-4.x-Java6 - Build # 2331 - Still Failing

Posted by Apache Jenkins Server <je...@builds.apache.org>.
Build: https://builds.apache.org/job/Lucene-Solr-Tests-4.x-Java6/2331/

1 tests failed.
FAILED:  org.apache.solr.cloud.OverseerTest.testOverseerFailure

Error Message:
Could not register as the leader because creating the ephemeral registration node in ZooKeeper failed

Stack Trace:
org.apache.solr.common.SolrException: Could not register as the leader because creating the ephemeral registration node in ZooKeeper failed
	at __randomizedtesting.SeedInfo.seed([DE92FEACCB9C6927:DA9A715FD9398606]:0)
	at org.apache.solr.cloud.ShardLeaderElectionContextBase.runLeaderProcess(ElectionContext.java:135)
	at org.apache.solr.cloud.LeaderElector.runIamLeaderProcess(LeaderElector.java:164)
	at org.apache.solr.cloud.LeaderElector.checkIfIamLeader(LeaderElector.java:108)
	at org.apache.solr.cloud.LeaderElector.checkIfIamLeader(LeaderElector.java:156)
	at org.apache.solr.cloud.LeaderElector.joinElection(LeaderElector.java:289)
	at org.apache.solr.cloud.OverseerTest$MockZKController.publishState(OverseerTest.java:155)
	at org.apache.solr.cloud.OverseerTest.testOverseerFailure(OverseerTest.java:666)
	at sun.reflect.NativeMethodAccessorImpl.invoke0(Native Method)
	at sun.reflect.NativeMethodAccessorImpl.invoke(NativeMethodAccessorImpl.java:57)
	at sun.reflect.DelegatingMethodAccessorImpl.invoke(DelegatingMethodAccessorImpl.java:43)
	at java.lang.reflect.Method.invoke(Method.java:616)
	at com.carrotsearch.randomizedtesting.RandomizedRunner.invoke(RandomizedRunner.java:1559)
	at com.carrotsearch.randomizedtesting.RandomizedRunner.access$600(RandomizedRunner.java:79)
	at com.carrotsearch.randomizedtesting.RandomizedRunner$6.evaluate(RandomizedRunner.java:737)
	at com.carrotsearch.randomizedtesting.RandomizedRunner$7.evaluate(RandomizedRunner.java:773)
	at com.carrotsearch.randomizedtesting.RandomizedRunner$8.evaluate(RandomizedRunner.java:787)
	at com.carrotsearch.randomizedtesting.rules.SystemPropertiesRestoreRule$1.evaluate(SystemPropertiesRestoreRule.java:53)
	at org.apache.lucene.util.TestRuleSetupTeardownChained$1.evaluate(TestRuleSetupTeardownChained.java:50)
	at org.apache.lucene.util.TestRuleFieldCacheSanity$1.evaluate(TestRuleFieldCacheSanity.java:51)
	at org.apache.lucene.util.AbstractBeforeAfterRule$1.evaluate(AbstractBeforeAfterRule.java:46)
	at com.carrotsearch.randomizedtesting.rules.SystemPropertiesInvariantRule$1.evaluate(SystemPropertiesInvariantRule.java:55)
	at org.apache.lucene.util.TestRuleThreadAndTestName$1.evaluate(TestRuleThreadAndTestName.java:49)
	at org.apache.lucene.util.TestRuleIgnoreAfterMaxFailures$1.evaluate(TestRuleIgnoreAfterMaxFailures.java:70)
	at org.apache.lucene.util.TestRuleMarkFailure$1.evaluate(TestRuleMarkFailure.java:48)
	at com.carrotsearch.randomizedtesting.rules.StatementAdapter.evaluate(StatementAdapter.java:36)
	at com.carrotsearch.randomizedtesting.ThreadLeakControl$StatementRunner.run(ThreadLeakControl.java:358)
	at com.carrotsearch.randomizedtesting.ThreadLeakControl.forkTimeoutingTask(ThreadLeakControl.java:782)
	at com.carrotsearch.randomizedtesting.ThreadLeakControl$3.evaluate(ThreadLeakControl.java:442)
	at com.carrotsearch.randomizedtesting.RandomizedRunner.runSingleTest(RandomizedRunner.java:746)
	at com.carrotsearch.randomizedtesting.RandomizedRunner$3.evaluate(RandomizedRunner.java:648)
	at com.carrotsearch.randomizedtesting.RandomizedRunner$4.evaluate(RandomizedRunner.java:682)
	at com.carrotsearch.randomizedtesting.RandomizedRunner$5.evaluate(RandomizedRunner.java:693)
	at com.carrotsearch.randomizedtesting.rules.StatementAdapter.evaluate(StatementAdapter.java:36)
	at com.carrotsearch.randomizedtesting.rules.SystemPropertiesRestoreRule$1.evaluate(SystemPropertiesRestoreRule.java:53)
	at org.apache.lucene.util.AbstractBeforeAfterRule$1.evaluate(AbstractBeforeAfterRule.java:46)
	at org.apache.lucene.util.TestRuleStoreClassName$1.evaluate(TestRuleStoreClassName.java:42)
	at com.carrotsearch.randomizedtesting.rules.SystemPropertiesInvariantRule$1.evaluate(SystemPropertiesInvariantRule.java:55)
	at com.carrotsearch.randomizedtesting.rules.NoShadowingOrOverridesOnMethodsRule$1.evaluate(NoShadowingOrOverridesOnMethodsRule.java:39)
	at com.carrotsearch.randomizedtesting.rules.NoShadowingOrOverridesOnMethodsRule$1.evaluate(NoShadowingOrOverridesOnMethodsRule.java:39)
	at com.carrotsearch.randomizedtesting.rules.StatementAdapter.evaluate(StatementAdapter.java:36)
	at org.apache.lucene.util.TestRuleAssertionsRequired$1.evaluate(TestRuleAssertionsRequired.java:43)
	at org.apache.lucene.util.TestRuleMarkFailure$1.evaluate(TestRuleMarkFailure.java:48)
	at org.apache.lucene.util.TestRuleIgnoreAfterMaxFailures$1.evaluate(TestRuleIgnoreAfterMaxFailures.java:70)
	at org.apache.lucene.util.TestRuleIgnoreTestSuites$1.evaluate(TestRuleIgnoreTestSuites.java:55)
	at com.carrotsearch.randomizedtesting.rules.StatementAdapter.evaluate(StatementAdapter.java:36)
	at com.carrotsearch.randomizedtesting.ThreadLeakControl$StatementRunner.run(ThreadLeakControl.java:358)
	at java.lang.Thread.run(Thread.java:679)
Caused by: org.apache.solr.common.SolrException: org.apache.zookeeper.KeeperException$NodeExistsException: KeeperErrorCode = NodeExists for /collections/collection1/leaders/shard1
	at org.apache.solr.common.util.RetryUtil.retryOnThrowable(RetryUtil.java:40)
	at org.apache.solr.cloud.ShardLeaderElectionContextBase.runLeaderProcess(ElectionContext.java:122)
	... 46 more
Caused by: org.apache.zookeeper.KeeperException$NodeExistsException: KeeperErrorCode = NodeExists for /collections/collection1/leaders/shard1
	at org.apache.zookeeper.KeeperException.create(KeeperException.java:119)
	at org.apache.zookeeper.KeeperException.create(KeeperException.java:51)
	at org.apache.zookeeper.ZooKeeper.create(ZooKeeper.java:783)
	at org.apache.solr.common.cloud.SolrZkClient$10.execute(SolrZkClient.java:431)
	at org.apache.solr.common.cloud.ZkCmdExecutor.retryOperation(ZkCmdExecutor.java:73)
	at org.apache.solr.common.cloud.SolrZkClient.makePath(SolrZkClient.java:428)
	at org.apache.solr.common.cloud.SolrZkClient.makePath(SolrZkClient.java:385)
	at org.apache.solr.common.cloud.SolrZkClient.makePath(SolrZkClient.java:372)
	at org.apache.solr.cloud.ShardLeaderElectionContextBase$1.execute(ElectionContext.java:127)
	at org.apache.solr.common.util.RetryUtil.retryOnThrowable(RetryUtil.java:34)
	... 47 more




Build Log:
[...truncated 9894 lines...]
   [junit4] Suite: org.apache.solr.cloud.OverseerTest
   [junit4]   2> 1165751 T4787 oas.SolrTestCaseJ4.buildSSLConfig Randomized ssl (true) and clientAuth (true)
   [junit4]   2> 1165752 T4787 oas.SolrTestCaseJ4.initCore ####initCore
   [junit4]   2> Creating dataDir: /usr/home/hudson/hudson-slave/workspace/Lucene-Solr-Tests-4.x-Java6/solr/build/solr-core/test/J0/./solrtest-OverseerTest-1394272556206
   [junit4]   2> 1165753 T4787 oas.SolrTestCaseJ4.initCore ####initCore end
   [junit4]   2> 1165756 T4787 oas.SolrTestCaseJ4.setUp ###Starting testShardAssignmentBigger
   [junit4]   2> 1165757 T4787 oasc.ZkTestServer.run STARTING ZK TEST SERVER
   [junit4]   2> 1165757 T4788 oasc.ZkTestServer$ZKServerMain.runFromConfig Starting server
   [junit4]   2> 1165858 T4787 oasc.ZkTestServer.run start zk server on port:33715
   [junit4]   2> 1165859 T4787 oascc.ConnectionManager.waitForConnected Waiting for client to connect to ZooKeeper
   [junit4]   2> 1165887 T4794 oascc.ConnectionManager.process Watcher org.apache.solr.common.cloud.ConnectionManager@3a044805 name:ZooKeeperConnection Watcher:127.0.0.1:33715 got event WatchedEvent state:SyncConnected type:None path:null path:null type:None
   [junit4]   2> 1165888 T4787 oascc.ConnectionManager.waitForConnected Client is connected to ZooKeeper
   [junit4]   2> 1165891 T4787 oascc.ConnectionManager.waitForConnected Waiting for client to connect to ZooKeeper
   [junit4]   2> 1165901 T4796 oascc.ConnectionManager.process Watcher org.apache.solr.common.cloud.ConnectionManager@3ee3aee9 name:ZooKeeperConnection Watcher:127.0.0.1:33715 got event WatchedEvent state:SyncConnected type:None path:null path:null type:None
   [junit4]   2> 1165901 T4787 oascc.ConnectionManager.waitForConnected Client is connected to ZooKeeper
   [junit4]   2> 1165901 T4787 oascc.SolrZkClient.makePath makePath: /solr
   [junit4]   2> 1165906 T4787 oascc.ConnectionManager.waitForConnected Waiting for client to connect to ZooKeeper
   [junit4]   2> 1165914 T4798 oascc.ConnectionManager.process Watcher org.apache.solr.common.cloud.ConnectionManager@1fb750cf name:ZooKeeperConnection Watcher:127.0.0.1:33715/solr got event WatchedEvent state:SyncConnected type:None path:null path:null type:None
   [junit4]   2> 1165915 T4787 oascc.ConnectionManager.waitForConnected Client is connected to ZooKeeper
   [junit4]   2> 1165915 T4787 oascc.SolrZkClient.makePath makePath: /live_nodes
   [junit4]   2> 1165918 T4787 oascc.ConnectionManager.waitForConnected Waiting for client to connect to ZooKeeper
   [junit4]   2> 1165919 T4800 oascc.ConnectionManager.process Watcher org.apache.solr.common.cloud.ConnectionManager@48d89331 name:ZooKeeperConnection Watcher:127.0.0.1:33715/solr got event WatchedEvent state:SyncConnected type:None path:null path:null type:None
   [junit4]   2> 1165920 T4787 oascc.ConnectionManager.waitForConnected Client is connected to ZooKeeper
   [junit4]   2> 1165921 T4787 oascc.SolrZkClient.makePath makePath: /overseer_elect
   [junit4]   2> 1165923 T4787 oascc.SolrZkClient.makePath makePath: /overseer_elect/election
   [junit4]   2> 1165927 T4787 oasc.OverseerElectionContext.runLeaderProcess I am going to be the leader 127.0.0.1:33715_solr
   [junit4]   2> 1165928 T4787 oascc.SolrZkClient.makePath makePath: /overseer_elect/leader
   [junit4]   2> 1165930 T4787 oasc.Overseer.start Overseer (id=91375046244237315-127.0.0.1:33715_solr-n_0000000000) starting
   [junit4]   2> 1165932 T4787 oascc.SolrZkClient.makePath makePath: /overseer/queue
   [junit4]   2> 1165935 T4787 oascc.SolrZkClient.makePath makePath: /overseer/queue-work
   [junit4]   2> 1165939 T4787 oascc.SolrZkClient.makePath makePath: /overseer/collection-queue-work
   [junit4]   2> 1165942 T4802 oasc.OverseerCollectionProcessor.run Process current queue of collection creations
   [junit4]   2> 1165942 T4787 oascc.SolrZkClient.makePath makePath: /clusterstate.json
   [junit4]   2> 1165943 T4801 oasc.Overseer$ClusterStateUpdater.run Starting to work on the main queue
   [junit4]   2> 1165943 T4802 oasc.OverseerCollectionProcessor.prioritizeOverseerNodes prioritizing overseer nodes
   [junit4]   2> 1165945 T4787 oascc.SolrZkClient.makePath makePath: /aliases.json
   [junit4]   2> 1165954 T4787 oascc.ZkStateReader.createClusterStateWatchersAndUpdate Updating cluster state from ZooKeeper... 
   [junit4]   2> 1165957 T4787 oascc.ConnectionManager.waitForConnected Waiting for client to connect to ZooKeeper
   [junit4]   2> 1165958 T4804 oascc.ConnectionManager.process Watcher org.apache.solr.common.cloud.ConnectionManager@138380f4 name:ZooKeeperConnection Watcher:127.0.0.1:33715/solr got event WatchedEvent state:SyncConnected type:None path:null path:null type:None
   [junit4]   2> 1165959 T4787 oascc.ConnectionManager.waitForConnected Client is connected to ZooKeeper
   [junit4]   2> 1165961 T4787 oascc.ZkStateReader.createClusterStateWatchersAndUpdate Updating cluster state from ZooKeeper... 
   [junit4]   2> 1165963 T4787 oascc.SolrZkClient.makePath makePath: /live_nodes/node0
   [junit4]   2> 1165965 T4798 oascc.ZkStateReader$3.process Updating live nodes... (1)
   [junit4]   2> 1165965 T4804 oascc.ZkStateReader$3.process Updating live nodes... (1)
   [junit4]   2> 1165966 T4787 oascc.ConnectionManager.waitForConnected Waiting for client to connect to ZooKeeper
   [junit4]   2> 1165968 T4806 oascc.ConnectionManager.process Watcher org.apache.solr.common.cloud.ConnectionManager@1fcff905 name:ZooKeeperConnection Watcher:127.0.0.1:33715/solr got event WatchedEvent state:SyncConnected type:None path:null path:null type:None
   [junit4]   2> 1165969 T4787 oascc.ConnectionManager.waitForConnected Client is connected to ZooKeeper
   [junit4]   2> 1165970 T4787 oascc.ZkStateReader.createClusterStateWatchersAndUpdate Updating cluster state from ZooKeeper... 
   [junit4]   2> 1165972 T4787 oascc.SolrZkClient.makePath makePath: /live_nodes/node1
   [junit4]   2> 1165974 T4798 oascc.ZkStateReader$3.process Updating live nodes... (2)
   [junit4]   2> 1165975 T4804 oascc.ZkStateReader$3.process Updating live nodes... (2)
   [junit4]   2> 1165974 T4806 oascc.ZkStateReader$3.process Updating live nodes... (2)
   [junit4]   2> 1165975 T4787 oascc.ConnectionManager.waitForConnected Waiting for client to connect to ZooKeeper
   [junit4]   2> 1165977 T4808 oascc.ConnectionManager.process Watcher org.apache.solr.common.cloud.ConnectionManager@22d6ab52 name:ZooKeeperConnection Watcher:127.0.0.1:33715/solr got event WatchedEvent state:SyncConnected type:None path:null path:null type:None
   [junit4]   2> 1165977 T4787 oascc.ConnectionManager.waitForConnected Client is connected to ZooKeeper
   [junit4]   2> 1165978 T4787 oascc.ZkStateReader.createClusterStateWatchersAndUpdate Updating cluster state from ZooKeeper... 
   [junit4]   2> 1165980 T4787 oascc.SolrZkClient.makePath makePath: /live_nodes/node2
   [junit4]   2> 1165983 T4798 oascc.ZkStateReader$3.process Updating live nodes... (3)
   [junit4]   2> 1165983 T4808 oascc.ZkStateReader$3.process Updating live nodes... (3)
   [junit4]   2> 1165983 T4804 oascc.ZkStateReader$3.process Updating live nodes... (3)
   [junit4]   2> 1165983 T4806 oascc.ZkStateReader$3.process Updating live nodes... (3)
   [junit4]   2> 1165984 T4787 oascc.ConnectionManager.waitForConnected Waiting for client to connect to ZooKeeper
   [junit4]   2> 1165985 T4810 oascc.ConnectionManager.process Watcher org.apache.solr.common.cloud.ConnectionManager@71b480d5 name:ZooKeeperConnection Watcher:127.0.0.1:33715/solr got event WatchedEvent state:SyncConnected type:None path:null path:null type:None
   [junit4]   2> 1165986 T4787 oascc.ConnectionManager.waitForConnected Client is connected to ZooKeeper
   [junit4]   2> 1165987 T4787 oascc.ZkStateReader.createClusterStateWatchersAndUpdate Updating cluster state from ZooKeeper... 
   [junit4]   2> 1165989 T4787 oascc.SolrZkClient.makePath makePath: /live_nodes/node3
   [junit4]   2> 1165992 T4806 oascc.ZkStateReader$3.process Updating live nodes... (4)
   [junit4]   2> 1165992 T4810 oascc.ZkStateReader$3.process Updating live nodes... (4)
   [junit4]   2> 1165992 T4798 oascc.ZkStateReader$3.process Updating live nodes... (4)
   [junit4]   2> 1165992 T4804 oascc.ZkStateReader$3.process Updating live nodes... (4)
   [junit4]   2> 1165992 T4808 oascc.ZkStateReader$3.process Updating live nodes... (4)
   [junit4]   2> 1165992 T4787 oascc.ConnectionManager.waitForConnected Waiting for client to connect to ZooKeeper
   [junit4]   2> 1165994 T4812 oascc.ConnectionManager.process Watcher org.apache.solr.common.cloud.ConnectionManager@1b66555 name:ZooKeeperConnection Watcher:127.0.0.1:33715/solr got event WatchedEvent state:SyncConnected type:None path:null path:null type:None
   [junit4]   2> 1165994 T4787 oascc.ConnectionManager.waitForConnected Client is connected to ZooKeeper
   [junit4]   2> 1165995 T4787 oascc.ZkStateReader.createClusterStateWatchersAndUpdate Updating cluster state from ZooKeeper... 
   [junit4]   2> 1165997 T4787 oascc.SolrZkClient.makePath makePath: /live_nodes/node4
   [junit4]   2> 1166000 T4808 oascc.ZkStateReader$3.process Updating live nodes... (5)
   [junit4]   2> 1166000 T4810 oascc.ZkStateReader$3.process Updating live nodes... (5)
   [junit4]   2> 1166000 T4806 oascc.ZkStateReader$3.process Updating live nodes... (5)
   [junit4]   2> 1166000 T4804 oascc.ZkStateReader$3.process Updating live nodes... (5)
   [junit4]   2> 1166000 T4812 oascc.ZkStateReader$3.process Updating live nodes... (5)
   [junit4]   2> 1166000 T4798 oascc.ZkStateReader$3.process Updating live nodes... (5)
   [junit4]   2> 1166001 T4787 oascc.ConnectionManager.waitForConnected Waiting for client to connect to ZooKeeper
   [junit4]   2> 1166003 T4814 oascc.ConnectionManager.process Watcher org.apache.solr.common.cloud.ConnectionManager@2c86af9b name:ZooKeeperConnection Watcher:127.0.0.1:33715/solr got event WatchedEvent state:SyncConnected type:None path:null path:null type:None
   [junit4]   2> 1166003 T4787 oascc.ConnectionManager.waitForConnected Client is connected to ZooKeeper
   [junit4]   2> 1166004 T4787 oascc.ZkStateReader.createClusterStateWatchersAndUpdate Updating cluster state from ZooKeeper... 
   [junit4]   2> 1166006 T4787 oascc.SolrZkClient.makePath makePath: /live_nodes/node5
   [junit4]   2> 1166009 T4810 oascc.ZkStateReader$3.process Updating live nodes... (6)
   [junit4]   2> 1166009 T4808 oascc.ZkStateReader$3.process Updating live nodes... (6)
   [junit4]   2> 1166010 T4812 oascc.ZkStateReader$3.process Updating live nodes... (6)
   [junit4]   2> 1166009 T4814 oascc.ZkStateReader$3.process Updating live nodes... (6)
   [junit4]   2> 1166009 T4806 oascc.ZkStateReader$3.process Updating live nodes... (6)
   [junit4]   2> 1166009 T4804 oascc.ZkStateReader$3.process Updating live nodes... (6)
   [junit4]   2> 1166009 T4798 oascc.ZkStateReader$3.process Updating live nodes... (6)
   [junit4]   2> 1166010 T4787 oascc.ConnectionManager.waitForConnected Waiting for client to connect to ZooKeeper
   [junit4]   2> 1166012 T4816 oascc.ConnectionManager.process Watcher org.apache.solr.common.cloud.ConnectionManager@2cf057e6 name:ZooKeeperConnection Watcher:127.0.0.1:33715/solr got event WatchedEvent state:SyncConnected type:None path:null path:null type:None
   [junit4]   2> 1166012 T4787 oascc.ConnectionManager.waitForConnected Client is connected to ZooKeeper
   [junit4]   2> 1166013 T4787 oascc.ZkStateReader.createClusterStateWatchersAndUpdate Updating cluster state from ZooKeeper... 
   [junit4]   2> 1166015 T4787 oascc.SolrZkClient.makePath makePath: /live_nodes/node6
   [junit4]   2> 1166018 T4804 oascc.ZkStateReader$3.process Updating live nodes... (7)
   [junit4]   2> 1166018 T4798 oascc.ZkStateReader$3.process Updating live nodes... (7)
   [junit4]   2> 1166019 T4806 oascc.ZkStateReader$3.process Updating live nodes... (7)
   [junit4]   2> 1166019 T4814 oascc.ZkStateReader$3.process Updating live nodes... (7)
   [junit4]   2> 1166018 T4816 oascc.ZkStateReader$3.process Updating live nodes... (7)
   [junit4]   2> 1166018 T4812 oascc.ZkStateReader$3.process Updating live nodes... (7)
   [junit4]   2> 1166018 T4808 oascc.ZkStateReader$3.process Updating live nodes... (7)
   [junit4]   2> 1166018 T4810 oascc.ZkStateReader$3.process Updating live nodes... (7)
   [junit4]   2> 1166019 T4787 oascc.ConnectionManager.waitForConnected Waiting for client to connect to ZooKeeper
   [junit4]   2> 1166021 T4818 oascc.ConnectionManager.process Watcher org.apache.solr.common.cloud.ConnectionManager@3c826756 name:ZooKeeperConnection Watcher:127.0.0.1:33715/solr got event WatchedEvent state:SyncConnected type:None path:null path:null type:None
   [junit4]   2> 1166021 T4787 oascc.ConnectionManager.waitForConnected Client is connected to ZooKeeper
   [junit4]   2> 1166022 T4787 oascc.ZkStateReader.createClusterStateWatchersAndUpdate Updating cluster state from ZooKeeper... 
   [junit4]   2> 1166024 T4787 oascc.SolrZkClient.makePath makePath: /live_nodes/node7
   [junit4]   2> 1166027 T4798 oascc.ZkStateReader$3.process Updating live nodes... (8)
   [junit4]   2> 1166028 T4810 oascc.ZkStateReader$3.process Updating live nodes... (8)
   [junit4]   2> 1166028 T4818 oascc.ZkStateReader$3.process Updating live nodes... (8)
   [junit4]   2> 1166028 T4804 oascc.ZkStateReader$3.process Updating live nodes... (8)
   [junit4]   2> 1166029 T4787 oascc.ConnectionManager.waitForConnected Waiting for client to connect to ZooKeeper
   [junit4]   2> 1166028 T4812 oascc.ZkStateReader$3.process Updating live nodes... (8)
   [junit4]   2> 1166028 T4814 oascc.ZkStateReader$3.process Updating live nodes... (8)
   [junit4]   2> 1166028 T4806 oascc.ZkStateReader$3.process Updating live nodes... (8)
   [junit4]   2> 1166028 T4808 oascc.ZkStateReader$3.process Updating live nodes... (8)
   [junit4]   2> 1166028 T4816 oascc.ZkStateReader$3.process Updating live nodes... (8)
   [junit4]   2> 1166030 T4820 oascc.ConnectionManager.process Watcher org.apache.solr.common.cloud.ConnectionManager@7ab92070 name:ZooKeeperConnection Watcher:127.0.0.1:33715/solr got event WatchedEvent state:SyncConnected type:None path:null path:null type:None
   [junit4]   2> 1166031 T4787 oascc.ConnectionManager.waitForConnected Client is connected to ZooKeeper
   [junit4]   2> 1166032 T4787 oascc.ZkStateReader.createClusterStateWatchersAndUpdate Updating cluster state from ZooKeeper... 
   [junit4]   2> 1166034 T4787 oascc.SolrZkClient.makePath makePath: /live_nodes/node8
   [junit4]   2> 1166037 T4816 oascc.ZkStateReader$3.process Updating live nodes... (9)
   [junit4]   2> 1166037 T4818 oascc.ZkStateReader$3.process Updating live nodes... (9)
   [junit4]   2> 1166037 T4810 oascc.ZkStateReader$3.process Updating live nodes... (9)
   [junit4]   2> 1166038 T4812 oascc.ZkStateReader$3.process Updating live nodes... (9)
   [junit4]   2> 1166038 T4808 oascc.ZkStateReader$3.process Updating live nodes... (9)
   [junit4]   2> 1166037 T4820 oascc.ZkStateReader$3.process Updating live nodes... (9)
   [junit4]   2> 1166037 T4814 oascc.ZkStateReader$3.process Updating live nodes... (9)
   [junit4]   2> 1166037 T4806 oascc.ZkStateReader$3.process Updating live nodes... (9)
   [junit4]   2> 1166037 T4804 oascc.ZkStateReader$3.process Updating live nodes... (9)
   [junit4]   2> 1166037 T4798 oascc.ZkStateReader$3.process Updating live nodes... (9)
   [junit4]   2> 1166038 T4787 oascc.ConnectionManager.waitForConnected Waiting for client to connect to ZooKeeper
   [junit4]   2> 1166040 T4822 oascc.ConnectionManager.process Watcher org.apache.solr.common.cloud.ConnectionManager@15529275 name:ZooKeeperConnection Watcher:127.0.0.1:33715/solr got event WatchedEvent state:SyncConnected type:None path:null path:null type:None
   [junit4]   2> 1166040 T4787 oascc.ConnectionManager.waitForConnected Client is connected to ZooKeeper
   [junit4]   2> 1166041 T4787 oascc.ZkStateReader.createClusterStateWatchersAndUpdate Updating cluster state from ZooKeeper... 
   [junit4]   2> 1166043 T4787 oascc.SolrZkClient.makePath makePath: /live_nodes/node9
   [junit4]   2> 1166047 T4820 oascc.ZkStateReader$3.process Updating live nodes... (10)
   [junit4]   2> 1166047 T4804 oascc.ZkStateReader$3.process Updating live nodes... (10)
   [junit4]   2> 1166047 T4818 oascc.ZkStateReader$3.process Updating live nodes... (10)
   [junit4]   2> 1166047 T4822 oascc.ZkStateReader$3.process Updating live nodes... (10)
   [junit4]   2> 1166047 T4812 oascc.ZkStateReader$3.process Updating live nodes... (10)
   [junit4]   2> 1166047 T4798 oascc.ZkStateReader$3.process Updating live nodes... (10)
   [junit4]   2> 1166047 T4806 oascc.ZkStateReader$3.process Updating live nodes... (10)
   [junit4]   2> 1166047 T4810 oascc.ZkStateReader$3.process Updating live nodes... (10)
   [junit4]   2> 1166047 T4816 oascc.ZkStateReader$3.process Updating live nodes... (10)
   [junit4]   2> 1166048 T4787 oascc.ConnectionManager.waitForConnected Waiting for client to connect to ZooKeeper
   [junit4]   2> 1166047 T4808 oascc.ZkStateReader$3.process Updating live nodes... (10)
   [junit4]   2> 1166047 T4814 oascc.ZkStateReader$3.process Updating live nodes... (10)
   [junit4]   2> 1166050 T4824 oascc.ConnectionManager.process Watcher org.apache.solr.common.cloud.ConnectionManager@6e5eb9f0 name:ZooKeeperConnection Watcher:127.0.0.1:33715/solr got event WatchedEvent state:SyncConnected type:None path:null path:null type:None
   [junit4]   2> 1166050 T4787 oascc.ConnectionManager.waitForConnected Client is connected to ZooKeeper
   [junit4]   2> 1166052 T4787 oascc.ZkStateReader.createClusterStateWatchersAndUpdate Updating cluster state from ZooKeeper... 
   [junit4]   2> 1166054 T4787 oascc.SolrZkClient.makePath makePath: /live_nodes/node10
   [junit4]   2> 1166057 T4818 oascc.ZkStateReader$3.process Updating live nodes... (11)
   [junit4]   2> 1166057 T4820 oascc.ZkStateReader$3.process Updating live nodes... (11)
   [junit4]   2> 1166058 T4814 oascc.ZkStateReader$3.process Updating live nodes... (11)
   [junit4]   2> 1166057 T4804 oascc.ZkStateReader$3.process Updating live nodes... (11)
   [junit4]   2> 1166057 T4822 oascc.ZkStateReader$3.process Updating live nodes... (11)
   [junit4]   2> 1166057 T4810 oascc.ZkStateReader$3.process Updating live nodes... (11)
   [junit4]   2> 1166057 T4816 oascc.ZkStateReader$3.process Updating live nodes... (11)
   [junit4]   2> 1166059 T4787 oascc.ConnectionManager.waitForConnected Waiting for client to connect to ZooKeeper
   [junit4]   2> 1166058 T4806 oascc.ZkStateReader$3.process Updating live nodes... (11)
   [junit4]   2> 1166058 T4824 oascc.ZkStateReader$3.process Updating live nodes... (11)
   [junit4]   2> 1166057 T4798 oascc.ZkStateReader$3.process Updating live nodes... (11)
   [junit4]   2> 1166057 T4808 oascc.ZkStateReader$3.process Updating live nodes... (11)
   [junit4]   2> 1166057 T4812 oascc.ZkStateReader$3.process Updating live nodes... (11)
   [junit4]   2> 1166060 T4826 oascc.ConnectionManager.process Watcher org.apache.solr.common.cloud.ConnectionManager@6f550142 name:ZooKeeperConnection Watcher:127.0.0.1:33715/solr got event WatchedEvent state:SyncConnected type:None path:null path:null type:None
   [junit4]   2> 1166061 T4787 oascc.ConnectionManager.waitForConnected Client is connected to ZooKeeper
   [junit4]   2> 1166062 T4787 oascc.ZkStateReader.createClusterStateWatchersAndUpdate Updating cluster state from ZooKeeper... 
   [junit4]   2> 1166064 T4787 oascc.SolrZkClient.makePath makePath: /live_nodes/node11
   [junit4]   2> 1166068 T4810 oascc.ZkStateReader$3.process Updating live nodes... (12)
   [junit4]   2> 1166068 T4816 oascc.ZkStateReader$3.process Updating live nodes... (12)
   [junit4]   2> 1166069 T4804 oascc.ZkStateReader$3.process Updating live nodes... (12)
   [junit4]   2> 1166068 T4824 oascc.ZkStateReader$3.process Updating live nodes... (12)
   [junit4]   2> 1166069 T4822 oascc.ZkStateReader$3.process Updating live nodes... (12)
   [junit4]   2> 1166068 T4826 oascc.ZkStateReader$3.process Updating live nodes... (12)
   [junit4]   2> 1166068 T4820 oascc.ZkStateReader$3.process Updating live nodes... (12)
   [junit4]   2> 1166068 T4798 oascc.ZkStateReader$3.process Updating live nodes... (12)
   [junit4]   2> 1166068 T4812 oascc.ZkStateReader$3.process Updating live nodes... (12)
   [junit4]   2> 1166068 T4808 oascc.ZkStateReader$3.process Updating live nodes... (12)
   [junit4]   2> 1166068 T4806 oascc.ZkStateReader$3.process Updating live nodes... (12)
   [junit4]   2> 1166068 T4818 oascc.ZkStateReader$3.process Updating live nodes... (12)
   [junit4]   2> 1166068 T4814 oascc.ZkStateReader$3.process Updating live nodes... (12)
   [junit4]   2> 1166071 T4828 oascc.ConnectionManager.process Watcher org.apache.solr.common.cloud.ConnectionManager@37ca3f54 name:ZooKeeperConnection Watcher:127.0.0.1:33715/solr got event WatchedEvent state:SyncConnected type:None path:null path:null type:None
   [junit4]   2> 1166069 T4787 oascc.ConnectionManager.waitForConnected Waiting for client to connect to ZooKeeper
   [junit4]   2> 1166072 T4787 oascc.ConnectionManager.waitForConnected Client is connected to ZooKeeper
   [junit4]   2> 1166073 T4787 oascc.ZkStateReader.createClusterStateWatchersAndUpdate Updating cluster state from ZooKeeper... 
   [junit4]   2> 1166075 T4787 oascc.SolrZkClient.makePath makePath: /live_nodes/node12
   [junit4]   2> 1166079 T4822 oascc.ZkStateReader$3.process Updating live nodes... (13)
   [junit4]   2> 1166080 T4818 oascc.ZkStateReader$3.process Updating live nodes... (13)
   [junit4]   2> 1166080 T4828 oascc.ZkStateReader$3.process Updating live nodes... (13)
   [junit4]   2> 1166080 T4812 oascc.ZkStateReader$3.process Updating live nodes... (13)
   [junit4]   2> 1166080 T4826 oascc.ZkStateReader$3.process Updating live nodes... (13)
   [junit4]   2> 1166080 T4806 oascc.ZkStateReader$3.process Updating live nodes... (13)
   [junit4]   2> 1166079 T4820 oascc.ZkStateReader$3.process Updating live nodes... (13)
   [junit4]   2> 1166080 T4816 oascc.ZkStateReader$3.process Updating live nodes... (13)
   [junit4]   2> 1166079 T4814 oascc.ZkStateReader$3.process Updating live nodes... (13)
   [junit4]   2> 1166079 T4810 oascc.ZkStateReader$3.process Updating live nodes... (13)
   [junit4]   2> 1166079 T4804 oascc.ZkStateReader$3.process Updating live nodes... (13)
   [junit4]   2> 1166079 T4824 oascc.ZkStateReader$3.process Updating live nodes... (13)
   [junit4]   2> 1166079 T4798 oascc.ZkStateReader$3.process Updating live nodes... (13)
   [junit4]   2> 1166079 T4808 oascc.ZkStateReader$3.process Updating live nodes... (13)
   [junit4]   2> 1166082 T4830 oascc.ConnectionManager.process Watcher org.apache.solr.common.cloud.ConnectionManager@65a07b1c name:ZooKeeperConnection Watcher:127.0.0.1:33715/solr got event WatchedEvent state:SyncConnected type:None path:null path:null type:None
   [junit4]   2> 1166081 T4787 oascc.ConnectionManager.waitForConnected Waiting for client to connect to ZooKeeper
   [junit4]   2> 1166083 T4787 oascc.ConnectionManager.waitForConnected Client is connected to ZooKeeper
   [junit4]   2> 1166085 T4787 oascc.ZkStateReader.createClusterStateWatchersAndUpdate Updating cluster state from ZooKeeper... 
   [junit4]   2> 1166087 T4787 oascc.SolrZkClient.makePath makePath: /live_nodes/node13
   [junit4]   2> 1166090 T4828 oascc.ZkStateReader$3.process Updating live nodes... (14)
   [junit4]   2> 1166090 T4808 oascc.ZkStateReader$3.process Updating live nodes... (14)
   [junit4]   2> 1166090 T4824 oascc.ZkStateReader$3.process Updating live nodes... (14)
   [junit4]   2> 1166091 T4818 oascc.ZkStateReader$3.process Updating live nodes... (14)
   [junit4]   2> 1166091 T4826 oascc.ZkStateReader$3.process Updating live nodes... (14)
   [junit4]   2> 1166091 T4806 oascc.ZkStateReader$3.process Updating live nodes... (14)
   [junit4]   2> 1166091 T4820 oascc.ZkStateReader$3.process Updating live nodes... (14)
   [junit4]   2> 1166091 T4830 oascc.ZkStateReader$3.process Updating live nodes... (14)
   [junit4]   2> 1166091 T4822 oascc.ZkStateReader$3.process Updating live nodes... (14)
   [junit4]   2> 1166091 T4814 oascc.ZkStateReader$3.process Updating live nodes... (14)
   [junit4]   2> 1166091 T4798 oascc.ZkStateReader$3.process Updating live nodes... (14)
   [junit4]   2> 1166091 T4816 oascc.ZkStateReader$3.process Updating live nodes... (14)
   [junit4]   2> 1166091 T4810 oascc.ZkStateReader$3.process Updating live nodes... (14)
   [junit4]   2> 1166091 T4804 oascc.ZkStateReader$3.process Updating live nodes... (14)
   [junit4]   2> 1166094 T4832 oascc.ConnectionManager.process Watcher org.apache.solr.common.cloud.ConnectionManager@3b1a8cde name:ZooKeeperConnection Watcher:127.0.0.1:33715/solr got event WatchedEvent state:SyncConnected type:None path:null path:null type:None
   [junit4]   2> 1166092 T4787 oascc.ConnectionManager.waitForConnected Waiting for client to connect to ZooKeeper
   [junit4]   2> 1166091 T4812 oascc.ZkStateReader$3.process Updating live nodes... (14)
   [junit4]   2> 1166095 T4787 oascc.ConnectionManager.waitForConnected Client is connected to ZooKeeper
   [junit4]   2> 1166096 T4787 oascc.ZkStateReader.createClusterStateWatchersAndUpdate Updating cluster state from ZooKeeper... 
   [junit4]   2> 1166098 T4787 oascc.SolrZkClient.makePath makePath: /live_nodes/node14
   [junit4]   2> 1166102 T4824 oascc.ZkStateReader$3.process Updating live nodes... (15)
   [junit4]   2> 1166102 T4830 oascc.ZkStateReader$3.process Updating live nodes... (15)
   [junit4]   2> 1166102 T4814 oascc.ZkStateReader$3.process Updating live nodes... (15)
   [junit4]   2> 1166102 T4828 oascc.ZkStateReader$3.process Updating live nodes... (15)
   [junit4]   2> 1166102 T4820 oascc.ZkStateReader$3.process Updating live nodes... (15)
   [junit4]   2> 1166102 T4804 oascc.ZkStateReader$3.process Updating live nodes... (15)
   [junit4]   2> 1166102 T4810 oascc.ZkStateReader$3.process Updating live nodes... (15)
   [junit4]   2> 1166104 T4787 oascc.ConnectionManager.waitForConnected Waiting for client to connect to ZooKeeper
   [junit4]   2> 1166103 T4798 oascc.ZkStateReader$3.process Updating live nodes... (15)
   [junit4]   2> 1166103 T4832 oascc.ZkStateReader$3.process Updating live nodes... (15)
   [junit4]   2> 1166103 T4806 oascc.ZkStateReader$3.process Updating live nodes... (15)
   [junit4]   2> 1166103 T4826 oascc.ZkStateReader$3.process Updating live nodes... (15)
   [junit4]   2> 1166103 T4818 oascc.ZkStateReader$3.process Updating live nodes... (15)
   [junit4]   2> 1166103 T4822 oascc.ZkStateReader$3.process Updating live nodes... (15)
   [junit4]   2> 1166103 T4808 oascc.ZkStateReader$3.process Updating live nodes... (15)
   [junit4]   2> 1166103 T4812 oascc.ZkStateReader$3.process Updating live nodes... (15)
   [junit4]   2> 1166103 T4816 oascc.ZkStateReader$3.process Updating live nodes... (15)
   [junit4]   2> 1166105 T4834 oascc.ConnectionManager.process Watcher org.apache.solr.common.cloud.ConnectionManager@5584330e name:ZooKeeperConnection Watcher:127.0.0.1:33715/solr got event WatchedEvent state:SyncConnected type:None path:null path:null type:None
   [junit4]   2> 1166107 T4787 oascc.ConnectionManager.waitForConnected Client is connected to ZooKeeper
   [junit4]   2> 1166109 T4787 oascc.ZkStateReader.createClusterStateWatchersAndUpdate Updating cluster state from ZooKeeper... 
   [junit4]   2> 1166111 T4787 oascc.SolrZkClient.makePath makePath: /live_nodes/node15
   [junit4]   2> 1166115 T4824 oascc.ZkStateReader$3.process Updating live nodes... (16)
   [junit4]   2> 1166115 T4810 oascc.ZkStateReader$3.process Updating live nodes... (16)
   [junit4]   2> 1166116 T4832 oascc.ZkStateReader$3.process Updating live nodes... (16)
   [junit4]   2> 1166116 T4814 oascc.ZkStateReader$3.process Updating live nodes... (16)
   [junit4]   2> 1166116 T4820 oascc.ZkStateReader$3.process Updating live nodes... (16)
   [junit4]   2> 1166116 T4822 oascc.ZkStateReader$3.process Updating live nodes... (16)
   [junit4]   2> 1166116 T4834 oascc.ZkStateReader$3.process Updating live nodes... (16)
   [junit4]   2> 1166116 T4830 oascc.ZkStateReader$3.process Updating live nodes... (16)
   [junit4]   2> 1166115 T4804 oascc.ZkStateReader$3.process Updating live nodes... (16)
   [junit4]   2> 1166115 T4812 oascc.ZkStateReader$3.process Updating live nodes... (16)
   [junit4]   2> 1166115 T4828 oascc.ZkStateReader$3.process Updating live nodes... (16)
   [junit4]   2> 1166115 T4808 oascc.ZkStateReader$3.process Updating live nodes... (16)
   [junit4]   2> 1166115 T4816 oascc.ZkStateReader$3.process Updating live nodes... (16)
   [junit4]   2> 1166115 T4826 oascc.ZkStateReader$3.process Updating live nodes... (16)
   [junit4]   2> 1166115 T4806 oascc.ZkStateReader$3.process Updating live nodes... (16)
   [junit4]   2> 1166115 T4818 oascc.ZkStateReader$3.process Updating live nodes... (16)
   [junit4]   2> 1166115 T4798 oascc.ZkStateReader$3.process Updating live nodes... (16)
   [junit4]   2> 1166118 T4836 oascc.ConnectionManager.process Watcher org.apache.solr.common.cloud.ConnectionManager@23c5b504 name:ZooKeeperConnection Watcher:127.0.0.1:33715/solr got event WatchedEvent state:SyncConnected type:None path:null path:null type:None
   [junit4]   2> 1166116 T4787 oascc.ConnectionManager.waitForConnected Waiting for client to connect to ZooKeeper
   [junit4]   2> 1166120 T4787 oascc.ConnectionManager.waitForConnected Client is connected to ZooKeeper
   [junit4]   2> 1166121 T4787 oascc.ZkStateReader.createClusterStateWatchersAndUpdate Updating cluster state from ZooKeeper... 
   [junit4]   2> 1166123 T4787 oascc.SolrZkClient.makePath makePath: /live_nodes/node16
   [junit4]   2> 1166127 T4828 oascc.ZkStateReader$3.process Updating live nodes... (17)
   [junit4]   2> 1166128 T4806 oascc.ZkStateReader$3.process Updating live nodes... (17)
   [junit4]   2> 1166128 T4830 oascc.ZkStateReader$3.process Updating live nodes... (17)
   [junit4]   2> 1166129 T4836 oascc.ZkStateReader$3.process Updating live nodes... (17)
   [junit4]   2> 1166129 T4814 oascc.ZkStateReader$3.process Updating live nodes... (17)
   [junit4]   2> 1166129 T4820 oascc.ZkStateReader$3.process Updating live nodes... (17)
   [junit4]   2> 1166128 T4818 oascc.ZkStateReader$3.process Updating live nodes... (17)
   [junit4]   2> 1166128 T4832 oascc.ZkStateReader$3.process Updating live nodes... (17)
   [junit4]   2> 1166128 T4798 oascc.ZkStateReader$3.process Updating live nodes... (17)
   [junit4]   2> 1166128 T4834 oascc.ZkStateReader$3.process Updating live nodes... (17)
   [junit4]   2> 1166128 T4822 oascc.ZkStateReader$3.process Updating live nodes... (17)
   [junit4]   2> 1166128 T4826 oascc.ZkStateReader$3.process Updating live nodes... (17)
   [junit4]   2> 1166128 T4804 oascc.ZkStateReader$3.process Updating live nodes... (17)
   [junit4]   2> 1166131 T4838 oascc.ConnectionManager.process Watcher org.apache.solr.common.cloud.ConnectionManager@636ed6a6 name:ZooKeeperConnection Watcher:127.0.0.1:33715/solr got event WatchedEvent state:SyncConnected type:None path:null path:null type:None
   [junit4]   2> 1166128 T4808 oascc.ZkStateReader$3.process Updating live nodes... (17)
   [junit4]   2> 1166127 T4812 oascc.ZkStateReader$3.process Updating live nodes... (17)
   [junit4]   2> 1166127 T4810 oascc.ZkStateReader$3.process Updating live nodes... (17)
   [junit4]   2> 1166127 T4824 oascc.ZkStateReader$3.process Updating live nodes... (17)
   [junit4]   2> 1166129 T4787 oascc.ConnectionManager.waitForConnected Waiting for client to connect to ZooKeeper
   [junit4]   2> 1166129 T4816 oascc.ZkStateReader$3.process Updating live nodes... (17)
   [junit4]   2> 1166133 T4787 oascc.ConnectionManager.waitForConnected Client is connected to ZooKeeper
   [junit4]   2> 1166134 T4787 oascc.ZkStateReader.createClusterStateWatchersAndUpdate Updating cluster state from ZooKeeper... 
   [junit4]   2> 1166136 T4787 oascc.SolrZkClient.makePath makePath: /live_nodes/node17
   [junit4]   2> 1166140 T4814 oascc.ZkStateReader$3.process Updating live nodes... (18)
   [junit4]   2> 1166140 T4828 oascc.ZkStateReader$3.process Updating live nodes... (18)
   [junit4]   2> 1166141 T4836 oascc.ZkStateReader$3.process Updating live nodes... (18)
   [junit4]   2> 1166141 T4830 oascc.ZkStateReader$3.process Updating live nodes... (18)
   [junit4]   2> 1166141 T4832 oascc.ZkStateReader$3.process Updating live nodes... (18)
   [junit4]   2> 1166142 T4812 oascc.ZkStateReader$3.process Updating live nodes... (18)
   [junit4]   2> 1166141 T4806 oascc.ZkStateReader$3.process Updating live nodes... (18)
   [junit4]   2> 1166141 T4820 oascc.ZkStateReader$3.process Updating live nodes... (18)
   [junit4]   2> 1166141 T4816 oascc.ZkStateReader$3.process Updating live nodes... (18)
   [junit4]   2> 1166141 T4822 oascc.ZkStateReader$3.process Updating live nodes... (18)
   [junit4]   2> 1166141 T4808 oascc.ZkStateReader$3.process Updating live nodes... (18)
   [junit4]   2> 1166141 T4824 oascc.ZkStateReader$3.process Updating live nodes... (18)
   [junit4]   2> 1166143 T4787 oascc.ConnectionManager.waitForConnected Waiting for client to connect to ZooKeeper
   [junit4]   2> 1166142 T4810 oascc.ZkStateReader$3.process Updating live nodes... (18)
   [junit4]   2> 1166142 T4838 oascc.ZkStateReader$3.process Updating live nodes... (18)
   [junit4]   2> 1166142 T4798 oascc.ZkStateReader$3.process Updating live nodes... (18)
   [junit4]   2> 1166142 T4804 oascc.ZkStateReader$3.process Updating live nodes... (18)
   [junit4]   2> 1166142 T4834 oascc.ZkStateReader$3.process Updating live nodes... (18)
   [junit4]   2> 1166142 T4818 oascc.ZkStateReader$3.process Updating live nodes... (18)
   [junit4]   2> 1166142 T4826 oascc.ZkStateReader$3.process Updating live nodes... (18)
   [junit4]   2> 1166145 T4840 oascc.ConnectionManager.process Watcher org.apache.solr.common.cloud.ConnectionManager@3ec3eb3 name:ZooKeeperConnection Watcher:127.0.0.1:33715/solr got event WatchedEvent state:SyncConnected type:None path:null path:null type:None
   [junit4]   2> 1166146 T4787 oascc.ConnectionManager.waitForConnected Client is connected to ZooKeeper
   [junit4]   2> 1166148 T4787 oascc.ZkStateReader.createClusterStateWatchersAndUpdate Updating cluster state from ZooKeeper... 
   [junit4]   2> 1166150 T4787 oascc.SolrZkClient.makePath makePath: /live_nodes/node18
   [junit4]   2> 1166153 T4836 oascc.ZkStateReader$3.process Updating live nodes... (19)
   [junit4]   2> 1166154 T4830 oascc.ZkStateReader$3.process Updating live nodes... (19)
   [junit4]   2> 1166155 T4824 oascc.ZkStateReader$3.process Updating live nodes... (19)
   [junit4]   2> 1166155 T4840 oascc.ZkStateReader$3.process Updating live nodes... (19)
   [junit4]   2> 1166155 T4804 oascc.ZkStateReader$3.process Updating live nodes... (19)
   [junit4]   2> 1166155 T4806 oascc.ZkStateReader$3.process Updating live nodes... (19)
   [junit4]   2> 1166155 T4838 oascc.ZkStateReader$3.process Updating live nodes... (19)
   [junit4]   2> 1166155 T4798 oascc.ZkStateReader$3.process Updating live nodes... (19)
   [junit4]   2> 1166155 T4810 oascc.ZkStateReader$3.process Updating live nodes... (19)
   [junit4]   2> 1166154 T4828 oascc.ZkStateReader$3.process Updating live nodes... (19)
   [junit4]   2> 1166156 T4787 oascc.ConnectionManager.waitForConnected Waiting for client to connect to ZooKeeper
   [junit4]   2> 1166155 T4820 oascc.ZkStateReader$3.process Updating live nodes... (19)
   [junit4]   2> 1166155 T4822 oascc.ZkStateReader$3.process Updating live nodes... (19)
   [junit4]   2> 1166155 T4814 oascc.ZkStateReader$3.process Updating live nodes... (19)
   [junit4]   2> 1166155 T4808 oascc.ZkStateReader$3.process Updating live nodes... (19)
   [junit4]   2> 1166155 T4832 oascc.ZkStateReader$3.process Updating live nodes... (19)
   [junit4]   2> 1166155 T4812 oascc.ZkStateReader$3.process Updating live nodes... (19)
   [junit4]   2> 1166155 T4834 oascc.ZkStateReader$3.process Updating live nodes... (19)
   [junit4]   2> 1166155 T4816 oascc.ZkStateReader$3.process Updating live nodes... (19)
   [junit4]   2> 1166155 T4818 oascc.ZkStateReader$3.process Updating live nodes... (19)
   [junit4]   2> 1166155 T4826 oascc.ZkStateReader$3.process Updating live nodes... (19)
   [junit4]   2> 1166158 T4842 oascc.ConnectionManager.process Watcher org.apache.solr.common.cloud.ConnectionManager@6f2bdfc name:ZooKeeperConnection Watcher:127.0.0.1:33715/solr got event WatchedEvent state:SyncConnected type:None path:null path:null type:None
   [junit4]   2> 1166160 T4787 oascc.ConnectionManager.waitForConnected Client is connected to ZooKeeper
   [junit4]   2> 1166161 T4787 oascc.ZkStateReader.createClusterStateWatchersAndUpdate Updating cluster state from ZooKeeper... 
   [junit4]   2> 1166163 T4787 oascc.SolrZkClient.makePath makePath: /live_nodes/node19
   [junit4]   2> 1166167 T4836 oascc.ZkStateReader$3.process Updating live nodes... (20)
   [junit4]   2> 1166168 T4834 oascc.ZkStateReader$3.process Updating live nodes... (20)
   [junit4]   2> 1166168 T4828 oascc.ZkStateReader$3.process Updating live nodes... (20)
   [junit4]   2> 1166169 T4822 oascc.ZkStateReader$3.process Updating live nodes... (20)
   [junit4]   2> 1166169 T4826 oascc.ZkStateReader$3.process Updating live nodes... (20)
   [junit4]   2> 1166169 T4840 oascc.ZkStateReader$3.process Updating live nodes... (20)
   [junit4]   2> 1166169 T4787 oascc.ConnectionManager.waitForConnected Waiting for client to connect to ZooKeeper
   [junit4]   2> 1166168 T4810 oascc.ZkStateReader$3.process Updating live nodes... (20)
   [junit4]   2> 1166168 T4830 oascc.ZkStateReader$3.process Updating live nodes... (20)
   [junit4]   2> 1166168 T4818 oascc.ZkStateReader$3.process Updating live nodes... (20)
   [junit4]   2> 1166168 T4816 oascc.ZkStateReader$3.process Updating live nodes... (20)
   [junit4]   2> 1166168 T4812 oascc.ZkStateReader$3.process Updating live nodes... (20)
   [junit4]   2> 1166168 T4838 oascc.ZkStateReader$3.process Updating live nodes... (20)
   [junit4]   2> 1166168 T4832 oascc.ZkStateReader$3.process Updating live nodes... (20)
   [junit4]   2> 1166168 T4842 oascc.ZkStateReader$3.process Updating live nodes... (20)
   [junit4]   2> 1166168 T4804 oascc.ZkStateReader$3.process Updating live nodes... (20)
   [junit4]   2> 1166168 T4806 oascc.ZkStateReader$3.process Updating live nodes... (20)
   [junit4]   2> 1166167 T4808 oascc.ZkStateReader$3.process Updating live nodes... (20)
   [junit4]   2> 1166167 T4814 oascc.ZkStateReader$3.process Updating live nodes... (20)
   [junit4]   2> 1166171 T4844 oascc.ConnectionManager.process Watcher org.apache.solr.common.cloud.ConnectionManager@31dac2d6 name:ZooKeeperConnection Watcher:127.0.0.1:33715/solr got event WatchedEvent state:SyncConnected type:None path:null path:null type:None
   [junit4]   2> 1166169 T4798 oascc.ZkStateReader$3.process Updating live nodes... (20)
   [junit4]   2> 1166169 T4820 oascc.ZkStateReader$3.process Updating live nodes... (20)
   [junit4]   2> 1166169 T4824 oascc.ZkStateReader$3.process Updating live nodes... (20)
   [junit4]   2> 1166173 T4787 oascc.ConnectionManager.waitForConnected Client is connected to ZooKeeper
   [junit4]   2> 1166175 T4787 oascc.ZkStateReader.createClusterStateWatchersAndUpdate Updating cluster state from ZooKeeper... 
   [junit4]   2> 1166177 T4787 oascc.SolrZkClient.makePath makePath: /live_nodes/node20
   [junit4]   2> 1166181 T4814 oascc.ZkStateReader$3.process Updating live nodes... (21)
   [junit4]   2> 1166181 T4836 oascc.ZkStateReader$3.process Updating live nodes... (21)
   [junit4]   2> 1166182 T4808 oascc.ZkStateReader$3.process Updating live nodes... (21)
   [junit4]   2> 1166181 T4824 oascc.ZkStateReader$3.process Updating live nodes... (21)
   [junit4]   2> 1166183 T4832 oascc.ZkStateReader$3.process Updating live nodes... (21)
   [junit4]   2> 1166183 T4806 oascc.ZkStateReader$3.process Updating live nodes... (21)
   [junit4]   2> 1166183 T4812 oascc.ZkStateReader$3.process Updating live nodes... (21)
   [junit4]   2> 1166183 T4816 oascc.ZkStateReader$3.process Updating live nodes... (21)
   [junit4]   2> 1166183 T4844 oascc.ZkStateReader$3.process Updating live nodes... (21)
   [junit4]   2> 1166183 T4818 oascc.ZkStateReader$3.process Updating live nodes... (21)
   [junit4]   2> 1166183 T4804 oascc.ZkStateReader$3.process Updating live nodes... (21)
   [junit4]   2> 1166182 T4820 oascc.ZkStateReader$3.process Updating live nodes... (21)
   [junit4]   2> 1166182 T4826 oascc.ZkStateReader$3.process Updating live nodes... (21)
   [junit4]   2> 1166182 T4838 oascc.ZkStateReader$3.process Updating live nodes... (21)
   [junit4]   2> 1166182 T4822 oascc.ZkStateReader$3.process Updating live nodes... (21)
   [junit4]   2> 1166182 T4810 oascc.ZkStateReader$3.process Updating live nodes... (21)
   [junit4]   2> 1166182 T4840 oascc.ZkStateReader$3.process Updating live nodes... (21)
   [junit4]   2> 1166182 T4798 oascc.ZkStateReader$3.process Updating live nodes... (21)
   [junit4]   2> 1166182 T4830 oascc.ZkStateReader$3.process Updating live nodes... (21)
   [junit4]   2> 1166182 T4834 oascc.ZkStateReader$3.process Updating live nodes... (21)
   [junit4]   2> 1166182 T4828 oascc.ZkStateReader$3.process Updating live nodes... (21)
   [junit4]   2> 1166181 T4842 oascc.ZkStateReader$3.process Updating live nodes... (21)
   [junit4]   2> 1166185 T4846 oascc.ConnectionManager.process Watcher org.apache.solr.common.cloud.ConnectionManager@169c7f5e name:ZooKeeperConnection Watcher:127.0.0.1:33715/solr got event WatchedEvent state:SyncConnected type:None path:null path:null type:None
   [junit4]   2> 1166184 T4787 oascc.ConnectionManager.waitForConnected Waiting for client to connect to ZooKeeper
   [junit4]   2> 1166188 T4787 oascc.ConnectionManager.waitForConnected Client is connected to ZooKeeper
   [junit4]   2> 1166189 T4787 oascc.ZkStateReader.createClusterStateWatchersAndUpdate Updating cluster state from ZooKeeper... 
   [junit4]   2> 1166191 T4787 oascc.SolrZkClient.makePath makePath: /live_nodes/node21
   [junit4]   2> 1166196 T4822 oascc.ZkStateReader$3.process Updating live nodes... (22)
   [junit4]   2> 1166196 T4812 oascc.ZkStateReader$3.process Updating live nodes... (22)
   [junit4]   2> 1166197 T4830 oascc.ZkStateReader$3.process Updating live nodes... (22)
   [junit4]   2> 1166197 T4846 oascc.ZkStateReader$3.process Updating live nodes... (22)
   [junit4]   2> 1166197 T4844 oascc.ZkStateReader$3.process Updating live nodes... (22)
   [junit4]   2> 1166197 T4824 oascc.ZkStateReader$3.process Updating live nodes... (22)
   [junit4]   2> 1166198 T4818 oascc.ZkStateReader$3.process Updating live nodes... (22)
   [junit4]   2> 1166197 T4826 oascc.ZkStateReader$3.process Updating live nodes... (22)
   [junit4]   2> 1166197 T4816 oascc.ZkStateReader$3.process Updating live nodes... (22)
   [junit4]   2> 1166196 T4798 oascc.ZkStateReader$3.process Updating live nodes... (22)
   [junit4]   2> 1166196 T4810 oascc.ZkStateReader$3.process Updating live nodes... (22)
   [junit4]   2> 1166196 T4828 oascc.ZkStateReader$3.process Updating live nodes... (22)
   [junit4]   2> 1166196 T4806 oascc.ZkStateReader$3.process Updating live nodes... (22)
   [junit4]   2> 1166196 T4840 oascc.ZkStateReader$3.process Updating live nodes... (22)
   [junit4]   2> 1166198 T4787 oascc.ConnectionManager.waitForConnected Waiting for client to connect to ZooKeeper
   [junit4]   2> 1166198 T4834 oascc.ZkStateReader$3.process Updating live nodes... (22)
   [junit4]   2> 1166198 T4836 oascc.ZkStateReader$3.process Updating live nodes... (22)
   [junit4]   2> 1166197 T4820 oascc.ZkStateReader$3.process Updating live nodes... (22)
   [junit4]   2> 1166197 T4832 oascc.ZkStateReader$3.process Updating live nodes... (22)
   [junit4]   2> 1166197 T4814 oascc.ZkStateReader$3.process Updating live nodes... (22)
   [junit4]   2> 1166197 T4804 oascc.ZkStateReader$3.process Updating live nodes... (22)
   [junit4]   2> 1166197 T4808 oascc.ZkStateReader$3.process Updating live nodes... (22)
   [junit4]   2> 1166197 T4842 oascc.ZkStateReader$3.process Updating live nodes... (22)
   [junit4]   2> 1166197 T4838 oascc.ZkStateReader$3.process Updating live nodes... (22)
   [junit4]   2> 1166200 T4848 oascc.ConnectionManager.process Watcher org.apache.solr.common.cloud.ConnectionManager@3880a112 name:ZooKeeperConnection Watcher:127.0.0.1:33715/solr got event WatchedEvent state:SyncConnected type:None path:null path:null type:None
   [junit4]   2> 1166203 T4787 oascc.ConnectionManager.waitForConnected Client is connected to ZooKeeper
   [junit4]   2> 1166204 T4787 oascc.ZkStateReader.createClusterStateWatchersAndUpdate Updating cluster state from ZooKeeper... 
   [junit4]   2> 1166206 T4787 oascc.SolrZkClient.makePath makePath: /live_nodes/node22
   [junit4]   2> 1166210 T4836 oascc.ZkStateReader$3.process Updating live nodes... (23)
   [junit4]   2> 1166210 T4816 oascc.ZkStateReader$3.process Updating live nodes... (23)
   [junit4]   2> 1166212 T4804 oascc.ZkStateReader$3.process Updating live nodes... (23)
   [junit4]   2> 1166212 T4832 oascc.ZkStateReader$3.process Updating live nodes... (23)
   [junit4]   2> 1166212 T4830 oascc.ZkStateReader$3.process Updating live nodes... (23)
   [junit4]   2> 1166212 T4826 oascc.ZkStateReader$3.process Updating live nodes... (23)
   [junit4]   2> 1166212 T4838 oascc.ZkStateReader$3.process Updating live nodes... (23)
   [junit4]   2> 1166212 T4842 oascc.ZkStateReader$3.process Updating live nodes... (23)
   [junit4]   2> 1166212 T4810 oascc.ZkStateReader$3.process Updating live nodes... (23)
   [junit4]   2> 1166212 T4844 oascc.ZkStateReader$3.process Updating live nodes... (23)
   [junit4]   2> 1166212 T4824 oascc.ZkStateReader$3.process Updating live nodes... (23)
   [junit4]   2> 1166212 T4806 oascc.ZkStateReader$3.process Updating live nodes... (23)
   [junit4]   2> 1166211 T4848 oascc.ZkStateReader$3.process Updating live nodes... (23)
   [junit4]   2> 1166211 T4814 oascc.ZkStateReader$3.process Updating live nodes... (23)
   [junit4]   2> 1166211 T4808 oascc.ZkStateReader$3.process Updating live nodes... (23)
   [junit4]   2> 1166211 T4822 oascc.ZkStateReader$3.process Updating live nodes... (23)
   [junit4]   2> 1166215 T4850 oascc.ConnectionManager.process Watcher org.apache.solr.common.cloud.ConnectionManager@3104fc8 name:ZooKeeperConnection Watcher:127.0.0.1:33715/solr got event WatchedEvent state:SyncConnected type:None path:null path:null type:None
   [junit4]   2> 1166213 T4787 oascc.ConnectionManager.waitForConnected Waiting for client to connect to ZooKeeper
   [junit4]   2> 1166213 T4798 oascc.ZkStateReader$3.process Updating live nodes... (23)
   [junit4]   2> 1166213 T4834 oascc.ZkStateReader$3.process Updating live nodes... (23)
   [junit4]   2> 1166213 T4812 oascc.ZkStateReader$3.process Updating live nodes... (23)
   [junit4]   2> 1166212 T4846 oascc.ZkStateReader$3.process Updating live nodes... (23)
   [junit4]   2> 1166212 T4818 oascc.ZkStateReader$3.process Updating live nodes... (23)
   [junit4]   2> 1166212 T4820 oascc.ZkStateReader$3.process Updating live nodes... (23)
   [junit4]   2> 1166212 T4828 oascc.ZkStateReader$3.process Updating live nodes... (23)
   [junit4]   2> 1166212 T4840 oascc.ZkStateReader$3.process Updating live nodes... (23)
   [junit4]   2> 1166217 T4787 oascc.ConnectionManager.waitForConnected Client is connected to ZooKeeper
   [junit4]   2> 1166220 T4787 oascc.ZkStateReader.createClusterStateWatchersAndUpdate Updating cluster state from ZooKeeper... 
   [junit4]   2> 1166222 T4787 oascc.SolrZkClient.makePath makePath: /live_nodes/node23
   [junit4]   2> 1166226 T4816 oascc.ZkStateReader$3.process Updating live nodes... (24)
   [junit4]   2> 1166226 T4826 oascc.ZkStateReader$3.process Updating live nodes... (24)
   [junit4]   2> 1166227 T4830 oascc.ZkStateReader$3.process Updating live nodes... (24)
   [junit4]   2> 1166228 T4838 oascc.ZkStateReader$3.process Updating live nodes... (24)
   [junit4]   2> 1166228 T4844 oascc.ZkStateReader$3.process Updating live nodes... (24)
   [junit4]   2> 1166228 T4812 oascc.ZkStateReader$3.process Updating live nodes... (24)
   [junit4]   2> 1166227 T4848 oascc.ZkStateReader$3.process Updating live nodes... (24)
   [junit4]   2> 1166229 T4798 oascc.ZkStateReader$3.process Updating live nodes... (24)
   [junit4]   2> 1166229 T4804 oascc.ZkStateReader$3.process Updating live nodes... (24)
   [junit4]   2> 1166229 T4842 oascc.ZkStateReader$3.process Updating live nodes... (24)
   [junit4]   2> 1166229 T4850 oascc.ZkStateReader$3.process Updating live nodes... (24)
   [junit4]   2> 1166229 T4822 oascc.ZkStateReader$3.process Updating live nodes... (24)
   [junit4]   2> 1166229 T4820 oascc.ZkStateReader$3.process Updating live nodes... (24)
   [junit4]   2> 1166228 T4832 oascc.ZkStateReader$3.process Updating live nodes... (24)
   [junit4]   2> 1166228 T4814 oascc.ZkStateReader$3.process Updating live nodes... (24)
   [junit4]   2> 1166228 T4806 oascc.ZkStateReader$3.process Updating live nodes... (24)
   [junit4]   2> 1166228 T4824 oascc.ZkStateReader$3.process Updating live nodes... (24)
   [junit4]   2> 1166228 T4810 oascc.ZkStateReader$3.process Updating live nodes... (24)
   [junit4]   2> 1166232 T4852 oascc.ConnectionManager.process Watcher org.apache.solr.common.cloud.ConnectionManager@4f1c0621 name:ZooKeeperConnection Watcher:127.0.0.1:33715/solr got event WatchedEvent state:SyncConnected type:None path:null path:null type:None
   [junit4]   2> 1166228 T4808 oascc.ZkStateReader$3.process Updating live nodes... (24)
   [junit4]   2> 1166228 T4828 oascc.ZkStateReader$3.process Updating live nodes... (24)
   [junit4]   2> 1166228 T4840 oascc.ZkStateReader$3.process Updating live nodes... (24)
   [junit4]   2> 1166228 T4834 oascc.ZkStateReader$3.process Updating live nodes... (24)
   [junit4]   2> 1166228 T4846 oascc.ZkStateReader$3.process Updating live nodes... (24)
   [junit4]   2> 1166227 T4836 oascc.ZkStateReader$3.process Updating live nodes... (24)
   [junit4]   2> 1166227 T4818 oascc.ZkStateReader$3.process Updating live nodes... (24)
   [junit4]   2> 1166230 T4787 oascc.ConnectionManager.waitForConnected Waiting for client to connect to ZooKeeper
   [junit4]   2> 1166234 T4787 oascc.ConnectionManager.waitForConnected Client is connected to ZooKeeper
   [junit4]   2> 1166236 T4787 oascc.ZkStateReader.createClusterStateWatchersAndUpdate Updating cluster state from ZooKeeper... 
   [junit4]   2> 1166238 T4787 oascc.SolrZkClient.makePath makePath: /live_nodes/node24
   [junit4]   2> 1166241 T4830 oascc.ZkStateReader$3.process Updating live nodes... (25)
   [junit4]   2> 1166244 T4818 oascc.ZkStateReader$3.process Updating live nodes... (25)
   [junit4]   2> 1166244 T4836 oascc.ZkStateReader$3.process Updating live nodes... (25)
   [junit4]   2> 1166244 T4804 oascc.ZkStateReader$3.process Updating live nodes... (25)
   [junit4]   2> 1166244 T4826 oascc.ZkStateReader$3.process Updating live nodes... (25)
   [junit4]   2> 1166243 T4824 oascc.ZkStateReader$3.process Updating live nodes... (25)
   [junit4]   2> 1166243 T4810 oascc.ZkStateReader$3.process Updating live nodes... (25)
   [junit4]   2> 1166243 T4808 oascc.ZkStateReader$3.process Updating live nodes... (25)
   [junit4]   2> 1166243 T4812 oascc.ZkStateReader$3.process Updating live nodes... (25)
   [junit4]   2> 1166243 T4842 oascc.ZkStateReader$3.process Updating live nodes... (25)
   [junit4]   2> 1166243 T4850 oascc.ZkStateReader$3.process Updating live nodes... (25)
   [junit4]   2> 1166243 T4816 oascc.ZkStateReader$3.process Updating live nodes... (25)
   [junit4]   2> 1166242 T4828 oascc.ZkStateReader$3.process Updating live nodes... (25)
   [junit4]   2> 1166242 T4814 oascc.ZkStateReader$3.process Updating live nodes... (25)
   [junit4]   2> 1166245 T4787 oascc.ConnectionManager.waitForConnected Waiting for client to connect to ZooKeeper
   [junit4]   2> 1166245 T4846 oascc.ZkStateReader$3.process Updating live nodes... (25)
   [junit4]   2> 1166244 T4852 oascc.ZkStateReader$3.process Updating live nodes... (25)
   [junit4]   2> 1166244 T4840 oascc.ZkStateReader$3.process Updating live nodes... (25)
   [junit4]   2> 1166244 T4820 oascc.ZkStateReader$3.process Updating live nodes... (25)
   [junit4]   2> 1166244 T4832 oascc.ZkStateReader$3.process Updating live nodes... (25)
   [junit4]   2> 1166244 T4798 oascc.ZkStateReader$3.process Updating live nodes... (25)
   [junit4]   2> 1166244 T4848 oascc.ZkStateReader$3.process Updating live nodes... (25)
   [junit4]   2> 1166244 T4838 oascc.ZkStateReader$3.process Updating live nodes... (25)
   [junit4]   2> 1166244 T4806 oascc.ZkStateReader$3.process Updating live nodes... (25)
   [junit4]   2> 1166244 T4834 oascc.ZkStateReader$3.process Updating live nodes... (25)
   [junit4]   2> 1166244 T4822 oascc.ZkStateReader$3.process Updating live nodes... (25)
   [junit4]   2> 1166244 T4844 oascc.ZkStateReader$3.process Updating live nodes... (25)
   [junit4]   2> 1166247 T4854 oascc.ConnectionManager.process Watcher org.apache.solr.common.cloud.ConnectionManager@76934284 name:ZooKeeperConnection Watcher:127.0.0.1:33715/solr got event WatchedEvent state:SyncConnected type:None path:null path:null type:None
   [junit4]   2> 1166251 T4787 oascc.ConnectionManager.waitForConnected Client is connected to ZooKeeper
   [junit4]   2> 1166252 T4787 oascc.ZkStateReader.createClusterStateWatchersAndUpdate Updating cluster state from ZooKeeper... 
   [junit4]   2> 1166254 T4787 oascc.SolrZkClient.makePath makePath: /live_nodes/node25
   [junit4]   2> 1166258 T4820 oascc.ZkStateReader$3.process Updating live nodes... (26)
   [junit4]   2> 1166258 T4838 oascc.ZkStateReader$3.process Updating live nodes... (26)
   [junit4]   2> 1166259 T4836 oascc.ZkStateReader$3.process Updating live nodes... (26)
   [junit4]   2> 1166259 T4828 oascc.ZkStateReader$3.process Updating live nodes... (26)
   [junit4]   2> 1166259 T4814 oascc.ZkStateReader$3.process Updating live nodes... (26)
   [junit4]   2> 1166260 T4854 oascc.ZkStateReader$3.process Updating live nodes... (26)
   [junit4]   2> 1166261 T4798 oascc.ZkStateReader$3.process Updating live nodes... (26)
   [junit4]   2> 1166261 T4806 oascc.ZkStateReader$3.process Updating live nodes... (26)
   [junit4]   2> 1166259 T4826 oascc.ZkStateReader$3.process Updating live nodes... (26)
   [junit4]   2> 1166259 T4842 oascc.ZkStateReader$3.process Updating live nodes... (26)
   [junit4]   2> 1166259 T4848 oascc.ZkStateReader$3.process Updating live nodes... (26)
   [junit4]   2> 1166259 T4844 oascc.ZkStateReader$3.process Updating live nodes... (26)
   [junit4]   2> 1166261 T4787 oascc.ConnectionManager.waitForConnected Waiting for client to connect to ZooKeeper
   [junit4]   2> 1166261 T4840 oascc.ZkStateReader$3.process Updating live nodes... (26)
   [junit4]   2> 1166261 T4818 oascc.ZkStateReader$3.process Updating live nodes... (26)
   [junit4]   2> 1166261 T4810 oascc.ZkStateReader$3.process Updating live nodes... (26)
   [junit4]   2> 1166261 T4808 oascc.ZkStateReader$3.process Updating live nodes... (26)
   [junit4]   2> 1166260 T4832 oascc.ZkStateReader$3.process Updating live nodes... (26)
   [junit4]   2> 1166260 T4834 oascc.ZkStateReader$3.process Updating live nodes... (26)
   [junit4]   2> 1166260 T4822 oascc.ZkStateReader$3.process Updating live nodes... (26)
   [junit4]   2> 1166260 T4852 oascc.ZkStateReader$3.process Updating live nodes... (26)
   [junit4]   2> 1166260 T4812 oascc.ZkStateReader$3.process Updating live nodes... (26)
   [junit4]   2> 1166260 T4846 oascc.ZkStateReader$3.process Updating live nodes... (26)
   [junit4]   2> 1166260 T4816 oascc.ZkStateReader$3.process Updating live nodes... (26)
   [junit4]   2> 1166260 T4850 oascc.ZkStateReader$3.process Updating live nodes... (26)
   [junit4]   2> 1166260 T4830 oascc.ZkStateReader$3.process Updating live nodes... (26)
   [junit4]   2> 1166260 T4804 oascc.ZkStateReader$3.process Updating live nodes... (26)
   [junit4]   2> 1166259 T4824 oascc.ZkStateReader$3.process Updating live nodes... (26)
   [junit4]   2> 1166263 T4856 oascc.ConnectionManager.process Watcher org.apache.solr.common.cloud.ConnectionManager@1102c0c8 name:ZooKeeperConnection Watcher:127.0.0.1:33715/solr got event WatchedEvent state:SyncConnected type:None path:null path:null type:None
   [junit4]   2> 1166267 T4787 oascc.ConnectionManager.waitForConnected Client is connected to ZooKeeper
   [junit4]   2> 1166268 T4787 oascc.ZkStateReader.createClusterStateWatchersAndUpdate Updating cluster state from ZooKeeper... 
   [junit4]   2> 1166270 T4787 oascc.SolrZkClient.makePath makePath: /live_nodes/node26
   [junit4]   2> 1166275 T4832 oascc.ZkStateReader$3.process Updating live nodes... (27)
   [junit4]   2> 1166275 T4846 oascc.ZkStateReader$3.process Updating live nodes... (27)
   [junit4]   2> 1166276 T4840 oascc.ZkStateReader$3.process Updating live nodes... (27)
   [junit4]   2> 1166275 T4810 oascc.ZkStateReader$3.process Updating live nodes... (27)
   [junit4]   2> 1166277 T4854 oascc.ZkStateReader$3.process Updating live nodes... (27)
   [junit4]   2> 1166277 T4806 oascc.ZkStateReader$3.process Updating live nodes... (27)
   [junit4]   2> 1166277 T4844 oascc.ZkStateReader$3.process Updating live nodes... (27)
   [junit4]   2> 1166277 T4856 oascc.ZkStateReader$3.process Updating live nodes... (27)
   [junit4]   2> 1166277 T4838 oascc.ZkStateReader$3.process Updating live nodes... (27)
   [junit4]   2> 1166277 T4818 oascc.ZkStateReader$3.process Updating live nodes... (27)
   [junit4]   2> 1166277 T4812 oascc.ZkStateReader$3.process Updating live nodes... (27)
   [junit4]   2> 1166277 T4830 oascc.ZkStateReader$3.process Updating live nodes... (27)
   [junit4]   2> 1166277 T4798 oascc.ZkStateReader$3.process Updating live nodes... (27)
   [junit4]   2> 1166277 T4814 oascc.ZkStateReader$3.process Updating live nodes... (27)
   [junit4]   2> 1166276 T4804 oascc.ZkStateReader$3.process Updating live nodes... (27)
   [junit4]   2> 1166276 T4808 oascc.ZkStateReader$3.process Updating live nodes... (27)
   [junit4]   2> 1166276 T4836 oascc.ZkStateReader$3.process Updating live nodes... (27)
   [junit4]   2> 1166276 T4848 oascc.ZkStateReader$3.process Updating live nodes... (27)
   [junit4]   2> 1166276 T4834 oascc.ZkStateReader$3.process Updating live nodes... (27)
   [junit4]   2> 1166276 T4826 oascc.ZkStateReader$3.process Updating live nodes... (27)
   [junit4]   2> 1166276 T4822 oascc.ZkStateReader$3.process Updating live nodes... (27)
   [junit4]   2> 1166276 T4852 oascc.ZkStateReader$3.process Updating live nodes... (27)
   [junit4]   2> 1166276 T4816 oascc.ZkStateReader$3.process Updating live nodes... (27)
   [junit4]   2> 1166276 T4850 oascc.ZkStateReader$3.process Updating live nodes... (27)
   [junit4]   2> 1166276 T4828 oascc.ZkStateReader$3.process Updating live nodes... (27)
   [junit4]   2> 1166276 T4824 oascc.ZkStateReader$3.process Updating live nodes... (27)
   [junit4]   2> 1166276 T4842 oascc.ZkStateReader$3.process Updating live nodes... (27)
   [junit4]   2> 1166280 T4858 oascc.ConnectionManager.process Watcher org.apache.solr.common.cloud.ConnectionManager@544fd621 name:ZooKeeperConnection Watcher:127.0.0.1:33715/solr got event WatchedEvent state:SyncConnected type:None path:null path:null type:None
   [junit4]   2> 1166278 T4787 oascc.ConnectionManager.waitForConnected Waiting for client to connect to ZooKeeper
   [junit4]   2> 1166277 T4820 oascc.ZkStateReader$3.process Updating live nodes... (27)
   [junit4]   2> 1166283 T4787 oascc.ConnectionManager.waitForConnected Client is connected to ZooKeeper
   [junit4]   2> 1166285 T4787 oascc.ZkStateReader.createClusterStateWatchersAndUpdate Updating cluster state from ZooKeeper... 
   [junit4]   2> 1166287 T4787 oascc.SolrZkClient.makePath makePath: /live_nodes/node27
   [junit4]   2> 1166292 T4810 oascc.ZkStateReader$3.process Updating live nodes... (28)
   [junit4]   2> 1166292 T4846 oascc.ZkStateReader$3.process Updating live nodes... (28)
   [junit4]   2> 1166293 T4858 oascc.ZkStateReader$3.process Updating live nodes... (28)
   [junit4]   2> 1166294 T4852 oascc.ZkStateReader$3.process Updating live nodes... (28)
   [junit4]   2> 1166294 T4820 oascc.ZkStateReader$3.process Updating live nodes... (28)
   [junit4]   2> 1166294 T4804 oascc.ZkStateReader$3.process Updating live nodes... (28)
   [junit4]   2> 1166294 T4834 oascc.ZkStateReader$3.process Updating live nodes... (28)
   [junit4]   2> 1166294 T4832 oascc.ZkStateReader$3.process Updating live nodes... (28)
   [junit4]   2> 1166294 T4854 oascc.ZkStateReader$3.process Updating live nodes... (28)
   [junit4]   2> 1166294 T4814 oascc.ZkStateReader$3.process Updating live nodes... (28)
   [junit4]   2> 1166294 T4836 oascc.ZkStateReader$3.process Updating live nodes... (28)
   [junit4]   2> 1166294 T4812 oascc.ZkStateReader$3.process Updating live nodes... (28)
   [junit4]   2> 1166293 T4798 oascc.ZkStateReader$3.process Updating live nodes... (28)
   [junit4]   2> 1166293 T4842 oascc.ZkStateReader$3.process Updating live nodes... (28)
   [junit4]   2> 1166293 T4822 oascc.ZkStateReader$3.process Updating live nodes... (28)
   [junit4]   2> 1166297 T4860 oascc.ConnectionManager.process Watcher org.apache.solr.common.cloud.ConnectionManager@5aca9473 name:ZooKeeperConnection Watcher:127.0.0.1:33715/solr got event WatchedEvent state:SyncConnected type:None path:null path:null type:None
   [junit4]   2> 1166293 T4826 oascc.ZkStateReader$3.process Updating live nodes... (28)
   [junit4]   2> 1166293 T4816 oascc.ZkStateReader$3.process Updating live nodes... (28)
   [junit4]   2> 1166293 T4844 oascc.ZkStateReader$3.process Updating live nodes... (28)
   [junit4]   2> 1166293 T4850 oascc.ZkStateReader$3.process Updating live nodes... (28)
   [junit4]   2> 1166293 T4824 oascc.ZkStateReader$3.process Updating live nodes... (28)
   [junit4]   2> 1166293 T4806 oascc.ZkStateReader$3.process Updating live nodes... (28)
   [junit4]   2> 1166293 T4818 oascc.ZkStateReader$3.process Updating live nodes... (28)
   [junit4]   2> 1166293 T4828 oascc.ZkStateReader$3.process Updating live nodes... (28)
   [junit4]   2> 1166293 T4808 oascc.ZkStateReader$3.process Updating live nodes... (28)
   [junit4]   2> 1166292 T4848 oascc.ZkStateReader$3.process Updating live nodes... (28)
   [junit4]   2> 1166292 T4838 oascc.ZkStateReader$3.process Updating live nodes... (28)
   [junit4]   2> 1166292 T4830 oascc.ZkStateReader$3.process Updating live nodes... (28)
   [junit4]   2> 1166292 T4840 oascc.ZkStateReader$3.process Updating live nodes... (28)
   [junit4]   2> 1166292 T4856 oascc.ZkStateReader$3.process Updating live nodes... (28)
   [junit4]   2> 1166295 T4787 oascc.ConnectionManager.waitForConnected Waiting for client to connect to ZooKeeper
   [junit4]   2> 1166301 T4787 oascc.ConnectionManager.waitForConnected Client is connected to ZooKeeper
   [junit4]   2> 1166302 T4787 oascc.ZkStateReader.createClusterStateWatchersAndUpdate Updating cluster state from ZooKeeper... 
   [junit4]   2> 1166304 T4787 oascc.SolrZkClient.makePath makePath: /live_nodes/node28
   [junit4]   2> 1166308 T4848 oascc.ZkStateReader$3.process Updating live nodes... (29)
   [junit4]   2> 1166310 T4854 oascc.ZkStateReader$3.process Updating live nodes... (29)
   [junit4]   2> 1166310 T4856 oascc.ZkStateReader$3.process Updating live nodes... (29)
   [junit4]   2> 1166309 T4858 oascc.ZkStateReader$3.process Updating live nodes... (29)
   [junit4]   2> 1166309 T4844 oascc.ZkStateReader$3.process Updating live nodes... (29)
   [junit4]   2> 1166312 T4850 oascc.ZkStateReader$3.process Updating live nodes... (29)
   [junit4]   2> 1166309 T4834 oascc.ZkStateReader$3.process Updating live nodes... (29)
   [junit4]   2> 1166309 T4830 oascc.ZkStateReader$3.process Updating live nodes... (29)
   [junit4]   2> 1166308 T4828 oascc.ZkStateReader$3.process Updating live nodes... (29)
   [junit4]   2> 1166308 T4798 oascc.ZkStateReader$3.process Updating live nodes... (29)
   [junit4]   2> 1166312 T4787 oascc.ConnectionManager.waitForConnected Waiting for client to connect to ZooKeeper
   [junit4]   2> 1166312 T4826 oascc.ZkStateReader$3.process Updating live nodes... (29)
   [junit4]   2> 1166312 T4806 oascc.ZkStateReader$3.process Updating live nodes... (29)
   [junit4]   2> 1166312 T4852 oascc.ZkStateReader$3.process Updating live nodes... (29)
   [junit4]   2> 1166312 T4842 oascc.ZkStateReader$3.process Updating live nodes... (29)
   [junit4]   2> 1166312 T4860 oascc.ZkStateReader$3.process Updating live nodes... (29)
   [junit4]   2> 1166311 T4816 oascc.ZkStateReader$3.process Updating live nodes... (29)
   [junit4]   2> 1166311 T4846 oascc.ZkStateReader$3.process Updating live nodes... (29)
   [junit4]   2> 1166311 T4838 oascc.ZkStateReader$3.process Updating live nodes... (29)
   [junit4]   2> 1166311 T4820 oascc.ZkStateReader$3.process Updating live nodes... (29)
   [junit4]   2> 1166311 T4832 oascc.ZkStateReader$3.process Updating live nodes... (29)
   [junit4]   2> 1166311 T4824 oascc.ZkStateReader$3.process Updating live nodes... (29)
   [junit4]   2> 1166311 T4804 oascc.ZkStateReader$3.process Updating live nodes... (29)
   [junit4]   2> 1166311 T4814 oascc.ZkStateReader$3.process Updating live nodes... (29)
   [junit4]   2> 1166311 T4810 oascc.ZkStateReader$3.process Updating live nodes... (29)
   [junit4]   2> 1166311 T4808 oascc.ZkStateReader$3.process Updating live nodes... (29)
   [junit4]   2> 1166311 T4812 oascc.ZkStateReader$3.process Updating live nodes... (29)
   [junit4]   2> 1166310 T4836 oascc.ZkStateReader$3.process Updating live nodes... (29)
   [junit4]   2> 1166310 T4822 oascc.ZkStateReader$3.process Updating live nodes... (29)
   [junit4]   2> 1166310 T4840 oascc.ZkStateReader$3.process Updating live nodes... (29)
   [junit4]   2> 1166310 T4818 oascc.ZkStateReader$3.process Updating live nodes... (29)
   [junit4]   2> 1166314 T4862 oascc.ConnectionManager.process Watcher org.apache.solr.common.cloud.ConnectionManager@3d527f67 name:ZooKeeperConnection Watcher:127.0.0.1:33715/solr got event WatchedEvent state:SyncConnected type:None path:null path:null type:None
   [junit4]   2> 1166318 T4787 oascc.ConnectionManager.waitForConnected Client is connected to ZooKeeper
   [junit4]   2> 1166321 T4787 oascc.ZkStateReader.createClusterStateWatchersAndUpdate Updating cluster state from ZooKeeper... 
   [junit4]   2> 1166323 T4787 oascc.SolrZkClient.makePath makePath: /live_nodes/node29
   [junit4]   2> 1166327 T4810 oascc.ZkStateReader$3.process Updating live nodes... (30)
   [junit4]   2> 1166328 T4858 oascc.ZkStateReader$3.process Updating live nodes... (30)
   [junit4]   2> 1166330 T4804 oascc.ZkStateReader$3.process Updating live nodes... (30)
   [junit4]   2> 1166329 T4822 oascc.ZkStateReader$3.process Updating live nodes... (30)
   [junit4]   2> 1166329 T4836 oascc.ZkStateReader$3.process Updating live nodes... (30)
   [junit4]   2> 1166331 T4862 oascc.ZkStateReader$3.process Updating live nodes... (30)
   [junit4]   2> 1166329 T4830 oascc.ZkStateReader$3.process Updating live nodes... (30)
   [junit4]   2> 1166329 T4818 oascc.ZkStateReader$3.process Updating live nodes... (30)
   [junit4]   2> 1166329 T4850 oascc.ZkStateReader$3.process Updating live nodes... (30)
   [junit4]   2> 1166329 T4854 oascc.ZkStateReader$3.process Updating live nodes... (30)
   [junit4]   2> 1166329 T4838 oascc.ZkStateReader$3.process Updating live nodes... (30)
   [junit4]   2> 1166329 T4824 oascc.ZkStateReader$3.process Updating live nodes... (30)
   [junit4]   2> 1166328 T4820 oascc.ZkStateReader$3.process Updating live nodes... (30)
   [junit4]   2> 1166328 T4828 oascc.ZkStateReader$3.process Updating live nodes... (30)
   [junit4]   2> 1166332 T4787 oascc.ConnectionManager.waitForConnected Waiting for client to connect to ZooKeeper
   [junit4]   2> 1166331 T4814 oascc.ZkStateReader$3.process Updating live nodes... (30)
   [junit4]   2> 1166331 T4842 oascc.ZkStateReader$3.process Updating live nodes... (30)
   [junit4]   2> 1166331 T4816 oascc.ZkStateReader$3.process Updating live nodes... (30)
   [junit4]   2> 1166331 T4846 oascc.ZkStateReader$3.process Updating live nodes... (30)
   [junit4]   2> 1166331 T4852 oascc.ZkStateReader$3.process Updating live nodes... (30)
   [junit4]   2> 1166331 T4834 oascc.ZkStateReader$3.process Updating live nodes... (30)
   [junit4]   2> 1166331 T4840 oascc.ZkStateReader$3.process Updating live nodes... (30)
   [junit4]   2> 1166331 T4860 oascc.ZkStateReader$3.process Updating live nodes... (30)
   [junit4]   2> 1166330 T4812 oascc.ZkStateReader$3.process Updating live nodes... (30)
   [junit4]   2> 1166330 T4832 oascc.ZkStateReader$3.process Updating live nodes... (30)
   [junit4]   2> 1166330 T4844 oascc.ZkStateReader$3.process Updating live nodes... (30)
   [junit4]   2> 1166330 T4826 oascc.ZkStateReader$3.process Updating live nodes... (30)
   [junit4]   2> 1166330 T4798 oascc.ZkStateReader$3.process Updating live nodes... (30)
   [junit4]   2> 1166330 T4856 oascc.ZkStateReader$3.process Updating live nodes... (30)
   [junit4]   2> 1166330 T4848 oascc.ZkStateReader$3.process Updating live nodes... (30)
   [junit4]   2> 1166330 T4808 oascc.ZkStateReader$3.process Updating live nodes... (30)
   [junit4]   2> 1166330 T4806 oascc.ZkStateReader$3.process Updating live nodes... (30)
   [junit4]   2> 1166333 T4864 oascc.ConnectionManager.process Watcher org.apache.solr.common.cloud.ConnectionManager@6eb0766d name:ZooKeeperConnection Watcher:127.0.0.1:33715/solr got event WatchedEvent state:SyncConnected type:None path:null path:null type:None
   [junit4]   2> 1166338 T4787 oascc.ConnectionManager.waitForConnected Client is connected to ZooKeeper
   [junit4]   2> 1166339 T4787 oascc.ZkStateReader.createClusterStateWatchersAndUpdate Updating cluster state from ZooKeeper... 
   [junit4]   2> 1166341 T4787 oascc.SolrZkClient.makePath makePath: /live_nodes/node30
   [junit4]   2> 1166346 T4810 oascc.ZkStateReader$3.process Updating live nodes... (31)
   [junit4]   2> 1166347 T4836 oascc.ZkStateReader$3.process Updating live nodes... (31)
   [junit4]   2> 1166348 T4804 oascc.ZkStateReader$3.process Updating live nodes... (31)
   [junit4]   2> 1166348 T4838 oascc.ZkStateReader$3.process Updating live nodes... (31)
   [junit4]   2> 1166349 T4822 oascc.ZkStateReader$3.process Updating live nodes... (31)
   [junit4]   2> 1166347 T4812 oascc.ZkStateReader$3.process Updating live nodes... (31)
   [junit4]   2> 1166349 T4814 oascc.ZkStateReader$3.process Updating live nodes... (31)
   [junit4]   2> 1166347 T4808 oascc.ZkStateReader$3.process Updating live nodes... (31)
   [junit4]   2> 1166347 T4820 oascc.ZkStateReader$3.process Updating live nodes... (31)
   [junit4]   2> 1166347 T4846 oascc.ZkStateReader$3.process Updating live nodes... (31)
   [junit4]   2> 1166347 T4806 oascc.ZkStateReader$3.process Updating live nodes... (31)
   [junit4]   2> 1166347 T4852 oascc.ZkStateReader$3.process Updating live nodes... (31)
   [junit4]   2> 1166346 T4840 oascc.ZkStateReader$3.process Updating live nodes... (31)
   [junit4]   2> 1166346 T4834 oascc.ZkStateReader$3.process Updating live nodes... (31)
   [junit4]   2> 1166350 T4787 oascc.ConnectionManager.waitForConnected Waiting for client to connect to ZooKeeper
   [junit4]   2> 1166349 T4850 oascc.ZkStateReader$3.process Updating live nodes... (31)
   [junit4]   2> 1166349 T4798 oascc.ZkStateReader$3.process Updating live nodes... (31)
   [junit4]   2> 1166349 T4864 oascc.ZkStateReader$3.process Updating live nodes... (31)
   [junit4]   2> 1166349 T4862 oascc.ZkStateReader$3.process Updating live nodes... (31)
   [junit4]   2> 1166349 T4858 oascc.ZkStateReader$3.process Updating live nodes... (31)
   [junit4]   2> 1166348 T4842 oascc.ZkStateReader$3.process Updating live nodes... (31)
   [junit4]   2> 1166348 T4824 oascc.ZkStateReader$3.process Updating live nodes... (31)
   [junit4]   2> 1166348 T4856 oascc.ZkStateReader$3.process Updating live nodes... (31)
   [junit4]   2> 1166348 T4816 oascc.ZkStateReader$3.process Updating live nodes... (31)
   [junit4]   2> 1166348 T4826 oascc.ZkStateReader$3.process Updating live nodes... (31)
   [junit4]   2> 1166348 T4818 oascc.ZkStateReader$3.process Updating live nodes... (31)
   [junit4]   2> 1166348 T4860 oascc.ZkStateReader$3.process Updating live nodes... (31)
   [junit4]   2> 1166348 T4854 oascc.ZkStateReader$3.process Updating live nodes... (31)
   [junit4]   2> 1166348 T4830 oascc.ZkStateReader$3.process Updating live nodes... (31)
   [junit4]   2> 1166348 T4832 oascc.ZkStateReader$3.process Updating live nodes... (31)
   [junit4]   2> 1166348 T4848 oascc.ZkStateReader$3.process Updating live nodes... (31)
   [junit4]   2> 1166347 T4828 oascc.ZkStateReader$3.process Updating live nodes... (31)
   [junit4]   2> 1166347 T4844 oascc.ZkStateReader$3.process Updating live nodes... (31)
   [junit4]   2> 1166351 T4866 oascc.ConnectionManager.process Watcher org.apache.solr.common.cloud.ConnectionManager@a4ae8a5 name:ZooKeeperConnection Watcher:127.0.0.1:33715/solr got event WatchedEvent state:SyncConnected type:None path:null path:null type:None
   [junit4]   2> 1166356 T4787 oascc.ConnectionManager.waitForConnected Client is connected to ZooKeeper
   [junit4]   2> 1166357 T4787 oascc.ZkStateReader.createClusterStateWatchersAndUpdate Updating cluster state from ZooKeeper... 
   [junit4]   2> 1166360 T4787 oascc.SolrZkClient.makePath makePath: /live_nodes/node31
   [junit4]   2> 1166365 T4808 oascc.ZkStateReader$3.process Updating live nodes... (32)
   [junit4]   2> 1166366 T4822 oascc.ZkStateReader$3.process Updating live nodes... (32)
   [junit4]   2> 1166366 T4820 oascc.ZkStateReader$3.process Updating live nodes... (32)
   [junit4]   2> 1166365 T4862 oascc.ZkStateReader$3.process Updating live nodes... (32)
   [junit4]   2> 1166367 T4804 oascc.ZkStateReader$3.process Updating live nodes... (32)
   [junit4]   2> 1166367 T4866 oascc.ZkStateReader$3.process Updating live nodes... (32)
   [junit4]   2> 1166367 T4798 oascc.ZkStateReader$3.process Updating live nodes... (32)
   [junit4]   2> 1166367 T4816 oascc.ZkStateReader$3.process Updating live nodes... (32)
   [junit4]   2> 1166367 T4834 oascc.ZkStateReader$3.process Updating live nodes... (32)
   [junit4]   2> 1166367 T4840 oascc.ZkStateReader$3.process Updating live nodes... (32)
   [junit4]   2> 1166367 T4864 oascc.ZkStateReader$3.process Updating live nodes... (32)
   [junit4]   2> 1166367 T4842 oascc.ZkStateReader$3.process Updating live nodes... (32)
   [junit4]   2> 1166367 T4832 oascc.ZkStateReader$3.process Updating live nodes... (32)
   [junit4]   2> 1166367 T4824 oascc.ZkStateReader$3.process Updating live nodes... (32)
   [junit4]   2> 1166366 T4818 oascc.ZkStateReader$3.process Updating live nodes... (32)
   [junit4]   2> 1166366 T4812 oascc.ZkStateReader$3.process Updating live nodes... (32)
   [junit4]   2> 1166366 T4854 oascc.ZkStateReader$3.process Updating live nodes... (32)
   [junit4]   2> 1166366 T4830 oascc.ZkStateReader$3.process Updating live nodes... (32)
   [junit4]   2> 1166366 T4860 oascc.ZkStateReader$3.process Updating live nodes... (32)
   [junit4]   2> 1166366 T4846 oascc.ZkStateReader$3.process Updating live nodes... (32)
   [junit4]   2> 1166366 T4806 oascc.ZkStateReader$3.process Updating live nodes... (32)
   [junit4]   2> 1166365 T4858 oascc.ZkStateReader$3.process Updating live nodes... (32)
   [junit4]   2> 1166365 T4814 oascc.ZkStateReader$3.process Updating live nodes... (32)
   [junit4]   2> 1166365 T4828 oascc.ZkStateReader$3.process Updating live nodes... (32)
   [junit4]   2> 1166365 T4810 oascc.ZkStateReader$3.process Updating live nodes... (32)
   [junit4]   2> 1166365 T4848 oascc.ZkStateReader$3.process Updating live nodes... (32)
   [junit4]   2> 1166370 T4868 oascc.ConnectionManager.process Watcher org.apache.solr.common.cloud.ConnectionManager@3c65af3b name:ZooKeeperConnection Watcher:127.0.0.1:33715/solr got event WatchedEvent state:SyncConnected type:None path:null path:null type:None
   [junit4]   2> 1166368 T4787 oascc.ConnectionManager.waitForConnected Waiting for client to connect to ZooKeeper
   [junit4]   2> 1166368 T4836 oascc.ZkStateReader$3.process Updating live nodes... (32)
   [junit4]   2> 1166368 T4826 oascc.ZkStateReader$3.process Updating live nodes... (32)
   [junit4]   2> 1166367 T4844 oascc.ZkStateReader$3.process Updating live nodes... (32)
   [junit4]   2> 1166367 T4838 oascc.ZkStateReader$3.process Updating live nodes... (32)
   [junit4]   2> 1166367 T4856 oascc.ZkStateReader$3.process Updating live nodes... (32)
   [junit4]   2> 1166367 T4850 oascc.ZkStateReader$3.process Updating live nodes... (32)
   [junit4]   2> 1166367 T4852 oascc.ZkStateReader$3.process Updating live nodes... (32)
   [junit4]   2> 1166373 T4787 oascc.ConnectionManager.waitForConnected Client is connected to ZooKeeper
   [junit4]   2> 1166376 T4787 oascc.ZkStateReader.createClusterStateWatchersAndUpdate Updating cluster state from ZooKeeper... 
   [junit4]   2> 1166378 T4787 oascc.SolrZkClient.makePath makePath: /live_nodes/node32
   [junit4]   2> 1166383 T4862 oascc.ZkStateReader$3.process Updating live nodes... (33)
   [junit4]   2> 1166383 T4848 oascc.ZkStateReader$3.process Updating live nodes... (33)
   [junit4]   2> 1166383 T4858 oascc.ZkStateReader$3.process Updating live nodes... (33)
   [junit4]   2> 1166385 T4822 oascc.ZkStateReader$3.process Updating live nodes... (33)
   [junit4]   2> 1166386 T4804 oascc.ZkStateReader$3.process Updating live nodes... (33)
   [junit4]   2> 1166385 T4856 oascc.ZkStateReader$3.process Updating live nodes... (33)
   [junit4]   2> 1166386 T4868 oascc.ZkStateReader$3.process Updating live nodes... (33)
   [junit4]   2> 1166385 T4864 oascc.ZkStateReader$3.process Updating live nodes... (33)
   [junit4]   2> 1166385 T4810 oascc.ZkStateReader$3.process Updating live nodes... (33)
   [junit4]   2> 1166385 T4824 oascc.ZkStateReader$3.process Updating live nodes... (33)
   [junit4]   2> 1166384 T4834 oascc.ZkStateReader$3.process Updating live nodes... (33)
   [junit4]   2> 1166384 T4814 oascc.ZkStateReader$3.process Updating live nodes... (33)
   [junit4]   2> 1166384 T4828 oascc.ZkStateReader$3.process Updating live nodes... (33)
   [junit4]   2> 1166387 T4787 oascc.ConnectionManager.waitForConnected Waiting for client to connect to ZooKeeper
   [junit4]   2> 1166387 T4798 oascc.ZkStateReader$3.process Updating live nodes... (33)
   [junit4]   2> 1166386 T4838 oascc.ZkStateReader$3.process Updating live nodes... (33)
   [junit4]   2> 1166386 T4820 oascc.ZkStateReader$3.process Updating live nodes... (33)
   [junit4]   2> 1166386 T4840 oascc.ZkStateReader$3.process Updating live nodes... (33)
   [junit4]   2> 1166386 T4842 oascc.ZkStateReader$3.process Updating live nodes... (33)
   [junit4]   2> 1166386 T4850 oascc.ZkStateReader$3.process Updating live nodes... (33)
   [junit4]   2> 1166386 T4844 oascc.ZkStateReader$3.process Updating live nodes... (33)
   [junit4]   2> 1166386 T4826 oascc.ZkStateReader$3.process Updating live nodes... (33)
   [junit4]   2> 1166386 T4852 oascc.ZkStateReader$3.process Updating live nodes... (33)
   [junit4]   2> 1166386 T4832 oascc.ZkStateReader$3.process Updating live nodes... (33)
   [junit4]   2> 1166386 T4860 oascc.ZkStateReader$3.process Updating live nodes... (33)
   [junit4]   2> 1166386 T4854 oascc.ZkStateReader$3.process Updating live nodes... (33)
   [junit4]   2> 1166385 T4812 oascc.ZkStateReader$3.process Updating live nodes... (33)
   [junit4]   2> 1166385 T4816 oascc.ZkStateReader$3.process Updating live nodes... (33)
   [junit4]   2> 1166385 T4866 oascc.ZkStateReader$3.process Updating live nodes... (33)
   [junit4]   2> 1166385 T4818 oascc.ZkStateReader$3.process Updating live nodes... (33)
   [junit4]   2> 1166385 T4846 oascc.ZkStateReader$3.process Updating live nodes... (33)
   [junit4]   2> 1166385 T4830 oascc.ZkStateReader$3.process Updating live nodes... (33)
   [junit4]   2> 1166385 T4836 oascc.ZkStateReader$3.process Updating live nodes... (33)
   [junit4]   2> 1166385 T4806 oascc.ZkStateReader$3.process Updating live nodes... (33)
   [junit4]   2> 1166385 T4808 oascc.ZkStateReader$3.process Updating live nodes... (33)
   [junit4]   2> 1166389 T4870 oascc.ConnectionManager.process Watcher org.apache.solr.common.cloud.ConnectionManager@76db92b9 name:ZooKeeperConnection Watcher:127.0.0.1:33715/solr got event WatchedEvent state:SyncConnected type:None path:null path:null type:None
   [junit4]   2> 1166394 T4787 oascc.ConnectionManager.waitForConnected Client is connected to ZooKeeper
   [junit4]   2> 1166395 T4787 oascc.ZkStateReader.createClusterStateWatchersAndUpdate Updating cluster state from ZooKeeper... 
   [junit4]   2> 1166397 T4787 oascc.SolrZkClient.makePath makePath: /live_nodes/node33
   [junit4]   2> 1166401 T4798 oascc.ZkStateReader$3.process Updating live nodes... (34)
   [junit4]   2> 1166401 T4824 oascc.ZkStateReader$3.process Updating live nodes... (34)
   [junit4]   2> 1166402 T4828 oascc.ZkStateReader$3.process Updating live nodes... (34)
   [junit4]   2> 1166403 T4836 oascc.ZkStateReader$3.process Updating live nodes... (34)
   [junit4]   2> 1166404 T4864 oascc.ZkStateReader$3.process Updating live nodes... (34)
   [junit4]   2> 1166404 T4820 oascc.ZkStateReader$3.process Updating live nodes... (34)
   [junit4]   2> 1166404 T4868 oascc.ZkStateReader$3.process Updating live nodes... (34)
   [junit4]   2> 1166405 T4814 oascc.ZkStateReader$3.process Updating live nodes... (34)
   [junit4]   2> 1166405 T4852 oascc.ZkStateReader$3.process Updating live nodes... (34)
   [junit4]   2> 1166406 T4866 oascc.ZkStateReader$3.process Updating live nodes... (34)
   [junit4]   2> 1166404 T4844 oascc.ZkStateReader$3.process Updating live nodes... (34)
   [junit4]   2> 1166404 T4848 oascc.ZkStateReader$3.process Updating live nodes... (34)
   [junit4]   2> 1166404 T4860 oascc.ZkStateReader$3.process Updating live nodes... (34)
   [junit4]   2> 1166404 T4856 oascc.ZkStateReader$3.process Updating live nodes... (34)
   [junit4]   2> 1166404 T4846 oascc.ZkStateReader$3.process Updating live nodes... (34)
   [junit4]   2> 1166404 T4854 oascc.ZkStateReader$3.process Updating live nodes... (34)
   [junit4]   2> 1166404 T4810 oascc.ZkStateReader$3.process Updating live nodes... (34)
   [junit4]   2> 1166403 T4808 oascc.ZkStateReader$3.process Updating live nodes... (34)
   [junit4]   2> 1166403 T4862 oascc.ZkStateReader$3.process Updating live nodes... (34)
   [junit4]   2> 1166403 T4816 oascc.ZkStateReader$3.process Updating live nodes... (34)
   [junit4]   2> 1166403 T4818 oascc.ZkStateReader$3.process Updating live nodes... (34)
   [junit4]   2> 1166403 T4858 oascc.ZkStateReader$3.process Updating live nodes... (34)
   [junit4]   2> 1166402 T4838 oascc.ZkStateReader$3.process Updating live nodes... (34)
   [junit4]   2> 1166402 T4842 oascc.ZkStateReader$3.process Updating live nodes... (34)
   [junit4]   2> 1166408 T4872 oascc.ConnectionManager.process Watcher org.apache.solr.common.cloud.ConnectionManager@75cc5fa8 name:ZooKeeperConnection Watcher:127.0.0.1:33715/solr got event WatchedEvent state:SyncConnected type:None path:null path:null type:None
   [junit4]   2> 1166406 T4787 oascc.ConnectionManager.waitForConnected Waiting for client to connect to ZooKeeper
   [junit4]   2> 1166405 T4870 oascc.ZkStateReader$3.process Updating live nodes... (34)
   [junit4]   2> 1166405 T4826 oascc.ZkStateReader$3.process U

[...truncated too long message...]

e$LatchChildWatcher.process LatchChildWatcher fired on path: /overseer/queue state: SyncConnected type NodeChildrenChanged
   [junit4]   2> 1192352 T5226 oasc.Overseer$ClusterStateUpdater.setShardLeader ERROR Could not mark shard leader for non existing collection:collection1
   [junit4]   2> 1192354 T5225 oasc.DistributedQueue$LatchChildWatcher.process LatchChildWatcher fired on path: /overseer/queue state: SyncConnected type NodeChildrenChanged
   [junit4]   2> 1192458 T5217 oascc.ZkStateReader$2.process A cluster state change: WatchedEvent state:SyncConnected type:NodeDataChanged path:/clusterstate.json, has occurred - updating... (live nodes size: 1)
   [junit4]   2> 1192458 T5219 oascc.ZkStateReader$2.process A cluster state change: WatchedEvent state:SyncConnected type:NodeDataChanged path:/clusterstate.json, has occurred - updating... (live nodes size: 1)
   [junit4]   2> 1193346 T4787 oascc.SolrZkClient.makePath makePath: /collections/collection1/leaders/shard1
   [junit4]   2> 1194375 T4787 oascc.SolrZkClient.makePath makePath: /collections/collection1/leaders/shard1
   [junit4]   2> 1195379 T4787 oascc.SolrZkClient.makePath makePath: /collections/collection1/leaders/shard1
   [junit4]   2> 1196384 T4787 oascc.SolrZkClient.makePath makePath: /collections/collection1/leaders/shard1
   [junit4]   2> 1197415 T4787 oascc.SolrZkClient.makePath makePath: /collections/collection1/leaders/shard1
   [junit4]   2> 1198422 T4787 oascc.SolrZkClient.makePath makePath: /collections/collection1/leaders/shard1
   [junit4]   2> 1199426 T4787 oascc.SolrZkClient.makePath makePath: /collections/collection1/leaders/shard1
   [junit4]   2> 1200433 T4787 oascc.SolrZkClient.makePath makePath: /collections/collection1/leaders/shard1
   [junit4]   2> 1201437 T4787 oascc.SolrZkClient.makePath makePath: /collections/collection1/leaders/shard1
   [junit4]   2> 1202443 T4787 oascc.SolrZkClient.makePath makePath: /collections/collection1/leaders/shard1
   [junit4]   2> 1203456 T4787 oascc.SolrZkClient.makePath makePath: /collections/collection1/leaders/shard1
   [junit4]   2> 1204459 T4787 oascc.SolrZkClient.makePath makePath: /collections/collection1/leaders/shard1
   [junit4]   2> 1205463 T4787 oascc.SolrZkClient.makePath makePath: /collections/collection1/leaders/shard1
   [junit4]   2> 1206468 T4787 oascc.SolrZkClient.makePath makePath: /collections/collection1/leaders/shard1
   [junit4]   2> 1207475 T4787 oascc.SolrZkClient.makePath makePath: /collections/collection1/leaders/shard1
   [junit4]   2> 1207489 T5217 oascc.ZkStateReader$3.process Updating live nodes... (0)
   [junit4]   2> 1207489 T5219 oascc.ZkStateReader$3.process Updating live nodes... (0)
   [junit4]   2> 1207504 T4787 oasc.ZkTestServer.send4LetterWord connecting to 127.0.0.1:33864 33864
   [junit4]   2> 1207628 T4787 oas.SolrTestCaseJ4.tearDown ###Ending testOverseerFailure
   [junit4]   1> client port:0.0.0.0/0.0.0.0:0
   [junit4]   2> NOTE: reproduce with: ant test  -Dtestcase=OverseerTest -Dtests.method=testOverseerFailure -Dtests.seed=DE92FEACCB9C6927 -Dtests.multiplier=3 -Dtests.slow=true -Dtests.locale=in_ID -Dtests.timezone=PRC -Dtests.file.encoding=US-ASCII
   [junit4] ERROR   18.6s J0 | OverseerTest.testOverseerFailure <<<
   [junit4]    > Throwable #1: org.apache.solr.common.SolrException: Could not register as the leader because creating the ephemeral registration node in ZooKeeper failed
   [junit4]    > 	at __randomizedtesting.SeedInfo.seed([DE92FEACCB9C6927:DA9A715FD9398606]:0)
   [junit4]    > 	at org.apache.solr.cloud.ShardLeaderElectionContextBase.runLeaderProcess(ElectionContext.java:135)
   [junit4]    > 	at org.apache.solr.cloud.LeaderElector.runIamLeaderProcess(LeaderElector.java:164)
   [junit4]    > 	at org.apache.solr.cloud.LeaderElector.checkIfIamLeader(LeaderElector.java:108)
   [junit4]    > 	at org.apache.solr.cloud.LeaderElector.checkIfIamLeader(LeaderElector.java:156)
   [junit4]    > 	at org.apache.solr.cloud.LeaderElector.joinElection(LeaderElector.java:289)
   [junit4]    > 	at org.apache.solr.cloud.OverseerTest$MockZKController.publishState(OverseerTest.java:155)
   [junit4]    > 	at org.apache.solr.cloud.OverseerTest.testOverseerFailure(OverseerTest.java:666)
   [junit4]    > 	at java.lang.Thread.run(Thread.java:679)
   [junit4]    > Caused by: org.apache.solr.common.SolrException: org.apache.zookeeper.KeeperException$NodeExistsException: KeeperErrorCode = NodeExists for /collections/collection1/leaders/shard1
   [junit4]    > 	at org.apache.solr.common.util.RetryUtil.retryOnThrowable(RetryUtil.java:40)
   [junit4]    > 	at org.apache.solr.cloud.ShardLeaderElectionContextBase.runLeaderProcess(ElectionContext.java:122)
   [junit4]    > 	... 46 more
   [junit4]    > Caused by: org.apache.zookeeper.KeeperException$NodeExistsException: KeeperErrorCode = NodeExists for /collections/collection1/leaders/shard1
   [junit4]    > 	at org.apache.zookeeper.KeeperException.create(KeeperException.java:119)
   [junit4]    > 	at org.apache.zookeeper.KeeperException.create(KeeperException.java:51)
   [junit4]    > 	at org.apache.zookeeper.ZooKeeper.create(ZooKeeper.java:783)
   [junit4]    > 	at org.apache.solr.common.cloud.SolrZkClient$10.execute(SolrZkClient.java:431)
   [junit4]    > 	at org.apache.solr.common.cloud.ZkCmdExecutor.retryOperation(ZkCmdExecutor.java:73)
   [junit4]    > 	at org.apache.solr.common.cloud.SolrZkClient.makePath(SolrZkClient.java:428)
   [junit4]    > 	at org.apache.solr.common.cloud.SolrZkClient.makePath(SolrZkClient.java:385)
   [junit4]    > 	at org.apache.solr.common.cloud.SolrZkClient.makePath(SolrZkClient.java:372)
   [junit4]    > 	at org.apache.solr.cloud.ShardLeaderElectionContextBase$1.execute(ElectionContext.java:127)
   [junit4]    > 	at org.apache.solr.common.util.RetryUtil.retryOnThrowable(RetryUtil.java:34)
   [junit4]    > 	... 47 more
   [junit4]   2> 1207645 T4787 oas.SolrTestCaseJ4.initCore ####initCore
   [junit4]   2> 1207645 T4787 oas.SolrTestCaseJ4.initCore ####initCore end
   [junit4]   2> 1210647 T4787 oas.SolrTestCaseJ4.deleteCore ###deleteCore
   [junit4]   2> NOTE: test params are: codec=Lucene42, sim=RandomSimilarityProvider(queryNorm=true,coord=crazy): {}, locale=in_ID, timezone=PRC
   [junit4]   2> NOTE: FreeBSD 9.1-RELEASE-p3 amd64/Sun Microsystems Inc. 1.6.0_32 (64-bit)/cpus=16,threads=1,free=48493704,total=436469760
   [junit4]   2> NOTE: All tests run in this JVM: [DirectUpdateHandlerOptimizeTest, TestExpandComponent, DeleteShardTest, SuggesterTest, AnalysisErrorHandlingTest, WordBreakSolrSpellCheckerTest, TestDocSet, TestManagedSchema, TestFieldSortValues, TestLMDirichletSimilarityFactory, SpatialFilterTest, TestDocumentBuilder, SynonymTokenizerTest, TestLuceneMatchVersion, ClusterStateUpdateTest, TestNonNRTOpen, TriLevelCompositeIdRoutingTest, RecoveryZkTest, TestInitQParser, DeleteReplicaTest, TestClassNameShortening, TestSuggestSpellingConverter, AutoCommitTest, TestPseudoReturnFields, TestSolrIndexConfig, TestSolrQueryParser, BlockCacheTest, TestPHPSerializedResponseWriter, ClusterStateTest, TestSolrXmlPersistor, TestCoreContainer, ParsingFieldUpdateProcessorsTest, TestCloudManagedSchemaAddField, HdfsSyncSliceTest, RegexBoostProcessorTest, EchoParamsTest, CoreMergeIndexesAdminHandlerTest, DOMUtilTest, TestWriterPerf, QueryElevationComponentTest, PeerSyncTest, TestFaceting, TestSerializedLuceneMatchVersion, FieldMutatingUpdateProcessorTest, TestInfoStreamLogging, TestSort, SuggesterFSTTest, ScriptEngineTest, TestRandomDVFaceting, TestReplicationHandler, TestMaxScoreQueryParser, TestBM25SimilarityFactory, BasicFunctionalityTest, TestStressUserVersions, TestSolrXmlPersistence, LoggingHandlerTest, DistributedSpellCheckComponentTest, StatelessScriptUpdateProcessorFactoryTest, PrimitiveFieldTypeTest, TestSearchPerf, DistributedQueryElevationComponentTest, HdfsRecoveryZkTest, DistributedSuggestComponentTest, CursorMarkTest, TestRealTimeGet, SliceStateUpdateTest, TestValueSourceCache, URLClassifyProcessorTest, ResponseLogComponentTest, TestLRUCache, SliceStateTest, TestExtendedDismaxParser, CacheHeaderTest, QueryResultKeyTest, OverseerCollectionProcessorTest, TestElisionMultitermQuery, SearchHandlerTest, TestCustomSort, SolrInfoMBeanTest, JsonLoaderTest, SimpleFacetsTest, OverseerRolesTest, FastVectorHighlighterTest, BadComponentTest, TestQueryUtils, LukeRequestHandlerTest, SystemInfoHandlerTest, BasicDistributedZkTest, ChaosMonkeySafeLeaderTest, BasicDistributedZk2Test, UnloadDistributedZkTest, OverseerTest]
   [junit4] Completed on J0 in 44.94s, 9 tests, 1 error <<< FAILURES!

[...truncated 579 lines...]
BUILD FAILED
/usr/home/hudson/hudson-slave/workspace/Lucene-Solr-Tests-4.x-Java6/build.xml:471: The following error occurred while executing this line:
/usr/home/hudson/hudson-slave/workspace/Lucene-Solr-Tests-4.x-Java6/build.xml:451: The following error occurred while executing this line:
/usr/home/hudson/hudson-slave/workspace/Lucene-Solr-Tests-4.x-Java6/build.xml:39: The following error occurred while executing this line:
/usr/home/hudson/hudson-slave/workspace/Lucene-Solr-Tests-4.x-Java6/extra-targets.xml:37: The following error occurred while executing this line:
/usr/home/hudson/hudson-slave/workspace/Lucene-Solr-Tests-4.x-Java6/solr/build.xml:189: The following error occurred while executing this line:
/usr/home/hudson/hudson-slave/workspace/Lucene-Solr-Tests-4.x-Java6/solr/common-build.xml:490: The following error occurred while executing this line:
/usr/home/hudson/hudson-slave/workspace/Lucene-Solr-Tests-4.x-Java6/lucene/common-build.xml:1278: The following error occurred while executing this line:
/usr/home/hudson/hudson-slave/workspace/Lucene-Solr-Tests-4.x-Java6/lucene/common-build.xml:911: There were test failures: 369 suites, 1578 tests, 1 error, 37 ignored (8 assumptions)

Total time: 69 minutes 33 seconds
Build step 'Invoke Ant' marked build as failure
Archiving artifacts
Recording test results
Email was triggered for: Failure
Sending email for trigger: Failure



Re: [JENKINS] Lucene-Solr-Tests-4.x-Java6 - Build # 2330 - Still Failing

Posted by Robert Muir <rc...@gmail.com>.
Sorry, ill fix

On Fri, Mar 7, 2014 at 11:41 AM, Apache Jenkins Server
<je...@builds.apache.org> wrote:
> Build: https://builds.apache.org/job/Lucene-Solr-Tests-4.x-Java6/2330/
>
> All tests passed
>
> Build Log:
> [...truncated 3742 lines...]
>     [javac] Compiling 20 source files to /usr/home/hudson/hudson-slave/workspace/Lucene-Solr-Tests-4.x-Java6/lucene/build/misc/classes/java
>     [javac] /usr/home/hudson/hudson-slave/workspace/Lucene-Solr-Tests-4.x-Java6/lucene/misc/src/java/org/apache/lucene/index/sorter/Sorter.java:238: cannot find symbol
>     [javac] symbol  : method compare(int,int)
>     [javac] location: class java.lang.Integer
>     [javac]           return Integer.compare(docID1, docID2); // docid order tiebreak
>     [javac]                         ^
>     [javac] Note: Some input files use or override a deprecated API.
>     [javac] Note: Recompile with -Xlint:deprecation for details.
>     [javac] 1 error
>
> BUILD FAILED
> /usr/home/hudson/hudson-slave/workspace/Lucene-Solr-Tests-4.x-Java6/build.xml:471: The following error occurred while executing this line:
> /usr/home/hudson/hudson-slave/workspace/Lucene-Solr-Tests-4.x-Java6/build.xml:451: The following error occurred while executing this line:
> /usr/home/hudson/hudson-slave/workspace/Lucene-Solr-Tests-4.x-Java6/build.xml:39: The following error occurred while executing this line:
> /usr/home/hudson/hudson-slave/workspace/Lucene-Solr-Tests-4.x-Java6/extra-targets.xml:37: The following error occurred while executing this line:
> /usr/home/hudson/hudson-slave/workspace/Lucene-Solr-Tests-4.x-Java6/lucene/build.xml:534: The following error occurred while executing this line:
> /usr/home/hudson/hudson-slave/workspace/Lucene-Solr-Tests-4.x-Java6/lucene/common-build.xml:1998: The following error occurred while executing this line:
> /usr/home/hudson/hudson-slave/workspace/Lucene-Solr-Tests-4.x-Java6/lucene/module-build.xml:57: The following error occurred while executing this line:
> /usr/home/hudson/hudson-slave/workspace/Lucene-Solr-Tests-4.x-Java6/lucene/common-build.xml:471: The following error occurred while executing this line:
> /usr/home/hudson/hudson-slave/workspace/Lucene-Solr-Tests-4.x-Java6/lucene/common-build.xml:1736: Compile failed; see the compiler error output for details.
>
> Total time: 12 minutes 23 seconds
> Build step 'Invoke Ant' marked build as failure
> Archiving artifacts
> Recording test results
> Email was triggered for: Failure
> Sending email for trigger: Failure
>
>
>
>
> ---------------------------------------------------------------------
> To unsubscribe, e-mail: dev-unsubscribe@lucene.apache.org
> For additional commands, e-mail: dev-help@lucene.apache.org

---------------------------------------------------------------------
To unsubscribe, e-mail: dev-unsubscribe@lucene.apache.org
For additional commands, e-mail: dev-help@lucene.apache.org