You are viewing a plain text version of this content. The canonical link for it is here.
Posted to builds@flink.apache.org by in...@openlabtesting.org on 2021/08/01 13:14:56 UTC

Daily Flink ARM Cron Job Test Result - FAILED

Build failed.

- flink-build-and-test-arm64-core-and-tests https://logs.openlabtesting.org/logs/periodic-20-flink-mail/github.com/apache/flink/master/flink-build-and-test-arm64-core-and-tests/52d0552/ : SUCCESS in 1h 02m 52s
- flink-build-and-test-arm64-libraies-and-blink_planner https://logs.openlabtesting.org/logs/periodic-20-flink-mail/github.com/apache/flink/master/flink-build-and-test-arm64-libraies-and-blink_planner/bf7edc0/ : FAILURE in 24m 30s
- flink-build-and-test-arm64-kafka_gelly-and-connectors https://logs.openlabtesting.org/logs/periodic-20-flink-mail/github.com/apache/flink/master/flink-build-and-test-arm64-kafka_gelly-and-connectors/a377d56/ : FAILURE in 53m 25s
- flink-build-and-test-arm64-misc https://logs.openlabtesting.org/logs/periodic-20-flink-mail/github.com/apache/flink/master/flink-build-and-test-arm64-misc/b98e65e/ : FAILURE in 43m 01s
- flink-build-and-test-arm64-scheduler-ng-core-and-ng-tests https://logs.openlabtesting.org/logs/periodic-20-flink-mail/github.com/apache/flink/master/flink-build-and-test-arm64-scheduler-ng-core-and-ng-tests/f329fa0/ : SUCCESS in 1h 02m 10s
- flink-end-to-end-test-cron-openlab https://logs.openlabtesting.org/logs/periodic-20-flink-mail/github.com/apache/flink/master/flink-end-to-end-test-cron-openlab/c7e6c0a/ : FAILURE in 1h 13m 12s
- flink-end-to-end-test-cron-hadoop241 https://logs.openlabtesting.org/logs/periodic-20-flink-mail/github.com/apache/flink/master/flink-end-to-end-test-cron-hadoop241/ccddd99/ : FAILURE in 1h 06m 54s
- flink-end-to-end-test-cron-hadoop313 https://logs.openlabtesting.org/logs/periodic-20-flink-mail/github.com/apache/flink/master/flink-end-to-end-test-cron-hadoop313/5ba12b5/ : FAILURE in 1h 04m 58s
- flink-end-to-end-test-cron-jdk11 https://logs.openlabtesting.org/logs/periodic-20-flink-mail/github.com/apache/flink/master/flink-end-to-end-test-cron-jdk11/88a302d/ : FAILURE in 1h 12m 36s
- flink-end-to-end-test-cron-scala212 https://logs.openlabtesting.org/logs/periodic-20-flink-mail/github.com/apache/flink/master/flink-end-to-end-test-cron-scala212/e86a02f/ : FAILURE in 1h 07m 55s