You are viewing a plain text version of this content. The canonical link for it is here.
Posted to torque-dev@db.apache.org by Apache Jenkins Server <je...@builds.apache.org> on 2021/05/08 13:30:54 UTC

Build failed in Jenkins: DB » Torque » Torque5-trunk » Torque Maven Parent #12

See <https://ci-builds.apache.org/job/DB/job/Torque/job/Torque5-trunk/org.apache.torque$torque/12/display/redirect>

Changes:


------------------------------------------
Established TCP socket on 34447
maven35-agent.jar already up to date
maven35-interceptor.jar already up to date
maven3-interceptor-commons.jar already up to date
<===[JENKINS REMOTING CAPACITY]===>   channel started
Executing Maven:  -B -f <https://ci-builds.apache.org/job/DB/job/Torque/job/Torque5-trunk/org.apache.torque$torque/ws/pom.xml> clean install cobertura:cobertura findbugs:findbugs checkstyle:checkstyle pmd:pmd pmd:cpd
[INFO] Scanning for projects...
[HUDSON] Collecting dependencies info
[HUDSON] Collecting dependencies info
[HUDSON] Collecting dependencies info
[HUDSON] Collecting dependencies info
[HUDSON] Collecting dependencies info
[HUDSON] Collecting dependencies info
[HUDSON] Collecting dependencies info
[INFO] ------------------------------------------------------------------------
[INFO] Reactor Build Order:
[INFO] 
[INFO] Torque Maven Parent                                                [pom]
[INFO] Torque Runtime                                                     [jar]
[INFO] Torque Generator                                                   [jar]
[INFO] Torque Templates                                                   [jar]
[INFO] Torque Generator Maven 2 Plugin                           [maven-plugin]
[INFO] Torque Generator Ant tasks                                         [jar]
[INFO] Torque Site                                                        [pom]
[INFO] 
[INFO] ----------------------< org.apache.torque:torque >----------------------
[INFO] Building Torque Maven Parent 5.1-SNAPSHOT                          [1/7]
[INFO] --------------------------------[ pom ]---------------------------------
[INFO] 
[INFO] --- maven-clean-plugin:3.1.0:clean (default-clean) @ torque ---
[INFO] 
[INFO] --- maven-enforcer-plugin:1.4.1:enforce (enforce-maven-version) @ torque ---
[INFO] 
[INFO] --- maven-remote-resources-plugin:1.7.0:process (process-resource-bundles) @ torque ---
[INFO] Preparing remote bundle org.apache:apache-jar-resource-bundle:1.4
[INFO] Copying 3 resources from 1 bundle.
[INFO] 
[INFO] --- maven-site-plugin:3.9.1:attach-descriptor (attach-descriptor) @ torque ---
[INFO] No site descriptor found: nothing to attach.
[INFO] 
[INFO] --- apache-rat-plugin:0.13:check (default) @ torque ---
[INFO] Enabled default license matchers.
[INFO] Will parse SCM ignores for exclusions...
[INFO] Finished adding exclusions from SCM ignore files.
[INFO] 68 implicit excludes (use -debug for more details).
[INFO] 14 explicit excludes (use -debug for more details).
[INFO] 152 resources included (use -debug for more details)
[INFO] Rat check: Summary over all files. Unapproved: 0, unknown: 0, generated: 0, approved: 147 licenses.
[WARNING] Attempt to (de-)serialize anonymous class hudson.plugins.analysis.core.HealthAwareReporter$2; see: https://jenkins.io/redirect/serialization-of-anonymous-classes/
[WARNING] Attempt to (de-)serialize anonymous class hudson.plugins.analysis.core.HealthAwareReporter$3; see: https://jenkins.io/redirect/serialization-of-anonymous-classes/
[CHECKSTYLE] No report found for mojo check
[PMD] No report found for mojo check
[INFO] 
[INFO] --- dependency-check-maven:5.3.2:check (default) @ torque ---
[INFO] Skipping dependency-check
[CHECKSTYLE] No report found for mojo check
[PMD] No report found for mojo check
[INFO] 
[INFO] --- maven-install-plugin:2.5.2:install (default-install) @ torque ---
[INFO] Installing <https://ci-builds.apache.org/job/DB/job/Torque/job/Torque5-trunk/org.apache.torque$torque/ws/pom.xml> to /home/jenkins/.m2/repository/org/apache/torque/torque/5.1-SNAPSHOT/torque-5.1-SNAPSHOT.pom
[INFO] 
[INFO] >>> cobertura-maven-plugin:2.7:cobertura (default-cli) > [cobertura]test @ torque >>>
[INFO] 
[INFO] --- maven-enforcer-plugin:1.4.1:enforce (enforce-maven-version) @ torque ---
[INFO] 
[INFO] --- maven-remote-resources-plugin:1.7.0:process (process-resource-bundles) @ torque ---
[INFO] Preparing remote bundle org.apache:apache-jar-resource-bundle:1.4
[INFO] Copying 3 resources from 1 bundle.
[INFO] 
[INFO] --- cobertura-maven-plugin:2.7:instrument (default-cli) @ torque ---
[INFO] Skipping cobertura mojo for project with packaging type 'pom'
[INFO] 
[INFO] <<< cobertura-maven-plugin:2.7:cobertura (default-cli) < [cobertura]test @ torque <<<
[INFO] 
[INFO] 
[INFO] --- cobertura-maven-plugin:2.7:cobertura (default-cli) @ torque ---
[INFO] 
[INFO] --- findbugs-maven-plugin:3.0.5:findbugs (default-cli) @ torque ---
[FINDBUGS] No report found for mojo findbugs
[INFO] 
[INFO] --- maven-checkstyle-plugin:2.15:checkstyle (default-cli) @ torque ---
[CHECKSTYLE] Parsing file <https://ci-builds.apache.org/job/DB/job/Torque/job/Torque5-trunk/org.apache.torque$torque/ws/target/checkstyle-result.xml>
[CHECKSTYLE] Successfully parsed file <https://ci-builds.apache.org/job/DB/job/Torque/job/Torque5-trunk/org.apache.torque$torque/ws/target/checkstyle-result.xml> of module Torque Maven Parent with 0 unique warnings and 0 duplicates.
[WARNING] Attempt to (de-)serialize anonymous class hudson.plugins.analysis.core.HealthAwareReporter$1; see: https://jenkins.io/redirect/serialization-of-anonymous-classes/
java.io.IOException: Failed to deserialize response to UserRequest:hudson.FilePath$Exists@39b885f7: java.lang.SecurityException: agent may not stat /home/jenkins/jenkins-home/jobs/DB/jobs/Torque/jobs/Torque5-trunk/modules/org.apache.torque$torque/builds/12/workspace-files
See https://jenkins.io/redirect/security-144 for more details
	at hudson.remoting.Channel.call(Channel.java:1009)
	at hudson.FilePath.act(FilePath.java:1157)
	at hudson.FilePath.act(FilePath.java:1146)
	at hudson.FilePath.exists(FilePath.java:1685)
	at hudson.plugins.analysis.util.Files.copyFilesWithAnnotationsToBuildFolder(Files.java:65)
	at hudson.plugins.analysis.core.HealthAwareReporter.copyFilesWithAnnotationsToBuildFolder(HealthAwareReporter.java:499)
	at hudson.plugins.analysis.core.HealthAwareReporter.postExecute(HealthAwareReporter.java:356)
	at hudson.maven.Maven3Builder$MavenExecutionListener.recordMojoEnded(Maven3Builder.java:617)
	at hudson.maven.Maven3Builder$MavenExecutionListener.mojoSucceeded(Maven3Builder.java:598)
	at hudson.maven.Maven3Builder$JenkinsEventSpy.onEvent(Maven3Builder.java:301)
	at org.apache.maven.eventspy.internal.EventSpyDispatcher.onEvent(EventSpyDispatcher.java:104)
	at org.apache.maven.eventspy.internal.EventSpyExecutionListener.mojoSucceeded(EventSpyExecutionListener.java:131)
	at org.apache.maven.lifecycle.internal.DefaultExecutionEventCatapult.fire(DefaultExecutionEventCatapult.java:87)
	at org.apache.maven.lifecycle.internal.DefaultExecutionEventCatapult.fire(DefaultExecutionEventCatapult.java:42)
	at org.apache.maven.lifecycle.internal.MojoExecutor.execute(MojoExecutor.java:218)
	at org.apache.maven.lifecycle.internal.MojoExecutor.execute(MojoExecutor.java:156)
	at org.apache.maven.lifecycle.internal.MojoExecutor.execute(MojoExecutor.java:148)
	at org.apache.maven.lifecycle.internal.LifecycleModuleBuilder.buildProject(LifecycleModuleBuilder.java:117)
	at org.apache.maven.lifecycle.internal.LifecycleModuleBuilder.buildProject(LifecycleModuleBuilder.java:81)
	at org.apache.maven.lifecycle.internal.builder.singlethreaded.SingleThreadedBuilder.build(SingleThreadedBuilder.java:56)
	at org.apache.maven.lifecycle.internal.LifecycleStarter.execute(LifecycleStarter.java:128)
	at org.apache.maven.DefaultMaven.doExecute(DefaultMaven.java:305)
	at org.apache.maven.DefaultMaven.doExecute(DefaultMaven.java:192)
	at org.apache.maven.DefaultMaven.execute(DefaultMaven.java:105)
	at org.jvnet.hudson.maven3.launcher.Maven35Launcher.main(Maven35Launcher.java:130)
	at sun.reflect.NativeMethodAccessorImpl.invoke0(Native Method)
	at sun.reflect.NativeMethodAccessorImpl.invoke(NativeMethodAccessorImpl.java:62)
	at sun.reflect.DelegatingMethodAccessorImpl.invoke(DelegatingMethodAccessorImpl.java:43)
	at java.lang.reflect.Method.invoke(Method.java:498)
	at org.codehaus.plexus.classworlds.launcher.Launcher.launchEnhanced(Launcher.java:282)
	at org.codehaus.plexus.classworlds.launcher.Launcher.launch(Launcher.java:225)
	at jenkins.maven3.agent.Maven35Main.launch(Maven35Main.java:178)
	at sun.reflect.NativeMethodAccessorImpl.invoke0(Native Method)
	at sun.reflect.NativeMethodAccessorImpl.invoke(NativeMethodAccessorImpl.java:62)
	at sun.reflect.DelegatingMethodAccessorImpl.invoke(DelegatingMethodAccessorImpl.java:43)
	at java.lang.reflect.Method.invoke(Method.java:498)
	at hudson.maven.Maven3Builder.call(Maven3Builder.java:139)
	at hudson.maven.Maven3Builder.call(Maven3Builder.java:70)
	at hudson.remoting.UserRequest.perform(UserRequest.java:211)
	at hudson.remoting.UserRequest.perform(UserRequest.java:54)
	at hudson.remoting.Request$2.run(Request.java:375)
	at hudson.remoting.InterceptingExecutorService$1.call(InterceptingExecutorService.java:73)
	at java.util.concurrent.FutureTask.run(FutureTask.java:266)
	at java.util.concurrent.ThreadPoolExecutor.runWorker(ThreadPoolExecutor.java:1149)
	at java.util.concurrent.ThreadPoolExecutor$Worker.run(ThreadPoolExecutor.java:624)
	at java.lang.Thread.run(Thread.java:748)
Caused by: java.lang.SecurityException: agent may not stat /home/jenkins/jenkins-home/jobs/DB/jobs/Torque/jobs/Torque5-trunk/modules/org.apache.torque$torque/builds/12/workspace-files
See https://jenkins.io/redirect/security-144 for more details
	at jenkins.SoloFilePathFilter.noFalse(SoloFilePathFilter.java:33)
	at jenkins.SoloFilePathFilter.stat(SoloFilePathFilter.java:73)
	at hudson.FilePath.stating(FilePath.java:3477)
	at hudson.FilePath.access$2400(FilePath.java:213)
	at hudson.FilePath$Exists.invoke(FilePath.java:1691)
	at hudson.FilePath$Exists.invoke(FilePath.java:1687)
	at hudson.FilePath$FileCallableWrapper.call(FilePath.java:3313)
	at hudson.remoting.UserRequest.perform(UserRequest.java:211)
	at hudson.remoting.UserRequest.perform(UserRequest.java:54)
	at hudson.remoting.Request$2.run(Request.java:375)
	at hudson.remoting.InterceptingExecutorService$1.call(InterceptingExecutorService.java:73)
	at org.jenkinsci.remoting.CallableDecorator.call(CallableDecorator.java:18)
	at hudson.remoting.CallableDecoratorList$1.call(CallableDecoratorList.java:22)
	at jenkins.util.ContextResettingExecutorService$2.call(ContextResettingExecutorService.java:46)
	at jenkins.security.ImpersonatingExecutorService$2.call(ImpersonatingExecutorService.java:71)
	... 4 more
	Suppressed: hudson.remoting.Channel$CallSiteStackTrace: Remote call to channel
		at hudson.remoting.Channel.attachCallSiteStackTrace(Channel.java:1800)
		at hudson.remoting.UserRequest$ExceptionResponse.retrieve(UserRequest.java:357)
		at hudson.remoting.Channel.call(Channel.java:1001)
		at hudson.FilePath.act(FilePath.java:1157)
		at hudson.FilePath.act(FilePath.java:1146)
		at hudson.FilePath.exists(FilePath.java:1685)
		at hudson.plugins.analysis.util.Files.copyFilesWithAnnotationsToBuildFolder(Files.java:65)
		at hudson.plugins.analysis.core.HealthAwareReporter.copyFilesWithAnnotationsToBuildFolder(HealthAwareReporter.java:499)
		at hudson.plugins.analysis.core.HealthAwareReporter.postExecute(HealthAwareReporter.java:356)
		at hudson.maven.Maven3Builder$MavenExecutionListener.recordMojoEnded(Maven3Builder.java:617)
		at hudson.maven.Maven3Builder$MavenExecutionListener.mojoSucceeded(Maven3Builder.java:598)
		at hudson.maven.Maven3Builder$JenkinsEventSpy.onEvent(Maven3Builder.java:301)
		at org.apache.maven.eventspy.internal.EventSpyDispatcher.onEvent(EventSpyDispatcher.java:104)
		at org.apache.maven.eventspy.internal.EventSpyExecutionListener.mojoSucceeded(EventSpyExecutionListener.java:131)
		at org.apache.maven.lifecycle.internal.DefaultExecutionEventCatapult.fire(DefaultExecutionEventCatapult.java:87)
		at org.apache.maven.lifecycle.internal.DefaultExecutionEventCatapult.fire(DefaultExecutionEventCatapult.java:42)
		at org.apache.maven.lifecycle.internal.MojoExecutor.execute(MojoExecutor.java:218)
		at org.apache.maven.lifecycle.internal.MojoExecutor.execute(MojoExecutor.java:156)
		at org.apache.maven.lifecycle.internal.MojoExecutor.execute(MojoExecutor.java:148)
		at org.apache.maven.lifecycle.internal.LifecycleModuleBuilder.buildProject(LifecycleModuleBuilder.java:117)
		at org.apache.maven.lifecycle.internal.LifecycleModuleBuilder.buildProject(LifecycleModuleBuilder.java:81)
		at org.apache.maven.lifecycle.internal.builder.singlethreaded.SingleThreadedBuilder.build(SingleThreadedBuilder.java:56)
		at org.apache.maven.lifecycle.internal.LifecycleStarter.execute(LifecycleStarter.java:128)
		at org.apache.maven.DefaultMaven.doExecute(DefaultMaven.java:305)
		at org.apache.maven.DefaultMaven.doExecute(DefaultMaven.java:192)
		at org.apache.maven.DefaultMaven.execute(DefaultMaven.java:105)
		at org.jvnet.hudson.maven3.launcher.Maven35Launcher.main(Maven35Launcher.java:130)
		at sun.reflect.NativeMethodAccessorImpl.invoke0(Native Method)
		at sun.reflect.NativeMethodAccessorImpl.invoke(NativeMethodAccessorImpl.java:62)
		at sun.reflect.DelegatingMethodAccessorImpl.invoke(DelegatingMethodAccessorImpl.java:43)
		at java.lang.reflect.Method.invoke(Method.java:498)
		at org.codehaus.plexus.classworlds.launcher.Launcher.launchEnhanced(Launcher.java:282)
		at org.codehaus.plexus.classworlds.launcher.Launcher.launch(Launcher.java:225)
		at jenkins.maven3.agent.Maven35Main.launch(Maven35Main.java:178)
		at sun.reflect.NativeMethodAccessorImpl.invoke0(Native Method)
		at sun.reflect.NativeMethodAccessorImpl.invoke(NativeMethodAccessorImpl.java:62)
		at sun.reflect.DelegatingMethodAccessorImpl.invoke(DelegatingMethodAccessorImpl.java:43)
		at java.lang.reflect.Method.invoke(Method.java:498)
		at hudson.maven.Maven3Builder.call(Maven3Builder.java:139)
		at hudson.maven.Maven3Builder.call(Maven3Builder.java:70)
		at hudson.remoting.UserRequest.perform(UserRequest.java:211)
		at hudson.remoting.UserRequest.perform(UserRequest.java:54)
		at hudson.remoting.Request$2.run(Request.java:375)
		at hudson.remoting.InterceptingExecutorService$1.call(InterceptingExecutorService.java:73)
		... 4 more
[INFO] 
[INFO] --- maven-pmd-plugin:3.13.0:pmd (default-cli) @ torque ---
[PMD] Skipping reporter since build result is FAILURE
[INFO] 
[INFO] --- maven-pmd-plugin:3.13.0:cpd (default-cli) @ torque ---
[DRY] Skipping reporter since build result is FAILURE
[WARNING] Attempt to (de-)serialize anonymous class org.jfrog.hudson.maven2.MavenDependenciesRecorder$1; see: https://jenkins.io/redirect/serialization-of-anonymous-classes/

---------------------------------------------------------------------
To unsubscribe, e-mail: torque-dev-unsubscribe@db.apache.org
For additional commands, e-mail: torque-dev-help@db.apache.org