You are viewing a plain text version of this content. The canonical link for it is here.
Posted to builds@lucene.apache.org by Policeman Jenkins Server via builds <bu...@lucene.apache.org> on 2026/08/02 22:27:09 UTC
[JENKINS-EA] Lucene-main-Linux (64bit/hotspot/jdk-27-ea+32) - Build # 65794 - Unstable!
Build: https://jenkins.thetaphi.de/job/Lucene-main-Linux/65794/
Java: 64bit/hotspot/jdk-27-ea+32 -XX:+UseCompressedOops -XX:+UseSerialGC
1 tests failed.
FAILED: org.apache.lucene.index.TestMixedDocValuesUpdates.testStressMultiThreading
Error Message:
org.opentest4j.MultipleFailuresError: Multiple Failures (4 failures)
java.nio.file.NoSuchFileException: /home/jenkins/workspace/Lucene-main-Linux/lucene/core/build/tests-tmp/lucene.index.TestMixedDocValuesUpdates_001/index-NIOFSDirectory-001/_1e_1o_Lucene90_0.dvd
com.carrotsearch.randomizedtesting.UncaughtExceptionError: Captured an uncaught exception in thread: Thread[id=1792, name=UpdateThread-1, state=RUNNABLE, group=TGRP-TestMixedDocValuesUpdates]
com.carrotsearch.randomizedtesting.UncaughtExceptionError: Captured an uncaught exception in thread: Thread[id=1793, name=UpdateThread-2, state=RUNNABLE, group=TGRP-TestMixedDocValuesUpdates]
com.carrotsearch.randomizedtesting.UncaughtExceptionError: Captured an uncaught exception in thread: Thread[id=1791, name=UpdateThread-0, state=RUNNABLE, group=TGRP-TestMixedDocValuesUpdates]
Stack Trace:
org.opentest4j.MultipleFailuresError: Multiple Failures (4 failures)
java.nio.file.NoSuchFileException: /home/jenkins/workspace/Lucene-main-Linux/lucene/core/build/tests-tmp/lucene.index.TestMixedDocValuesUpdates_001/index-NIOFSDirectory-001/_1e_1o_Lucene90_0.dvd
com.carrotsearch.randomizedtesting.UncaughtExceptionError: Captured an uncaught exception in thread: Thread[id=1792, name=UpdateThread-1, state=RUNNABLE, group=TGRP-TestMixedDocValuesUpdates]
com.carrotsearch.randomizedtesting.UncaughtExceptionError: Captured an uncaught exception in thread: Thread[id=1793, name=UpdateThread-2, state=RUNNABLE, group=TGRP-TestMixedDocValuesUpdates]
com.carrotsearch.randomizedtesting.UncaughtExceptionError: Captured an uncaught exception in thread: Thread[id=1791, name=UpdateThread-0, state=RUNNABLE, group=TGRP-TestMixedDocValuesUpdates]
at com.carrotsearch.randomizedtesting.ThreadLeakControl$SubNotifier.fireTestFinished(ThreadLeakControl.java:213)
at com.carrotsearch.randomizedtesting.RandomizedRunner.runSingleTest(RandomizedRunner.java:977)
at com.carrotsearch.randomizedtesting.RandomizedRunner$5.evaluate(RandomizedRunner.java:853)
at com.carrotsearch.randomizedtesting.RandomizedRunner$6.evaluate(RandomizedRunner.java:904)
at com.carrotsearch.randomizedtesting.RandomizedRunner$7.evaluate(RandomizedRunner.java:915)
at org.apache.lucene.tests.util.CallbacksToRuleAdapter$1.evaluate(CallbacksToRuleAdapter.java:35)
at org.apache.lucene.tests.util.CallbacksToRuleAdapter$1.evaluate(CallbacksToRuleAdapter.java:35)
at org.apache.lucene.tests.util.CallbacksToRuleAdapter$1.evaluate(CallbacksToRuleAdapter.java:35)
at com.carrotsearch.randomizedtesting.rules.StatementAdapter.evaluate(StatementAdapter.java:36)
at org.apache.lucene.tests.util.TestRuleStoreClassName$1.evaluate(TestRuleStoreClassName.java:38)
at com.carrotsearch.randomizedtesting.rules.NoShadowingOrOverridesOnMethodsRule$1.evaluate(NoShadowingOrOverridesOnMethodsRule.java:40)
at com.carrotsearch.randomizedtesting.rules.NoShadowingOrOverridesOnMethodsRule$1.evaluate(NoShadowingOrOverridesOnMethodsRule.java:40)
at org.apache.lucene.tests.util.CallbacksToRuleAdapter$1.evaluate(CallbacksToRuleAdapter.java:35)
at com.carrotsearch.randomizedtesting.rules.StatementAdapter.evaluate(StatementAdapter.java:36)
at org.apache.lucene.tests.util.TestRuleAssertionsRequired$1.evaluate(TestRuleAssertionsRequired.java:31)
at org.apache.lucene.tests.util.AbstractBeforeAfterRule$1.evaluate(AbstractBeforeAfterRule.java:43)
at org.apache.lucene.tests.util.TestRuleMarkFailure$1.evaluate(TestRuleMarkFailure.java:47)
at org.apache.lucene.tests.util.TestRuleIgnoreAfterMaxFailures$1.evaluate(TestRuleIgnoreAfterMaxFailures.java:60)
at com.carrotsearch.randomizedtesting.rules.StatementAdapter.evaluate(StatementAdapter.java:36)
at org.apache.lucene.tests.util.TestRuleIgnoreTestSuites$1.evaluate(TestRuleIgnoreTestSuites.java:47)
at com.carrotsearch.randomizedtesting.rules.StatementAdapter.evaluate(StatementAdapter.java:36)
at com.carrotsearch.randomizedtesting.ThreadLeakControl$StatementRunner.run(ThreadLeakControl.java:390)
at com.carrotsearch.randomizedtesting.ThreadLeakControl.lambda$forkTimeoutingTask$0(ThreadLeakControl.java:850)
at java.base/java.lang.Thread.run(Thread.java:1527)
Suppressed: java.nio.file.NoSuchFileException: /home/jenkins/workspace/Lucene-main-Linux/lucene/core/build/tests-tmp/lucene.index.TestMixedDocValuesUpdates_001/index-NIOFSDirectory-001/_1e_1o_Lucene90_0.dvd
at java.base/sun.nio.fs.UnixException.translateToIOException(UnixException.java:92)
at java.base/sun.nio.fs.UnixException.rethrowAsIOException(UnixException.java:108)
at java.base/sun.nio.fs.UnixException.rethrowAsIOException(UnixException.java:113)
at java.base/sun.nio.fs.UnixFileAttributeViews$Basic.readAttributes(UnixFileAttributeViews.java:57)
at java.base/sun.nio.fs.UnixFileSystemProvider.readAttributes(UnixFileSystemProvider.java:162)
at java.base/sun.nio.fs.LinuxFileSystemProvider.readAttributes(LinuxFileSystemProvider.java:99)
at org.apache.lucene.tests.mockfile.FilterFileSystemProvider.readAttributes(FilterFileSystemProvider.java:178)
at org.apache.lucene.tests.mockfile.FilterFileSystemProvider.readAttributes(FilterFileSystemProvider.java:178)
at org.apache.lucene.tests.mockfile.FilterFileSystemProvider.readAttributes(FilterFileSystemProvider.java:178)
at org.apache.lucene.tests.mockfile.FilterFileSystemProvider.readAttributes(FilterFileSystemProvider.java:178)
at org.apache.lucene.tests.mockfile.FilterFileSystemProvider.readAttributes(FilterFileSystemProvider.java:178)
at java.base/java.nio.file.Files.readAttributes(Files.java:1706)
at java.base/java.nio.file.Files.size(Files.java:2246)
at org.apache.lucene.store.FSDirectory.fileLength(FSDirectory.java:203)
at org.apache.lucene.tests.store.MockDirectoryWrapper.fileLength(MockDirectoryWrapper.java:1098)
at org.apache.lucene.index.SegmentCommitInfo.sizeInBytes(SegmentCommitInfo.java:230)
at org.apache.lucene.index.MergePolicy.size(MergePolicy.java:721)
at org.apache.lucene.index.LogMergePolicy.sizeBytes(LogMergePolicy.java:172)
at org.apache.lucene.index.LogByteSizeMergePolicy.size(LogByteSizeMergePolicy.java:53)
at org.apache.lucene.index.LogMergePolicy.findMerges(LogMergePolicy.java:503)
at org.apache.lucene.index.MergePolicy.findFullFlushMerges(MergePolicy.java:693)
at org.apache.lucene.index.OneMergeWrappingMergePolicy.findFullFlushMerges(OneMergeWrappingMergePolicy.java:72)
at org.apache.lucene.index.IndexWriter.updatePendingMerges(IndexWriter.java:2444)
at org.apache.lucene.index.IndexWriter.preparePointInTimeMerge(IndexWriter.java:3901)
at org.apache.lucene.index.IndexWriter.prepareCommitInternal(IndexWriter.java:3804)
at org.apache.lucene.index.IndexWriter.commitInternal(IndexWriter.java:4198)
at org.apache.lucene.index.IndexWriter.shutdown(IndexWriter.java:1326)
at org.apache.lucene.index.IndexWriter.close(IndexWriter.java:1364)
at org.apache.lucene.index.TestMixedDocValuesUpdates.testStressMultiThreading(TestMixedDocValuesUpdates.java:293)
Suppressed: com.carrotsearch.randomizedtesting.UncaughtExceptionError: Captured an uncaught exception in thread: Thread[id=1792, name=UpdateThread-1, state=RUNNABLE, group=TGRP-TestMixedDocValuesUpdates]
Caused by: java.lang.RuntimeException: java.nio.file.FileSystemException: /home/jenkins/workspace/Lucene-main-Linux/lucene/core/build/tests-tmp/lucene.index.TestMixedDocValuesUpdates_001/index-NIOFSDirectory-001/_1g_1r_Lucene90_0.dvs: Too many open files
at __randomizedtesting.SeedInfo.seed([D547DA1BE63CF16B]:0)
at org.apache.lucene.index.TestMixedDocValuesUpdates$1.run(TestMixedDocValuesUpdates.java:274)
Caused by: java.nio.file.FileSystemException: /home/jenkins/workspace/Lucene-main-Linux/lucene/core/build/tests-tmp/lucene.index.TestMixedDocValuesUpdates_001/index-NIOFSDirectory-001/_1g_1r_Lucene90_0.dvs: Too many open files
at org.apache.lucene.tests.mockfile.HandleLimitFS.onOpen(HandleLimitFS.java:67)
at org.apache.lucene.tests.mockfile.HandleTrackingFS.callOpenHook(HandleTrackingFS.java:82)
at org.apache.lucene.tests.mockfile.HandleTrackingFS.newFileChannel(HandleTrackingFS.java:202)
at org.apache.lucene.tests.mockfile.FilterFileSystemProvider.newFileChannel(FilterFileSystemProvider.java:206)
at java.base/java.nio.channels.FileChannel.open(FileChannel.java:301)
at java.base/java.nio.channels.FileChannel.open(FileChannel.java:353)
at org.apache.lucene.store.NIOFSDirectory.openInput(NIOFSDirectory.java:78)
at org.apache.lucene.tests.util.LuceneTestCaseParent.slowFileExists(LuceneTestCaseParent.java:1405)
at org.apache.lucene.tests.store.MockDirectoryWrapper.openInput(MockDirectoryWrapper.java:799)
at org.apache.lucene.codecs.lucene90.Lucene90DocValuesProducer.<init>(Lucene90DocValuesProducer.java:159)
at org.apache.lucene.codecs.lucene90.Lucene90DocValuesFormat.fieldsProducer(Lucene90DocValuesFormat.java:174)
at org.apache.lucene.codecs.perfield.PerFieldDocValuesFormat$FieldsReader.<init>(PerFieldDocValuesFormat.java:303)
at org.apache.lucene.codecs.perfield.PerFieldDocValuesFormat.fieldsProducer(PerFieldDocValuesFormat.java:376)
at org.apache.lucene.index.SegmentDocValues.newDocValuesProducer(SegmentDocValues.java:51)
at org.apache.lucene.index.SegmentDocValues.getDocValuesProducer(SegmentDocValues.java:68)
at org.apache.lucene.index.SegmentDocValuesProducer.<init>(SegmentDocValuesProducer.java:74)
at org.apache.lucene.index.SegmentReader.initDocValuesProducer(SegmentReader.java:187)
at org.apache.lucene.index.SegmentReader.<init>(SegmentReader.java:157)
at org.apache.lucene.index.ReadersAndUpdates.createNewReaderWithLatestLiveDocs(ReadersAndUpdates.java:801)
at org.apache.lucene.index.ReadersAndUpdates.swapNewReaderWithLatestLiveDocs(ReadersAndUpdates.java:814)
at org.apache.lucene.index.ReadersAndUpdates.writeFieldUpdates(ReadersAndUpdates.java:754)
at org.apache.lucene.index.ReaderPool.commit(ReaderPool.java:353)
at org.apache.lucene.index.IndexWriter.writeReaderPool(IndexWriter.java:4065)
at org.apache.lucene.index.IndexWriter.prepareCommitInternal(IndexWriter.java:3768)
at org.apache.lucene.index.IndexWriter.commitInternal(IndexWriter.java:4198)
at org.apache.lucene.index.IndexWriter.commit(IndexWriter.java:4160)
at org.apache.lucene.index.TestMixedDocValuesUpdates$1.run(TestMixedDocValuesUpdates.java:250)
Suppressed: com.carrotsearch.randomizedtesting.UncaughtExceptionError: Captured an uncaught exception in thread: Thread[id=1793, name=UpdateThread-2, state=RUNNABLE, group=TGRP-TestMixedDocValuesUpdates]
Caused by: java.lang.RuntimeException: java.nio.file.NoSuchFileException: /home/jenkins/workspace/Lucene-main-Linux/lucene/core/build/tests-tmp/lucene.index.TestMixedDocValuesUpdates_001/index-NIOFSDirectory-001/_1e_1o_Lucene90_0.dvd
at __randomizedtesting.SeedInfo.seed([D547DA1BE63CF16B]:0)
at org.apache.lucene.index.TestMixedDocValuesUpdates$1.run(TestMixedDocValuesUpdates.java:274)
Caused by: java.nio.file.NoSuchFileException: /home/jenkins/workspace/Lucene-main-Linux/lucene/core/build/tests-tmp/lucene.index.TestMixedDocValuesUpdates_001/index-NIOFSDirectory-001/_1e_1o_Lucene90_0.dvd
at java.base/sun.nio.fs.UnixException.translateToIOException(UnixException.java:92)
at java.base/sun.nio.fs.UnixException.rethrowAsIOException(UnixException.java:108)
at java.base/sun.nio.fs.UnixException.rethrowAsIOException(UnixException.java:113)
at java.base/sun.nio.fs.UnixFileAttributeViews$Basic.readAttributes(UnixFileAttributeViews.java:57)
at java.base/sun.nio.fs.UnixFileSystemProvider.readAttributes(UnixFileSystemProvider.java:162)
at java.base/sun.nio.fs.LinuxFileSystemProvider.readAttributes(LinuxFileSystemProvider.java:99)
at org.apache.lucene.tests.mockfile.FilterFileSystemProvider.readAttributes(FilterFileSystemProvider.java:178)
at org.apache.lucene.tests.mockfile.FilterFileSystemProvider.readAttributes(FilterFileSystemProvider.java:178)
at org.apache.lucene.tests.mockfile.FilterFileSystemProvider.readAttributes(FilterFileSystemProvider.java:178)
at org.apache.lucene.tests.mockfile.FilterFileSystemProvider.readAttributes(FilterFileSystemProvider.java:178)
at org.apache.lucene.tests.mockfile.FilterFileSystemProvider.readAttributes(FilterFileSystemProvider.java:178)
at java.base/java.nio.file.Files.readAttributes(Files.java:1706)
at java.base/java.nio.file.Files.size(Files.java:2246)
at org.apache.lucene.store.FSDirectory.fileLength(FSDirectory.java:203)
at org.apache.lucene.tests.store.MockDirectoryWrapper.fileLength(MockDirectoryWrapper.java:1098)
at org.apache.lucene.index.SegmentCommitInfo.sizeInBytes(SegmentCommitInfo.java:230)
at org.apache.lucene.index.MergePolicy.size(MergePolicy.java:721)
at org.apache.lucene.index.LogMergePolicy.sizeBytes(LogMergePolicy.java:172)
at org.apache.lucene.index.LogByteSizeMergePolicy.size(LogByteSizeMergePolicy.java:53)
at org.apache.lucene.index.LogMergePolicy.findMerges(LogMergePolicy.java:503)
at org.apache.lucene.index.MergePolicy.findFullFlushMerges(MergePolicy.java:693)
at org.apache.lucene.index.OneMergeWrappingMergePolicy.findFullFlushMerges(OneMergeWrappingMergePolicy.java:72)
at org.apache.lucene.index.IndexWriter.updatePendingMerges(IndexWriter.java:2444)
at org.apache.lucene.index.IndexWriter.preparePointInTimeMerge(IndexWriter.java:3901)
at org.apache.lucene.index.IndexWriter.prepareCommitInternal(IndexWriter.java:3804)
at org.apache.lucene.index.IndexWriter.commitInternal(IndexWriter.java:4198)
at org.apache.lucene.index.IndexWriter.commit(IndexWriter.java:4160)
at org.apache.lucene.index.TestMixedDocValuesUpdates$1.run(TestMixedDocValuesUpdates.java:250)
Suppressed: com.carrotsearch.randomizedtesting.UncaughtExceptionError: Captured an uncaught exception in thread: Thread[id=1791, name=UpdateThread-0, state=RUNNABLE, group=TGRP-TestMixedDocValuesUpdates]
Caused by: java.lang.RuntimeException: java.nio.file.NoSuchFileException: /home/jenkins/workspace/Lucene-main-Linux/lucene/core/build/tests-tmp/lucene.index.TestMixedDocValuesUpdates_001/index-NIOFSDirectory-001/_1e_1o_Lucene90_0.dvd
at __randomizedtesting.SeedInfo.seed([D547DA1BE63CF16B]:0)
at org.apache.lucene.index.TestMixedDocValuesUpdates$1.run(TestMixedDocValuesUpdates.java:274)
Caused by: java.nio.file.NoSuchFileException: /home/jenkins/workspace/Lucene-main-Linux/lucene/core/build/tests-tmp/lucene.index.TestMixedDocValuesUpdates_001/index-NIOFSDirectory-001/_1e_1o_Lucene90_0.dvd
at java.base/sun.nio.fs.UnixException.translateToIOException(UnixException.java:92)
at java.base/sun.nio.fs.UnixException.rethrowAsIOException(UnixException.java:108)
at java.base/sun.nio.fs.UnixException.rethrowAsIOException(UnixException.java:113)
at java.base/sun.nio.fs.UnixFileAttributeViews$Basic.readAttributes(UnixFileAttributeViews.java:57)
at java.base/sun.nio.fs.UnixFileSystemProvider.readAttributes(UnixFileSystemProvider.java:162)
at java.base/sun.nio.fs.LinuxFileSystemProvider.readAttributes(LinuxFileSystemProvider.java:99)
at org.apache.lucene.tests.mockfile.FilterFileSystemProvider.readAttributes(FilterFileSystemProvider.java:178)
at org.apache.lucene.tests.mockfile.FilterFileSystemProvider.readAttributes(FilterFileSystemProvider.java:178)
at org.apache.lucene.tests.mockfile.FilterFileSystemProvider.readAttributes(FilterFileSystemProvider.java:178)
at org.apache.lucene.tests.mockfile.FilterFileSystemProvider.readAttributes(FilterFileSystemProvider.java:178)
at org.apache.lucene.tests.mockfile.FilterFileSystemProvider.readAttributes(FilterFileSystemProvider.java:178)
at java.base/java.nio.file.Files.readAttributes(Files.java:1706)
at java.base/java.nio.file.Files.size(Files.java:2246)
at org.apache.lucene.store.FSDirectory.fileLength(FSDirectory.java:203)
at org.apache.lucene.tests.store.MockDirectoryWrapper.fileLength(MockDirectoryWrapper.java:1098)
at org.apache.lucene.index.SegmentCommitInfo.sizeInBytes(SegmentCommitInfo.java:230)
at org.apache.lucene.index.MergePolicy.size(MergePolicy.java:721)
at org.apache.lucene.index.LogMergePolicy.sizeBytes(LogMergePolicy.java:172)
at org.apache.lucene.index.LogByteSizeMergePolicy.size(LogByteSizeMergePolicy.java:53)
at org.apache.lucene.index.LogMergePolicy.findMerges(LogMergePolicy.java:503)
at org.apache.lucene.index.MergePolicy.findFullFlushMerges(MergePolicy.java:693)
at org.apache.lucene.index.OneMergeWrappingMergePolicy.findFullFlushMerges(OneMergeWrappingMergePolicy.java:72)
at org.apache.lucene.index.IndexWriter.updatePendingMerges(IndexWriter.java:2444)
at org.apache.lucene.index.IndexWriter.preparePointInTimeMerge(IndexWriter.java:3901)
at org.apache.lucene.index.IndexWriter.getReader(IndexWriter.java:635)
at org.apache.lucene.index.StandardDirectoryReader.doOpenFromWriter(StandardDirectoryReader.java:466)
at org.apache.lucene.index.StandardDirectoryReader.doOpenIfChanged(StandardDirectoryReader.java:438)
at org.apache.lucene.index.DirectoryReader.openIfChanged(DirectoryReader.java:401)
at org.apache.lucene.index.DirectoryReader.openIfChanged(DirectoryReader.java:338)
at org.apache.lucene.index.TestMixedDocValuesUpdates$1.run(TestMixedDocValuesUpdates.java:263)