You are viewing a plain text version of this content. The canonical link for it is here.
Posted to dev@myfaces.apache.org by "Werner Punz (Jira)" <de...@myfaces.apache.org> on 2023/02/16 07:24:00 UTC
[jira] [Created] (MYFACES-4564) Test failure in the table test on RC5 build
Werner Punz created MYFACES-4564:
------------------------------------
Summary: Test failure in the table test on RC5 build
Key: MYFACES-4564
URL: https://issues.apache.org/jira/browse/MYFACES-4564
Project: MyFaces Core
Issue Type: Task
Affects Versions: 4.0.0-RC5
Reporter: Werner Punz
Assignee: Werner Punz
Report by [~volosied]
[INFO] [ERROR] Tests run: 6, Failures: 0, Errors: 1, Skipped: 0, Time elapsed: 21.554 s <<< FAILURE! - in org.apache.myfaces.core.integrationtests.ajax.IntegrationTest
[INFO] [ERROR] org.apache.myfaces.core.integrationtests.ajax.IntegrationTest.testBasicTable Time elapsed: 6.733 s <<< ERROR!
[INFO] org.openqa.selenium.TimeoutException: Expected condition failed: waiting for org.apache.myfaces.core.integrationtests.ajax.IntegrationTest$$Lambda$675/0x000000080085b040@2f54f746 (tried for 0 second(s) with 500 milliseconds interval)
[INFO] at org.openqa.selenium.support.ui.WebDriverWait.timeoutException(WebDriverWait.java:87)
...
This is very likey a timeout issue, given the new ajax code is somewhat slower than the older one. The test needs to be fixed to wait for a dom condition with a higher timeout window. I will take over this!
--
This message was sent by Atlassian Jira
(v8.20.10#820010)