You are viewing a plain text version of this content. The canonical link for it is here.
Posted to dev@brooklyn.apache.org by Apache Jenkins Server <je...@builds.apache.org> on 2016/12/04 16:50:24 UTC
Build failed in Jenkins: brooklyn-dist-master #49
See <https://builds.apache.org/job/brooklyn-dist-master/49/changes>
Changes:
[svetoslav.neykov] Change version to 0.11.0-SNAPSHOT
------------------------------------------
Started by an SCM change
[EnvInject] - Loading node environment variables.
Building remotely on ubuntu-4 (ubuntu) in workspace <https://builds.apache.org/job/brooklyn-dist-master/ws/>
Cloning the remote Git repository
Cloning repository https://git-wip-us.apache.org/repos/asf/brooklyn-dist.git
> git init <https://builds.apache.org/job/brooklyn-dist-master/ws/> # timeout=10
Fetching upstream changes from https://git-wip-us.apache.org/repos/asf/brooklyn-dist.git
> git --version # timeout=10
> git -c core.askpass=true fetch --tags --progress https://git-wip-us.apache.org/repos/asf/brooklyn-dist.git +refs/heads/*:refs/remotes/origin/*
> git config remote.origin.url https://git-wip-us.apache.org/repos/asf/brooklyn-dist.git # timeout=10
> git config --add remote.origin.fetch +refs/heads/*:refs/remotes/origin/* # timeout=10
> git config remote.origin.url https://git-wip-us.apache.org/repos/asf/brooklyn-dist.git # timeout=10
Fetching upstream changes from https://git-wip-us.apache.org/repos/asf/brooklyn-dist.git
> git -c core.askpass=true fetch --tags --progress https://git-wip-us.apache.org/repos/asf/brooklyn-dist.git +refs/heads/*:refs/remotes/origin/*
> git rev-parse origin/master^{commit} # timeout=10
Checking out Revision 8aea0d9c13909f4a7e68f2899c784251b950b27f (origin/master)
> git config core.sparsecheckout # timeout=10
> git checkout -f 8aea0d9c13909f4a7e68f2899c784251b950b27f
> git rev-list 46a43ac757eb2c3b28474035905776a5b8720fd2 # timeout=10
Parsing POMs
ERROR: Failed to parse POMs
java.io.IOException: remote file operation failed: <https://builds.apache.org/job/brooklyn-dist-master/ws/> at hudson.remoting.Channel@57ba4ba0:ubuntu-4: hudson.remoting.ProxyException: hudson.maven.MavenModuleSetBuild$MavenExecutionException: org.apache.maven.project.ProjectBuildingException: Some problems were encountered while processing the POMs:
[FATAL] Non-resolvable parent POM: Failure to find org.apache.brooklyn:brooklyn-parent:pom:0.11.0-SNAPSHOT in http://repository.apache.org/snapshots was cached in the local repository, resolution will not be reattempted until the update interval of Nexus has elapsed or updates are forced and 'parent.relativePath' points at wrong local POM @ line 24, column 13
at hudson.FilePath.act(FilePath.java:1014)
at hudson.FilePath.act(FilePath.java:996)
at hudson.maven.MavenModuleSetBuild$MavenModuleSetBuildExecution.parsePoms(MavenModuleSetBuild.java:960)
at hudson.maven.MavenModuleSetBuild$MavenModuleSetBuildExecution.doRun(MavenModuleSetBuild.java:679)
at hudson.model.AbstractBuild$AbstractBuildExecution.run(AbstractBuild.java:534)
at hudson.model.Run.execute(Run.java:1741)
at hudson.maven.MavenModuleSetBuild.run(MavenModuleSetBuild.java:531)
at hudson.model.ResourceController.execute(ResourceController.java:98)
at hudson.model.Executor.run(Executor.java:410)
Caused by: hudson.remoting.ProxyException: hudson.maven.MavenModuleSetBuild$MavenExecutionException: org.apache.maven.project.ProjectBuildingException: Some problems were encountered while processing the POMs:
[FATAL] Non-resolvable parent POM: Failure to find org.apache.brooklyn:brooklyn-parent:pom:0.11.0-SNAPSHOT in http://repository.apache.org/snapshots was cached in the local repository, resolution will not be reattempted until the update interval of Nexus has elapsed or updates are forced and 'parent.relativePath' points at wrong local POM @ line 24, column 13
at hudson.maven.MavenModuleSetBuild$PomParser.invoke(MavenModuleSetBuild.java:1364)
at hudson.maven.MavenModuleSetBuild$PomParser.invoke(MavenModuleSetBuild.java:1098)
at hudson.FilePath$FileCallableWrapper.call(FilePath.java:2772)
at hudson.remoting.UserRequest.perform(UserRequest.java:153)
at hudson.remoting.UserRequest.perform(UserRequest.java:50)
at hudson.remoting.Request$2.run(Request.java:332)
at hudson.remoting.InterceptingExecutorService$1.call(InterceptingExecutorService.java:68)
at java.util.concurrent.FutureTask.run(FutureTask.java:262)
at java.util.concurrent.ThreadPoolExecutor.runWorker(ThreadPoolExecutor.java:1145)
at java.util.concurrent.ThreadPoolExecutor$Worker.run(ThreadPoolExecutor.java:615)
at java.lang.Thread.run(Thread.java:745)
at ......remote call to ubuntu-4(Native Method)
at hudson.remoting.Channel.attachCallSiteStackTrace(Channel.java:1416)
at hudson.remoting.UserResponse.retrieve(UserRequest.java:253)
at hudson.remoting.Channel.call(Channel.java:781)
at hudson.FilePath.act(FilePath.java:1007)
... 8 more
Caused by: hudson.remoting.ProxyException: org.apache.maven.project.ProjectBuildingException: Some problems were encountered while processing the POMs:
[FATAL] Non-resolvable parent POM: Failure to find org.apache.brooklyn:brooklyn-parent:pom:0.11.0-SNAPSHOT in http://repository.apache.org/snapshots was cached in the local repository, resolution will not be reattempted until the update interval of Nexus has elapsed or updates are forced and 'parent.relativePath' points at wrong local POM @ line 24, column 13
at org.apache.maven.project.DefaultProjectBuilder.build(DefaultProjectBuilder.java:364)
at hudson.maven.MavenEmbedder.buildProjects(MavenEmbedder.java:361)
at hudson.maven.MavenEmbedder.readProjects(MavenEmbedder.java:331)
at hudson.maven.MavenModuleSetBuild$PomParser.invoke(MavenModuleSetBuild.java:1301)
at hudson.maven.MavenModuleSetBuild$PomParser.invoke(MavenModuleSetBuild.java:1098)
at hudson.FilePath$FileCallableWrapper.call(FilePath.java:2772)
at hudson.remoting.UserRequest.perform(UserRequest.java:153)
at hudson.remoting.UserRequest.perform(UserRequest.java:50)
at hudson.remoting.Request$2.run(Request.java:332)
at hudson.remoting.InterceptingExecutorService$1.call(InterceptingExecutorService.java:68)
at java.util.concurrent.FutureTask.run(FutureTask.java:262)
at java.util.concurrent.ThreadPoolExecutor.runWorker(ThreadPoolExecutor.java:1145)
at java.util.concurrent.ThreadPoolExecutor$Worker.run(ThreadPoolExecutor.java:615)
at java.lang.Thread.run(Thread.java:745)