You are viewing a plain text version of this content. The canonical link for it is here.
Posted to commits@karaf.apache.org by Apache Jenkins Server <je...@builds.apache.org> on 2011/09/07 11:02:07 UTC
Build failed in Jenkins: Karaf #621
See <https://builds.apache.org/job/Karaf/621/>
------------------------------------------
Started by an SCM change
Building remotely on ubuntu1
hudson.util.IOException2: remote file operation failed: <https://builds.apache.org/job/Karaf/ws/> at hudson.remoting.Channel@18b518c9:ubuntu1
at hudson.FilePath.act(FilePath.java:754)
at hudson.FilePath.act(FilePath.java:740)
at hudson.scm.SubversionSCM.checkout(SubversionSCM.java:731)
at hudson.scm.SubversionSCM.checkout(SubversionSCM.java:676)
at hudson.model.AbstractProject.checkout(AbstractProject.java:1193)
at hudson.model.AbstractBuild$AbstractRunner.checkout(AbstractBuild.java:555)
at hudson.model.AbstractBuild$AbstractRunner.run(AbstractBuild.java:443)
at hudson.model.Run.run(Run.java:1376)
at hudson.maven.MavenModuleSetBuild.run(MavenModuleSetBuild.java:479)
at hudson.model.ResourceController.execute(ResourceController.java:88)
at hudson.model.Executor.run(Executor.java:230)
Caused by: java.io.IOException: Remote call on ubuntu1 failed
at hudson.remoting.Channel.call(Channel.java:677)
at hudson.FilePath.act(FilePath.java:747)
... 10 more
Caused by: java.lang.LinkageError: loader (instance of hudson/remoting/RemoteClassLoader): attempted duplicate class definition for name: "hudson/model/Descriptor"
at java.lang.ClassLoader.defineClass1(Native Method)
at java.lang.ClassLoader.defineClass(ClassLoader.java:634)
at java.lang.ClassLoader.defineClass(ClassLoader.java:480)
at hudson.remoting.RemoteClassLoader.loadClassFile(RemoteClassLoader.java:151)
at hudson.remoting.RemoteClassLoader.findClass(RemoteClassLoader.java:131)
at java.lang.ClassLoader.loadClass(ClassLoader.java:321)
at java.lang.ClassLoader.loadClass(ClassLoader.java:266)
at java.lang.Class.getDeclaredFields0(Native Method)
at java.lang.Class.privateGetDeclaredFields(Class.java:2308)
at java.lang.Class.getDeclaredField(Class.java:1897)
at java.io.ObjectStreamClass.getDeclaredSUID(ObjectStreamClass.java:1627)
at java.io.ObjectStreamClass.access$700(ObjectStreamClass.java:69)
at java.io.ObjectStreamClass$2.run(ObjectStreamClass.java:442)
at java.security.AccessController.doPrivileged(Native Method)
at java.io.ObjectStreamClass.<init>(ObjectStreamClass.java:430)
at java.io.ObjectStreamClass.lookup(ObjectStreamClass.java:327)
at java.io.ObjectStreamClass.initNonProxy(ObjectStreamClass.java:564)
at java.io.ObjectInputStream.readNonProxyDesc(ObjectInputStream.java:1600)
at java.io.ObjectInputStream.readClassDesc(ObjectInputStream.java:1513)
at java.io.ObjectInputStream.readNonProxyDesc(ObjectInputStream.java:1600)
at java.io.ObjectInputStream.readClassDesc(ObjectInputStream.java:1513)
at java.io.ObjectInputStream.readOrdinaryObject(ObjectInputStream.java:1749)
at java.io.ObjectInputStream.readObject0(ObjectInputStream.java:1346)
at java.io.ObjectInputStream.defaultReadFields(ObjectInputStream.java:1963)
at java.io.ObjectInputStream.readSerialData(ObjectInputStream.java:1887)
at java.io.ObjectInputStream.readOrdinaryObject(ObjectInputStream.java:1770)
at java.io.ObjectInputStream.readObject0(ObjectInputStream.java:1346)
at java.io.ObjectInputStream.defaultReadFields(ObjectInputStream.java:1963)
at java.io.ObjectInputStream.readSerialData(ObjectInputStream.java:1887)
at java.io.ObjectInputStream.readOrdinaryObject(ObjectInputStream.java:1770)
at java.io.ObjectInputStream.readObject0(ObjectInputStream.java:1346)
at java.io.ObjectInputStream.defaultReadFields(ObjectInputStream.java:1963)
at java.io.ObjectInputStream.readSerialData(ObjectInputStream.java:1887)
at java.io.ObjectInputStream.readOrdinaryObject(ObjectInputStream.java:1770)
at java.io.ObjectInputStream.readObject0(ObjectInputStream.java:1346)
at java.io.ObjectInputStream.readObject(ObjectInputStream.java:368)
at hudson.remoting.UserRequest.deserialize(UserRequest.java:182)
at hudson.remoting.UserRequest.perform(UserRequest.java:98)
at hudson.remoting.UserRequest.perform(UserRequest.java:48)
at hudson.remoting.Request$2.run(Request.java:287)
at java.util.concurrent.Executors$RunnableAdapter.call(Executors.java:471)
at java.util.concurrent.FutureTask$Sync.innerRun(FutureTask.java:334)
at java.util.concurrent.FutureTask.run(FutureTask.java:166)
at java.util.concurrent.ThreadPoolExecutor.runWorker(ThreadPoolExecutor.java:1110)
at java.util.concurrent.ThreadPoolExecutor$Worker.run(ThreadPoolExecutor.java:603)
at java.lang.Thread.run(Thread.java:636)
Build failed in Jenkins: Karaf #622
Posted by Apache Jenkins Server <je...@builds.apache.org>.
See <https://builds.apache.org/job/Karaf/622/>
------------------------------------------
[...truncated 2661 lines...]
Downloading: http://repo1.maven.org/maven2/org/apache/maven/maven-core/2.0.6/maven-core-2.0.6.pom
Downloaded: http://repo1.maven.org/maven2/org/apache/maven/maven-core/2.0.6/maven-core-2.0.6.pom (7 KB at 21.4 KB/sec)
Downloading: http://repo1.maven.org/maven2/org/apache/maven/maven-settings/2.0.6/maven-settings-2.0.6.pom
Downloaded: http://repo1.maven.org/maven2/org/apache/maven/maven-settings/2.0.6/maven-settings-2.0.6.pom (2 KB at 4.0 KB/sec)
Downloading: http://repo1.maven.org/maven2/org/apache/maven/maven-plugin-parameter-documenter/2.0.6/maven-plugin-parameter-documenter-2.0.6.pom
Downloaded: http://repo1.maven.org/maven2/org/apache/maven/maven-plugin-parameter-documenter/2.0.6/maven-plugin-parameter-documenter-2.0.6.pom (2 KB at 3.8 KB/sec)
Downloading: http://repo1.maven.org/maven2/org/apache/maven/reporting/maven-reporting-api/2.0.6/maven-reporting-api-2.0.6.pom
Downloaded: http://repo1.maven.org/maven2/org/apache/maven/reporting/maven-reporting-api/2.0.6/maven-reporting-api-2.0.6.pom (2 KB at 3.5 KB/sec)
Downloading: http://repo1.maven.org/maven2/org/apache/maven/reporting/maven-reporting/2.0.6/maven-reporting-2.0.6.pom
Downloaded: http://repo1.maven.org/maven2/org/apache/maven/reporting/maven-reporting/2.0.6/maven-reporting-2.0.6.pom (2 KB at 2.8 KB/sec)
Downloading: http://repo1.maven.org/maven2/org/apache/maven/maven-profile/2.0.6/maven-profile-2.0.6.pom
Downloaded: http://repo1.maven.org/maven2/org/apache/maven/maven-profile/2.0.6/maven-profile-2.0.6.pom (2 KB at 3.5 KB/sec)
Downloading: http://repo1.maven.org/maven2/org/apache/maven/maven-repository-metadata/2.0.6/maven-repository-metadata-2.0.6.pom
Downloaded: http://repo1.maven.org/maven2/org/apache/maven/maven-repository-metadata/2.0.6/maven-repository-metadata-2.0.6.pom (2 KB at 4.2 KB/sec)
Downloading: http://repo1.maven.org/maven2/org/apache/maven/maven-error-diagnostics/2.0.6/maven-error-diagnostics-2.0.6.pom
Downloaded: http://repo1.maven.org/maven2/org/apache/maven/maven-error-diagnostics/2.0.6/maven-error-diagnostics-2.0.6.pom (2 KB at 3.3 KB/sec)
Downloading: http://repo1.maven.org/maven2/org/apache/maven/maven-project/2.0.6/maven-project-2.0.6.pom
Downloaded: http://repo1.maven.org/maven2/org/apache/maven/maven-project/2.0.6/maven-project-2.0.6.pom (3 KB at 5.2 KB/sec)
Downloading: http://repo1.maven.org/maven2/org/apache/maven/maven-artifact-manager/2.0.6/maven-artifact-manager-2.0.6.pom
Downloaded: http://repo1.maven.org/maven2/org/apache/maven/maven-artifact-manager/2.0.6/maven-artifact-manager-2.0.6.pom (3 KB at 5.2 KB/sec)
Downloading: http://repo1.maven.org/maven2/org/apache/maven/maven-plugin-registry/2.0.6/maven-plugin-registry-2.0.6.pom
Downloaded: http://repo1.maven.org/maven2/org/apache/maven/maven-plugin-registry/2.0.6/maven-plugin-registry-2.0.6.pom (2 KB at 3.8 KB/sec)
Downloading: http://repo1.maven.org/maven2/org/apache/maven/maven-plugin-descriptor/2.0.6/maven-plugin-descriptor-2.0.6.pom
Downloaded: http://repo1.maven.org/maven2/org/apache/maven/maven-plugin-descriptor/2.0.6/maven-plugin-descriptor-2.0.6.pom (2 KB at 4.1 KB/sec)
Downloading: http://repo1.maven.org/maven2/org/apache/maven/maven-monitor/2.0.6/maven-monitor-2.0.6.pom
Downloaded: http://repo1.maven.org/maven2/org/apache/maven/maven-monitor/2.0.6/maven-monitor-2.0.6.pom (2 KB at 2.4 KB/sec)
Downloading: http://repo1.maven.org/maven2/org/apache/maven/shared/maven-artifact-resolver/1.0/maven-artifact-resolver-1.0.pom
Downloaded: http://repo1.maven.org/maven2/org/apache/maven/shared/maven-artifact-resolver/1.0/maven-artifact-resolver-1.0.pom (6 KB at 12.4 KB/sec)
Downloading: http://repo1.maven.org/maven2/org/apache/maven/shared/maven-shared-components/12/maven-shared-components-12.pom
Downloaded: http://repo1.maven.org/maven2/org/apache/maven/shared/maven-shared-components/12/maven-shared-components-12.pom (10 KB at 18.3 KB/sec)
Downloading: http://repo1.maven.org/maven2/org/apache/maven/maven-parent/13/maven-parent-13.pom
Downloaded: http://repo1.maven.org/maven2/org/apache/maven/maven-parent/13/maven-parent-13.pom (23 KB at 44.4 KB/sec)
Downloading: http://repo1.maven.org/maven2/org/apache/apache/6/apache-6.pom
Downloaded: http://repo1.maven.org/maven2/org/apache/apache/6/apache-6.pom (13 KB at 25.2 KB/sec)
Downloading: http://repo1.maven.org/maven2/org/apache/maven/shared/maven-common-artifact-filters/1.0/maven-common-artifact-filters-1.0.pom
Downloaded: http://repo1.maven.org/maven2/org/apache/maven/shared/maven-common-artifact-filters/1.0/maven-common-artifact-filters-1.0.pom (2 KB at 4.0 KB/sec)
Downloading: http://repo1.maven.org/maven2/org/apache/maven/shared/maven-shared-components/8/maven-shared-components-8.pom
Downloaded: http://repo1.maven.org/maven2/org/apache/maven/shared/maven-shared-components/8/maven-shared-components-8.pom (3 KB at 5.2 KB/sec)
Downloading: http://repo1.maven.org/maven2/org/apache/maven/maven-parent/7/maven-parent-7.pom
Downloaded: http://repo1.maven.org/maven2/org/apache/maven/maven-parent/7/maven-parent-7.pom (21 KB at 41.7 KB/sec)
Downloading: http://repo1.maven.org/maven2/org/apache/maven/maven-project/2.0/maven-project-2.0.pom
Downloaded: http://repo1.maven.org/maven2/org/apache/maven/maven-project/2.0/maven-project-2.0.pom (2 KB at 3.2 KB/sec)
Downloading: http://repo1.maven.org/maven2/org/apache/maven/maven/2.0/maven-2.0.pom
Downloaded: http://repo1.maven.org/maven2/org/apache/maven/maven/2.0/maven-2.0.pom (9 KB at 17.2 KB/sec)
Downloading: http://repo1.maven.org/maven2/org/apache/maven/maven-profile/2.0/maven-profile-2.0.pom
Downloaded: http://repo1.maven.org/maven2/org/apache/maven/maven-profile/2.0/maven-profile-2.0.pom (2 KB at 2.7 KB/sec)
Downloading: http://repo1.maven.org/maven2/org/apache/maven/maven-model/2.0/maven-model-2.0.pom
Downloaded: http://repo1.maven.org/maven2/org/apache/maven/maven-model/2.0/maven-model-2.0.pom (3 KB at 4.7 KB/sec)
Downloading: http://repo1.maven.org/maven2/org/apache/maven/maven-artifact-manager/2.0/maven-artifact-manager-2.0.pom
Downloaded: http://repo1.maven.org/maven2/org/apache/maven/maven-artifact-manager/2.0/maven-artifact-manager-2.0.pom (2 KB at 2.7 KB/sec)
Downloading: http://repo1.maven.org/maven2/org/apache/maven/maven-repository-metadata/2.0/maven-repository-metadata-2.0.pom
Downloaded: http://repo1.maven.org/maven2/org/apache/maven/maven-repository-metadata/2.0/maven-repository-metadata-2.0.pom (2 KB at 2.4 KB/sec)
Downloading: http://repo1.maven.org/maven2/org/apache/maven/maven-artifact/2.0/maven-artifact-2.0.pom
Downloaded: http://repo1.maven.org/maven2/org/apache/maven/maven-artifact/2.0/maven-artifact-2.0.pom (723 B at 1.4 KB/sec)
Downloading: http://repo1.maven.org/maven2/org/apache/maven/maven-core/2.0/maven-core-2.0.pom
Downloaded: http://repo1.maven.org/maven2/org/apache/maven/maven-core/2.0/maven-core-2.0.pom (6 KB at 11.1 KB/sec)
Downloading: http://repo1.maven.org/maven2/org/apache/maven/maven-settings/2.0/maven-settings-2.0.pom
Downloaded: http://repo1.maven.org/maven2/org/apache/maven/maven-settings/2.0/maven-settings-2.0.pom (2 KB at 2.7 KB/sec)
Downloading: http://repo1.maven.org/maven2/org/apache/maven/maven-plugin-parameter-documenter/2.0/maven-plugin-parameter-documenter-2.0.pom
Downloaded: http://repo1.maven.org/maven2/org/apache/maven/maven-plugin-parameter-documenter/2.0/maven-plugin-parameter-documenter-2.0.pom (2 KB at 3.0 KB/sec)
Downloading: http://repo1.maven.org/maven2/org/apache/maven/reporting/maven-reporting-api/2.0/maven-reporting-api-2.0.pom
Downloaded: http://repo1.maven.org/maven2/org/apache/maven/reporting/maven-reporting-api/2.0/maven-reporting-api-2.0.pom (2 KB at 2.2 KB/sec)
Downloading: http://repo1.maven.org/maven2/org/apache/maven/reporting/maven-reporting/2.0/maven-reporting-2.0.pom
Downloaded: http://repo1.maven.org/maven2/org/apache/maven/reporting/maven-reporting/2.0/maven-reporting-2.0.pom (504 B at 1.0 KB/sec)
Downloading: http://repo1.maven.org/maven2/doxia/doxia-sink-api/1.0-alpha-4/doxia-sink-api-1.0-alpha-4.pom
Downloaded: http://repo1.maven.org/maven2/doxia/doxia-sink-api/1.0-alpha-4/doxia-sink-api-1.0-alpha-4.pom (2 KB at 2.1 KB/sec)
Downloading: http://repo1.maven.org/maven2/org/apache/maven/maven-error-diagnostics/2.0/maven-error-diagnostics-2.0.pom
Downloaded: http://repo1.maven.org/maven2/org/apache/maven/maven-error-diagnostics/2.0/maven-error-diagnostics-2.0.pom (812 B at 1.6 KB/sec)
Downloading: http://repo1.maven.org/maven2/org/apache/maven/maven-plugin-registry/2.0/maven-plugin-registry-2.0.pom
Downloaded: http://repo1.maven.org/maven2/org/apache/maven/maven-plugin-registry/2.0/maven-plugin-registry-2.0.pom (2 KB at 2.5 KB/sec)
Downloading: http://repo1.maven.org/maven2/org/apache/maven/maven-plugin-api/2.0/maven-plugin-api-2.0.pom
Downloaded: http://repo1.maven.org/maven2/org/apache/maven/maven-plugin-api/2.0/maven-plugin-api-2.0.pom (601 B at 1.2 KB/sec)
Downloading: http://repo1.maven.org/maven2/org/apache/maven/maven-plugin-descriptor/2.0/maven-plugin-descriptor-2.0.pom
Downloaded: http://repo1.maven.org/maven2/org/apache/maven/maven-plugin-descriptor/2.0/maven-plugin-descriptor-2.0.pom (2 KB at 2.9 KB/sec)
Downloading: http://repo1.maven.org/maven2/org/apache/maven/maven-monitor/2.0/maven-monitor-2.0.pom
Downloaded: http://repo1.maven.org/maven2/org/apache/maven/maven-monitor/2.0/maven-monitor-2.0.pom (400 B at 0.8 KB/sec)
Downloading: http://repo1.maven.org/maven2/org/codehaus/plexus/plexus-utils/1.4.2/plexus-utils-1.4.2.pom
Downloaded: http://repo1.maven.org/maven2/org/codehaus/plexus/plexus-utils/1.4.2/plexus-utils-1.4.2.pom (2 KB at 3.9 KB/sec)
Downloading: http://repo1.maven.org/maven2/org/codehaus/plexus/plexus-utils/1.2/plexus-utils-1.2.pom
Downloaded: http://repo1.maven.org/maven2/org/codehaus/plexus/plexus-utils/1.2/plexus-utils-1.2.pom (767 B at 1.5 KB/sec)
Downloading: http://repo1.maven.org/maven2/org/codehaus/plexus/plexus/1.0.5/plexus-1.0.5.pom
Downloaded: http://repo1.maven.org/maven2/org/codehaus/plexus/plexus/1.0.5/plexus-1.0.5.pom (6 KB at 11.4 KB/sec)
Downloading: http://repo1.maven.org/maven2/org/apache/maven/shared/maven-downloader/1.1/maven-downloader-1.1.pom
Downloaded: http://repo1.maven.org/maven2/org/apache/maven/shared/maven-downloader/1.1/maven-downloader-1.1.pom (2 KB at 3.6 KB/sec)
Downloading: http://repo1.maven.org/maven2/org/apache/maven/shared/maven-shared-components/4/maven-shared-components-4.pom
Downloaded: http://repo1.maven.org/maven2/org/apache/maven/shared/maven-shared-components/4/maven-shared-components-4.pom (3 KB at 4.3 KB/sec)
Downloading: http://repo1.maven.org/maven2/org/apache/maven/maven-parent/4/maven-parent-4.pom
Downloaded: http://repo1.maven.org/maven2/org/apache/maven/maven-parent/4/maven-parent-4.pom (10 KB at 19.9 KB/sec)
Downloading: http://repo1.maven.org/maven2/org/apache/maven/shared/maven-filtering/1.0/maven-filtering-1.0.pom
Downloaded: http://repo1.maven.org/maven2/org/apache/maven/shared/maven-filtering/1.0/maven-filtering-1.0.pom (6 KB at 11.3 KB/sec)
Downloading: http://repo1.maven.org/maven2/org/apache/maven/shared/maven-shared-components/16/maven-shared-components-16.pom
Downloaded: http://repo1.maven.org/maven2/org/apache/maven/shared/maven-shared-components/16/maven-shared-components-16.pom (9 KB at 17.9 KB/sec)
Downloading: http://repo1.maven.org/maven2/org/codehaus/plexus/plexus-utils/1.5.15/plexus-utils-1.5.15.pom
Downloaded: http://repo1.maven.org/maven2/org/codehaus/plexus/plexus-utils/1.5.15/plexus-utils-1.5.15.pom (7 KB at 13.0 KB/sec)
Downloading: http://repo1.maven.org/maven2/org/codehaus/plexus/plexus-interpolation/1.12/plexus-interpolation-1.12.pom
Downloaded: http://repo1.maven.org/maven2/org/codehaus/plexus/plexus-interpolation/1.12/plexus-interpolation-1.12.pom (889 B at 1.7 KB/sec)
Downloading: http://repo1.maven.org/maven2/org/codehaus/plexus/plexus-components/1.1.14/plexus-components-1.1.14.pom
Downloaded: http://repo1.maven.org/maven2/org/codehaus/plexus/plexus-components/1.1.14/plexus-components-1.1.14.pom (6 KB at 12.2 KB/sec)
Downloading: http://repo1.maven.org/maven2/org/sonatype/plexus/plexus-build-api/0.0.4/plexus-build-api-0.0.4.pom
Downloaded: http://repo1.maven.org/maven2/org/sonatype/plexus/plexus-build-api/0.0.4/plexus-build-api-0.0.4.pom (3 KB at 5.7 KB/sec)
Downloading: http://repo1.maven.org/maven2/org/sonatype/spice/spice-parent/10/spice-parent-10.pom
Downloaded: http://repo1.maven.org/maven2/org/sonatype/spice/spice-parent/10/spice-parent-10.pom (3 KB at 5.9 KB/sec)
Downloading: http://repo1.maven.org/maven2/org/sonatype/forge/forge-parent/3/forge-parent-3.pom
Downloaded: http://repo1.maven.org/maven2/org/sonatype/forge/forge-parent/3/forge-parent-3.pom (5 KB at 9.9 KB/sec)
Downloading: http://repo1.maven.org/maven2/org/codehaus/plexus/plexus-resources/1.0-alpha-5/plexus-resources-1.0-alpha-5.pom
Downloaded: http://repo1.maven.org/maven2/org/codehaus/plexus/plexus-resources/1.0-alpha-5/plexus-resources-1.0-alpha-5.pom (2 KB at 2.5 KB/sec)
Downloading: http://repo1.maven.org/maven2/org/codehaus/plexus/plexus-utils/1.5.5/plexus-utils-1.5.5.pom
Downloaded: http://repo1.maven.org/maven2/org/codehaus/plexus/plexus-utils/1.5.5/plexus-utils-1.5.5.pom (6 KB at 10.6 KB/sec)
Downloading: http://repo1.maven.org/maven2/org/codehaus/plexus/plexus-utils/1.5.12/plexus-utils-1.5.12.pom
Downloaded: http://repo1.maven.org/maven2/org/codehaus/plexus/plexus-utils/1.5.12/plexus-utils-1.5.12.pom (6 KB at 10.4 KB/sec)
Downloading: http://repo1.maven.org/maven2/org/codehaus/plexus/plexus-velocity/1.1.8/plexus-velocity-1.1.8.pom
Downloaded: http://repo1.maven.org/maven2/org/codehaus/plexus/plexus-velocity/1.1.8/plexus-velocity-1.1.8.pom (2 KB at 4.1 KB/sec)
Downloading: http://repo1.maven.org/maven2/commons-collections/commons-collections/3.1/commons-collections-3.1.pom
Downloaded: http://repo1.maven.org/maven2/commons-collections/commons-collections/3.1/commons-collections-3.1.pom (6 KB at 10.9 KB/sec)
Downloading: http://repo1.maven.org/maven2/velocity/velocity/1.5/velocity-1.5.pom
Downloaded: http://repo1.maven.org/maven2/velocity/velocity/1.5/velocity-1.5.pom (8 KB at 16.4 KB/sec)
Downloading: http://repo1.maven.org/maven2/commons-lang/commons-lang/2.1/commons-lang-2.1.pom
Downloaded: http://repo1.maven.org/maven2/commons-lang/commons-lang/2.1/commons-lang-2.1.pom (10 KB at 20.0 KB/sec)
Downloading: http://repo1.maven.org/maven2/oro/oro/2.0.8/oro-2.0.8.pom
Downloaded: http://repo1.maven.org/maven2/oro/oro/2.0.8/oro-2.0.8.pom (140 B at 0.3 KB/sec)
Downloading: http://repo1.maven.org/maven2/org/apache/velocity/velocity/1.6.4/velocity-1.6.4.pom
Downloaded: http://repo1.maven.org/maven2/org/apache/velocity/velocity/1.6.4/velocity-1.6.4.pom (11 KB at 20.8 KB/sec)
Downloading: http://repo1.maven.org/maven2/commons-collections/commons-collections/3.2.1/commons-collections-3.2.1.pom
Downloaded: http://repo1.maven.org/maven2/commons-collections/commons-collections/3.2.1/commons-collections-3.2.1.pom (13 KB at 16.3 KB/sec)
Downloading: http://repo1.maven.org/maven2/org/apache/commons/commons-parent/9/commons-parent-9.pom
Downloaded: http://repo1.maven.org/maven2/org/apache/commons/commons-parent/9/commons-parent-9.pom (22 KB at 43.4 KB/sec)
Downloading: http://repo1.maven.org/maven2/commons-lang/commons-lang/2.4/commons-lang-2.4.pom
Downloaded: http://repo1.maven.org/maven2/commons-lang/commons-lang/2.4/commons-lang-2.4.pom (14 KB at 26.7 KB/sec)
Downloading: http://repo1.maven.org/maven2/org/apache/maven/reporting/maven-reporting-api/2.0.6/maven-reporting-api-2.0.6.jar
Downloading: http://repo1.maven.org/maven2/org/apache/maven/shared/maven-artifact-resolver/1.0/maven-artifact-resolver-1.0.jar
Downloading: http://repo1.maven.org/maven2/org/apache/maven/shared/maven-common-artifact-filters/1.0/maven-common-artifact-filters-1.0.jar
Downloading: http://repo1.maven.org/maven2/org/apache/maven/shared/maven-plugin-testing-harness/1.1/maven-plugin-testing-harness-1.1.jar
Downloading: http://repo1.maven.org/maven2/org/codehaus/plexus/plexus-archiver/1.0-alpha-7/plexus-archiver-1.0-alpha-7.jar
Downloaded: http://repo1.maven.org/maven2/org/apache/maven/reporting/maven-reporting-api/2.0.6/maven-reporting-api-2.0.6.jar (10 KB at 6.6 KB/sec)
Downloading: http://repo1.maven.org/maven2/org/apache/maven/shared/maven-downloader/1.1/maven-downloader-1.1.jar
Downloaded: http://repo1.maven.org/maven2/org/apache/maven/shared/maven-artifact-resolver/1.0/maven-artifact-resolver-1.0.jar (14 KB at 7.7 KB/sec)
Downloading: http://repo1.maven.org/maven2/org/apache/maven/shared/maven-filtering/1.0/maven-filtering-1.0.jar
Downloaded: http://repo1.maven.org/maven2/org/apache/maven/shared/maven-common-artifact-filters/1.0/maven-common-artifact-filters-1.0.jar (27 KB at 13.5 KB/sec)
Downloading: http://repo1.maven.org/maven2/org/sonatype/plexus/plexus-build-api/0.0.4/plexus-build-api-0.0.4.jar
Downloaded: http://repo1.maven.org/maven2/org/apache/maven/shared/maven-plugin-testing-harness/1.1/maven-plugin-testing-harness-1.1.jar (32 KB at 14.3 KB/sec)
Downloading: http://repo1.maven.org/maven2/org/codehaus/plexus/plexus-interpolation/1.12/plexus-interpolation-1.12.jar
Downloaded: http://repo1.maven.org/maven2/org/codehaus/plexus/plexus-archiver/1.0-alpha-7/plexus-archiver-1.0-alpha-7.jar (139 KB at 51.0 KB/sec)
Downloading: http://repo1.maven.org/maven2/org/codehaus/plexus/plexus-resources/1.0-alpha-5/plexus-resources-1.0-alpha-5.jar
Downloaded: http://repo1.maven.org/maven2/org/apache/maven/shared/maven-downloader/1.1/maven-downloader-1.1.jar (7 KB at 2.8 KB/sec)
Downloading: http://repo1.maven.org/maven2/org/codehaus/plexus/plexus-utils/1.5.12/plexus-utils-1.5.12.jar
Downloaded: http://repo1.maven.org/maven2/org/apache/maven/shared/maven-filtering/1.0/maven-filtering-1.0.jar (42 KB at 16.8 KB/sec)
Downloading: http://repo1.maven.org/maven2/org/codehaus/plexus/plexus-velocity/1.1.8/plexus-velocity-1.1.8.jar
Downloaded: http://repo1.maven.org/maven2/org/sonatype/plexus/plexus-build-api/0.0.4/plexus-build-api-0.0.4.jar (7 KB at 2.7 KB/sec)
Downloading: http://repo1.maven.org/maven2/commons-collections/commons-collections/3.1/commons-collections-3.1.jar
Downloaded: http://repo1.maven.org/maven2/org/codehaus/plexus/plexus-interpolation/1.12/plexus-interpolation-1.12.jar (60 KB at 23.8 KB/sec)
Downloading: http://repo1.maven.org/maven2/velocity/velocity/1.5/velocity-1.5.jar
Downloaded: http://repo1.maven.org/maven2/org/codehaus/plexus/plexus-resources/1.0-alpha-5/plexus-resources-1.0-alpha-5.jar (22 KB at 8.7 KB/sec)
Downloading: http://repo1.maven.org/maven2/org/apache/velocity/velocity/1.6.4/velocity-1.6.4.jar
Downloaded: http://repo1.maven.org/maven2/org/codehaus/plexus/plexus-utils/1.5.12/plexus-utils-1.5.12.jar (276 KB at 99.6 KB/sec)
Downloading: http://repo1.maven.org/maven2/commons-lang/commons-lang/2.4/commons-lang-2.4.jar
Downloaded: http://repo1.maven.org/maven2/org/codehaus/plexus/plexus-velocity/1.1.8/plexus-velocity-1.1.8.jar (8 KB at 3.1 KB/sec)
Downloading: http://repo1.maven.org/maven2/oro/oro/2.0.8/oro-2.0.8.jar
Downloaded: http://repo1.maven.org/maven2/commons-collections/commons-collections/3.1/commons-collections-3.1.jar (547 KB at 218.5 KB/sec)
Downloaded: http://repo1.maven.org/maven2/velocity/velocity/1.5/velocity-1.5.jar (383 KB at 152.3 KB/sec)
Downloaded: http://repo1.maven.org/maven2/org/apache/velocity/velocity/1.6.4/velocity-1.6.4.jar (412 KB at 149.6 KB/sec)
Downloaded: http://repo1.maven.org/maven2/commons-lang/commons-lang/2.4/commons-lang-2.4.jar (256 KB at 147.2 KB/sec)
Downloaded: http://repo1.maven.org/maven2/oro/oro/2.0.8/oro-2.0.8.jar (64 KB at 36.6 KB/sec)
[INFO]
[INFO] --- maven-install-plugin:2.3.1:install (default-install) @ karaf ---
Downloading: http://svn.apache.org/repos/asf/servicemix/m2-repo/org/apache/apache-jar-resource-bundle/1.4/apache-jar-resource-bundle-1.4.jar
Downloading: http://repo1.maven.org/maven2/org/apache/apache-jar-resource-bundle/1.4/apache-jar-resource-bundle-1.4.jar
Downloaded: http://repo1.maven.org/maven2/org/apache/apache-jar-resource-bundle/1.4/apache-jar-resource-bundle-1.4.jar (13 KB at 34.4 KB/sec)
Downloading: http://repo1.maven.org/maven2/org/codehaus/plexus/plexus-digest/1.0/plexus-digest-1.0.pom
Downloaded: http://repo1.maven.org/maven2/org/codehaus/plexus/plexus-digest/1.0/plexus-digest-1.0.pom (2 KB at 3.4 KB/sec)
Downloading: http://repo1.maven.org/maven2/org/codehaus/plexus/plexus-components/1.1.7/plexus-components-1.1.7.pom
Downloaded: http://repo1.maven.org/maven2/org/codehaus/plexus/plexus-components/1.1.7/plexus-components-1.1.7.pom (5 KB at 9.8 KB/sec)
Downloading: http://repo1.maven.org/maven2/org/codehaus/plexus/plexus-digest/1.0/plexus-digest-1.0.jar
projectSucceeded org.apache.karaf:karaf:3.0.0-SNAPSHOT
[JENKINS] Archiving <https://builds.apache.org/job/Karaf/ws/karaf/pom.xml> to /home/hudson/hudson/jobs/Karaf/modules/org.apache.karaf$karaf/builds/2011-09-07_13-06-44/archive/org.apache.karaf/karaf/3.0.0-SNAPSHOT/karaf-3.0.0-SNAPSHOT.pom
Downloaded: http://repo1.maven.org/maven2/org/codehaus/plexus/plexus-digest/1.0/plexus-digest-1.0.jar (12 KB at 23.5 KB/sec)
[INFO] Installing <https://builds.apache.org/job/Karaf/ws/karaf/pom.xml> to <https://builds.apache.org/job/Karaf/ws/.repository/org/apache/karaf/karaf/3.0.0-SNAPSHOT/karaf-3.0.0-SNAPSHOT.pom>
[INFO]
[INFO] ------------------------------------------------------------------------
[INFO] Building Apache Karaf :: Util 3.0.0-SNAPSHOT
[INFO] ------------------------------------------------------------------------
Downloading: http://repo1.maven.org/maven2/org/apache/maven/plugins/maven-resources-plugin/2.5/maven-resources-plugin-2.5.pom
Downloaded: http://repo1.maven.org/maven2/org/apache/maven/plugins/maven-resources-plugin/2.5/maven-resources-plugin-2.5.pom (7 KB at 22.9 KB/sec)
Downloading: http://repo1.maven.org/maven2/org/apache/maven/plugins/maven-resources-plugin/2.5/maven-resources-plugin-2.5.jar
Downloaded: http://repo1.maven.org/maven2/org/apache/maven/plugins/maven-resources-plugin/2.5/maven-resources-plugin-2.5.jar (26 KB at 51.1 KB/sec)
Downloading: http://repo1.maven.org/maven2/org/apache/maven/plugins/maven-compiler-plugin/2.3.2/maven-compiler-plugin-2.3.2.pom
Downloaded: http://repo1.maven.org/maven2/org/apache/maven/plugins/maven-compiler-plugin/2.3.2/maven-compiler-plugin-2.3.2.pom (8 KB at 14.7 KB/sec)
Downloading: http://repo1.maven.org/maven2/org/apache/maven/plugins/maven-compiler-plugin/2.3.2/maven-compiler-plugin-2.3.2.jar
Downloaded: http://repo1.maven.org/maven2/org/apache/maven/plugins/maven-compiler-plugin/2.3.2/maven-compiler-plugin-2.3.2.jar (29 KB at 57.7 KB/sec)
Downloading: http://repo1.maven.org/maven2/org/apache/maven/plugins/maven-surefire-plugin/2.9/maven-surefire-plugin-2.9.pom
Downloaded: http://repo1.maven.org/maven2/org/apache/maven/plugins/maven-surefire-plugin/2.9/maven-surefire-plugin-2.9.pom (10 KB at 19.0 KB/sec)
Downloading: http://repo1.maven.org/maven2/org/apache/maven/surefire/surefire/2.9/surefire-2.9.pom
Downloaded: http://repo1.maven.org/maven2/org/apache/maven/surefire/surefire/2.9/surefire-2.9.pom (12 KB at 23.5 KB/sec)
Downloading: http://repo1.maven.org/maven2/org/apache/maven/plugins/maven-surefire-plugin/2.9/maven-surefire-plugin-2.9.jar
Downloaded: http://repo1.maven.org/maven2/org/apache/maven/plugins/maven-surefire-plugin/2.9/maven-surefire-plugin-2.9.jar (29 KB at 58.3 KB/sec)
Downloading: http://repo1.maven.org/maven2/org/apache/maven/plugins/maven-jar-plugin/2.3.2/maven-jar-plugin-2.3.2.pom
Downloaded: http://repo1.maven.org/maven2/org/apache/maven/plugins/maven-jar-plugin/2.3.2/maven-jar-plugin-2.3.2.pom (6 KB at 11.6 KB/sec)
Downloading: http://repo1.maven.org/maven2/org/apache/maven/plugins/maven-plugins/21/maven-plugins-21.pom
Downloaded: http://repo1.maven.org/maven2/org/apache/maven/plugins/maven-plugins/21/maven-plugins-21.pom (13 KB at 24.5 KB/sec)
Downloading: http://repo1.maven.org/maven2/org/apache/maven/maven-parent/20/maven-parent-20.pom
Downloaded: http://repo1.maven.org/maven2/org/apache/maven/maven-parent/20/maven-parent-20.pom (25 KB at 48.4 KB/sec)
Downloading: http://repo1.maven.org/maven2/org/apache/maven/plugins/maven-jar-plugin/2.3.2/maven-jar-plugin-2.3.2.jar
Downloaded: http://repo1.maven.org/maven2/org/apache/maven/plugins/maven-jar-plugin/2.3.2/maven-jar-plugin-2.3.2.jar (32 KB at 64.5 KB/sec)
[INFO] Build timed out (after 57 minutes). Marking the build as aborted.
ERROR: Failed to parse POMs
hudson.remoting.ChannelClosedException: channel is already closed
at hudson.remoting.Channel.send(Channel.java:486)
at hudson.remoting.ProxyOutputStream._write(ProxyOutputStream.java:123)
at hudson.remoting.ProxyOutputStream.write(ProxyOutputStream.java:103)
at hudson.remoting.RemoteOutputStream.write(RemoteOutputStream.java:110)
at java.io.BufferedOutputStream.flushBuffer(BufferedOutputStream.java:65)
at java.io.BufferedOutputStream.flush(BufferedOutputStream.java:123)
at java.io.BufferedOutputStream.flush(BufferedOutputStream.java:124)
at java.io.ObjectOutputStream$BlockDataOutputStream.flush(ObjectOutputStream.java:1793)
at java.io.ObjectOutputStream.flush(ObjectOutputStream.java:699)
at hudson.remoting.Channel.send(Channel.java:492)
at hudson.remoting.Request.call(Request.java:161)
at hudson.remoting.Channel.call(Channel.java:668)
at hudson.maven.ProcessCache$MavenProcess.call(ProcessCache.java:156)
at hudson.maven.MavenModuleSetBuild$RunnerImpl.doRun(MavenModuleSetBuild.java:759)
at hudson.model.AbstractBuild$AbstractRunner.run(AbstractBuild.java:448)
at hudson.model.Run.run(Run.java:1376)
at hudson.maven.MavenModuleSetBuild.run(MavenModuleSetBuild.java:479)
at hudson.model.ResourceController.execute(ResourceController.java:88)
at hudson.model.Executor.run(Executor.java:230)
Caused by: java.io.IOException: Unexpected termination of the channel
at hudson.remoting.Channel$ReaderThread.run(Channel.java:1037)
Caused by: java.io.EOFException
at java.io.ObjectInputStream$BlockDataInputStream.peekByte(ObjectInputStream.java:2553)
at java.io.ObjectInputStream.readObject0(ObjectInputStream.java:1296)
at java.io.ObjectInputStream.readObject(ObjectInputStream.java:350)
at hudson.remoting.Channel$ReaderThread.run(Channel.java:1031)
FATAL: channel is already closed
hudson.remoting.ChannelClosedException: channel is already closed
at hudson.remoting.Channel.send(Channel.java:486)
at hudson.remoting.Request.call(Request.java:110)
at hudson.remoting.Channel.call(Channel.java:668)
at hudson.Launcher$RemoteLauncher.kill(Launcher.java:812)
at hudson.model.AbstractBuild$AbstractRunner.run(AbstractBuild.java:471)
at hudson.model.Run.run(Run.java:1376)
at hudson.maven.MavenModuleSetBuild.run(MavenModuleSetBuild.java:479)
at hudson.model.ResourceController.execute(ResourceController.java:88)
at hudson.model.Executor.run(Executor.java:230)
Caused by: java.io.IOException: Unexpected termination of the channel
at hudson.remoting.Channel$ReaderThread.run(Channel.java:1037)
Caused by: java.io.EOFException
at java.io.ObjectInputStream$BlockDataInputStream.peekByte(ObjectInputStream.java:2553)
at java.io.ObjectInputStream.readObject0(ObjectInputStream.java:1296)
at java.io.ObjectInputStream.readObject(ObjectInputStream.java:350)
at hudson.remoting.Channel$ReaderThread.run(Channel.java:1031)