You are viewing a plain text version of this content. The canonical link for it is here.
Posted to builds@beam.apache.org by Apache Jenkins Server <je...@builds.apache.org> on 2021/09/04 13:39:58 UTC

Build failed in Jenkins: beam_PostCommit_Python38 #1640

See <https://ci-beam.apache.org/job/beam_PostCommit_Python38/1640/display/redirect>

Changes:


------------------------------------------
[...truncated 27.22 MB...]
}
message: "Starting finalize_write threads with num_shards: 1 (skipped: 0), batches: 1, num_threads: 1"
instruction_id: "bundle_6"
transform_id: "WriteToText/Write/WriteImpl/FinalizeWrite"
log_location: "/usr/local/lib/python3.8/site-packages/apache_beam/io/filebasedsink.py:297"
thread: "Thread-14"

INFO:root:severity: INFO
timestamp {
  seconds: 1630757815
  nanos: 747385740
}
message: "Renamed 1 shards in 0.05 seconds."
instruction_id: "bundle_6"
transform_id: "WriteToText/Write/WriteImpl/FinalizeWrite"
log_location: "/usr/local/lib/python3.8/site-packages/apache_beam/io/filebasedsink.py:345"
thread: "Thread-14"

INFO:root:severity: INFO
timestamp {
  seconds: 1630757815
  nanos: 758125543
}
message: "No more requests from control plane"
log_location: "/usr/local/lib/python3.8/site-packages/apache_beam/runners/worker/sdk_worker.py:261"
thread: "MainThread"

INFO:root:severity: INFO
timestamp {
  seconds: 1630757815
  nanos: 758261680
}
message: "SDK Harness waiting for in-flight requests to complete"
log_location: "/usr/local/lib/python3.8/site-packages/apache_beam/runners/worker/sdk_worker.py:262"
thread: "MainThread"

INFO:root:severity: INFO
timestamp {
  seconds: 1630757815
  nanos: 758329629
}
message: "Closing all cached grpc data channels."
log_location: "/usr/local/lib/python3.8/site-packages/apache_beam/runners/worker/data_plane.py:790"
thread: "MainThread"

INFO:root:severity: INFO
timestamp {
  seconds: 1630757815
  nanos: 758391141
}
message: "Closing all cached gRPC state handlers."
log_location: "/usr/local/lib/python3.8/site-packages/apache_beam/runners/worker/sdk_worker.py:907"
thread: "MainThread"

INFO:root:severity: INFO
timestamp {
  seconds: 1630757815
  nanos: 759072065
}
message: "Done consuming work."
log_location: "/usr/local/lib/python3.8/site-packages/apache_beam/runners/worker/sdk_worker.py:274"
thread: "MainThread"

INFO:root:severity: INFO
timestamp {
  seconds: 1630757815
  nanos: 759183168
}
message: "Python sdk harness exiting."
log_location: "/usr/local/lib/python3.8/site-packages/apache_beam/runners/worker/sdk_worker_main.py:154"
thread: "MainThread"

INFO:apache_beam.runners.portability.local_job_service:Successfully completed job in 4.597585916519165 seconds.
INFO:root:Successfully completed job in 4.597585916519165 seconds.
INFO:apache_beam.runners.portability.portable_runner:Job state changed to DONE

> Task :sdks:python:test-suites:portable:py38:portableWordCountSparkRunnerBatch
INFO:apache_beam.runners.worker.worker_pool_main:Listening for workers at localhost:33251
WARNING:root:Make sure that locally built Python SDK docker image has Python 3.8 interpreter.
INFO:root:Default Python SDK image for environment is apache/beam_python3.8_sdk:2.34.0.dev
INFO:apache_beam.runners.portability.fn_api_runner.translations:==================== <function pack_combiners at 0x7fb6e1159af0> ====================
INFO:apache_beam.runners.portability.fn_api_runner.translations:==================== <function lift_combiners at 0x7fb6e1159b80> ====================
INFO:apache_beam.runners.portability.fn_api_runner.translations:==================== <function sort_stages at 0x7fb6e115a310> ====================
INFO:apache_beam.utils.subprocess_server:Starting service with ['java' '-jar' '<https://ci-beam.apache.org/job/beam_PostCommit_Python38/ws/src/runners/spark/2/job-server/build/libs/beam-runners-spark-job-server-2.34.0-SNAPSHOT.jar'> '--spark-master-url' 'local[4]' '--artifacts-dir' '/tmp/beam-tempri7oa_1i/artifactsbufrklwc' '--job-port' '59357' '--artifact-port' '0' '--expansion-port' '0']
INFO:apache_beam.utils.subprocess_server:b'21/09/04 12:16:59 INFO org.apache.beam.runners.jobsubmission.JobServerDriver: ArtifactStagingService started on localhost:37605'
INFO:apache_beam.utils.subprocess_server:b'21/09/04 12:16:59 INFO org.apache.beam.runners.jobsubmission.JobServerDriver: Java ExpansionService started on localhost:34135'
INFO:apache_beam.utils.subprocess_server:b'21/09/04 12:16:59 INFO org.apache.beam.runners.jobsubmission.JobServerDriver: JobService started on localhost:59357'
INFO:apache_beam.utils.subprocess_server:b'21/09/04 12:16:59 INFO org.apache.beam.runners.jobsubmission.JobServerDriver: Job server now running, terminate with Ctrl+C'
WARNING:apache_beam.options.pipeline_options:Discarding unparseable args: ['--parallelism=2']
INFO:apache_beam.utils.subprocess_server:b'21/09/04 12:17:00 INFO org.apache.beam.runners.fnexecution.artifact.ArtifactStagingService: Staging artifacts for job_c59e24f1-8a83-479c-8ad0-067f2dfa45cd.'
INFO:apache_beam.utils.subprocess_server:b'21/09/04 12:17:00 INFO org.apache.beam.runners.fnexecution.artifact.ArtifactStagingService: Resolving artifacts for job_c59e24f1-8a83-479c-8ad0-067f2dfa45cd.ref_Environment_default_environment_1.'
INFO:apache_beam.utils.subprocess_server:b'21/09/04 12:17:00 INFO org.apache.beam.runners.fnexecution.artifact.ArtifactStagingService: Getting 1 artifacts for job_c59e24f1-8a83-479c-8ad0-067f2dfa45cd.null.'
INFO:apache_beam.utils.subprocess_server:b'21/09/04 12:17:00 INFO org.apache.beam.runners.fnexecution.artifact.ArtifactStagingService: Artifacts fully staged for job_c59e24f1-8a83-479c-8ad0-067f2dfa45cd.'
INFO:apache_beam.utils.subprocess_server:b'21/09/04 12:17:01 INFO org.apache.beam.runners.spark.SparkJobInvoker: Invoking job BeamApp-jenkins-0904121701-cf86ae7_c1a415dd-32b1-489b-99e7-376499a25d3f'
INFO:apache_beam.utils.subprocess_server:b'21/09/04 12:17:01 INFO org.apache.beam.runners.jobsubmission.JobInvocation: Starting job invocation BeamApp-jenkins-0904121701-cf86ae7_c1a415dd-32b1-489b-99e7-376499a25d3f'
INFO:apache_beam.runners.portability.portable_runner:Environment "LOOPBACK" has started a component necessary for the execution. Be sure to run the pipeline using
  with Pipeline() as p:
    p.apply(..)
This ensures that the pipeline finishes before this program exits.
INFO:apache_beam.runners.portability.portable_runner:Job state changed to STOPPED
INFO:apache_beam.runners.portability.portable_runner:Job state changed to STARTING
INFO:apache_beam.runners.portability.portable_runner:Job state changed to RUNNING
INFO:apache_beam.utils.subprocess_server:b'21/09/04 12:17:01 INFO org.apache.beam.runners.spark.translation.SparkContextFactory: Creating a brand new Spark Context.'
INFO:apache_beam.utils.subprocess_server:b'21/09/04 12:17:01 WARN org.apache.hadoop.util.NativeCodeLoader: Unable to load native-hadoop library for your platform... using builtin-java classes where applicable'
INFO:apache_beam.utils.subprocess_server:b'21/09/04 12:17:02 INFO org.apache.beam.runners.spark.aggregators.AggregatorsAccumulator: Instantiated aggregators accumulator:'
INFO:apache_beam.utils.subprocess_server:b'21/09/04 12:17:02 INFO org.apache.beam.runners.spark.metrics.MetricsAccumulator: Instantiated metrics accumulator: MetricQueryResults()'
INFO:apache_beam.utils.subprocess_server:b'21/09/04 12:17:02 INFO org.apache.beam.runners.spark.SparkPipelineRunner: Running job BeamApp-jenkins-0904121701-cf86ae7_c1a415dd-32b1-489b-99e7-376499a25d3f on Spark master local[4]'
INFO:apache_beam.runners.worker.statecache:Creating state cache with size 0
INFO:apache_beam.runners.worker.sdk_worker:Creating insecure control channel for localhost:39683.
INFO:apache_beam.runners.worker.sdk_worker:Control channel established.
INFO:apache_beam.runners.worker.sdk_worker:Initializing SDKHarness with unbounded number of workers.
INFO:apache_beam.utils.subprocess_server:b'21/09/04 12:17:03 INFO org.apache.beam.runners.fnexecution.control.FnApiControlClientPoolService: Beam Fn Control client connected with id 1-1'
INFO:apache_beam.utils.subprocess_server:b'21/09/04 12:17:03 INFO org.apache.beam.runners.fnexecution.control.FnApiControlClientPoolService: getProcessBundleDescriptor request with id 1-2'
INFO:apache_beam.runners.worker.sdk_worker:Creating insecure state channel for localhost:36421.
INFO:apache_beam.runners.worker.sdk_worker:State channel established.
INFO:apache_beam.runners.worker.data_plane:Creating client data channel for localhost:41205
INFO:apache_beam.utils.subprocess_server:b'21/09/04 12:17:03 INFO org.apache.beam.runners.fnexecution.data.GrpcDataService: Beam Fn Data client connected.'
INFO:apache_beam.utils.subprocess_server:b'21/09/04 12:17:03 INFO org.apache.beam.runners.fnexecution.control.FnApiControlClientPoolService: getProcessBundleDescriptor request with id 1-3'
INFO:apache_beam.utils.subprocess_server:b'21/09/04 12:17:03 WARN org.apache.beam.runners.spark.translation.GroupNonMergingWindowsFunctions: Either coder LengthPrefixCoder(ByteArrayCoder) or GlobalWindow$Coder is not consistent with equals. That might cause issues on some runners.'
INFO:apache_beam.utils.subprocess_server:b'21/09/04 12:17:03 INFO org.apache.beam.runners.fnexecution.control.FnApiControlClientPoolService: getProcessBundleDescriptor request with id 1-4'
INFO:apache_beam.utils.subprocess_server:b'21/09/04 12:17:03 INFO org.apache.beam.runners.fnexecution.control.FnApiControlClientPoolService: getProcessBundleDescriptor request with id 1-5'
INFO:apache_beam.utils.subprocess_server:b'21/09/04 12:17:03 INFO org.apache.beam.runners.fnexecution.control.FnApiControlClientPoolService: getProcessBundleDescriptor request with id 1-6'
INFO:apache_beam.utils.subprocess_server:b'21/09/04 12:17:03 INFO org.apache.beam.runners.fnexecution.control.FnApiControlClientPoolService: getProcessBundleDescriptor request with id 1-7'
INFO:apache_beam.utils.subprocess_server:b'21/09/04 12:17:03 INFO org.apache.beam.runners.fnexecution.control.FnApiControlClientPoolService: getProcessBundleDescriptor request with id 1-9'
INFO:apache_beam.utils.subprocess_server:b'21/09/04 12:17:03 INFO org.apache.beam.runners.fnexecution.control.FnApiControlClientPoolService: getProcessBundleDescriptor request with id 1-8'
INFO:apache_beam.utils.subprocess_server:b'21/09/04 12:17:03 INFO org.apache.beam.runners.fnexecution.control.FnApiControlClientPoolService: getProcessBundleDescriptor request with id 1-10'
INFO:apache_beam.utils.subprocess_server:b'21/09/04 12:17:03 INFO org.apache.beam.runners.fnexecution.control.FnApiControlClientPoolService: getProcessBundleDescriptor request with id 1-11'
INFO:apache_beam.utils.subprocess_server:b'21/09/04 12:17:03 INFO org.apache.beam.runners.fnexecution.control.FnApiControlClientPoolService: getProcessBundleDescriptor request with id 1-13'
INFO:apache_beam.utils.subprocess_server:b'21/09/04 12:17:03 INFO org.apache.beam.runners.fnexecution.control.FnApiControlClientPoolService: getProcessBundleDescriptor request with id 1-12'
INFO:apache_beam.utils.subprocess_server:b'21/09/04 12:17:04 INFO org.apache.beam.runners.fnexecution.control.FnApiControlClientPoolService: getProcessBundleDescriptor request with id 1-14'
INFO:apache_beam.utils.subprocess_server:b'21/09/04 12:17:04 INFO org.apache.beam.runners.fnexecution.control.FnApiControlClientPoolService: getProcessBundleDescriptor request with id 1-15'
INFO:apache_beam.utils.subprocess_server:b'21/09/04 12:17:04 INFO org.apache.beam.runners.spark.SparkPipelineRunner: Job BeamApp-jenkins-0904121701-cf86ae7_c1a415dd-32b1-489b-99e7-376499a25d3f: Pipeline translated successfully. Computing outputs'
INFO:apache_beam.utils.subprocess_server:b'21/09/04 12:17:04 INFO org.apache.beam.runners.fnexecution.control.FnApiControlClientPoolService: getProcessBundleDescriptor request with id 1-16'
INFO:apache_beam.io.filebasedsink:Starting finalize_write threads with num_shards: 4 (skipped: 0), batches: 4, num_threads: 4
INFO:apache_beam.io.filebasedsink:Renamed 4 shards in 0.01 seconds.
INFO:apache_beam.utils.subprocess_server:b'21/09/04 12:17:04 INFO org.apache.beam.runners.spark.SparkPipelineRunner: Job BeamApp-jenkins-0904121701-cf86ae7_c1a415dd-32b1-489b-99e7-376499a25d3f finished.'
INFO:apache_beam.runners.portability.portable_runner:Job state changed to DONE
Exception in thread run_worker_1-1:
Traceback (most recent call last):
  File "/usr/lib/python3.8/threading.py", line 932, in _bootstrap_inner
Exception in thread read_state:
Traceback (most recent call last):
  File "/usr/lib/python3.8/threading.py", line 932, in _bootstrap_inner
    self.run()
  File "/usr/lib/python3.8/threading.py", line 870, in run
    self._target(*self._args, **self._kwargs)
  File "<https://ci-beam.apache.org/job/beam_PostCommit_Python38/ws/src/sdks/python/apache_beam/runners/worker/sdk_worker.py",> line 251, in run
    for work_request in self._control_stub.Control(get_responses()):
  File "<https://ci-beam.apache.org/job/beam_PostCommit_Python38/ws/src/build/gradleenv/2022703442/lib/python3.8/site-packages/grpc/_channel.py",> line 426, in __next__
    self.run()
  File "/usr/lib/python3.8/threading.py", line 870, in run
    return self._next()
  File "<https://ci-beam.apache.org/job/beam_PostCommit_Python38/ws/src/build/gradleenv/2022703442/lib/python3.8/site-packages/grpc/_channel.py",> line 826, in _next
    self._target(*self._args, **self._kwargs)
  File "<https://ci-beam.apache.org/job/beam_PostCommit_Python38/ws/src/sdks/python/apache_beam/runners/worker/sdk_worker.py",> line 1038, in pull_responses
    raise self
grpc._channel._MultiThreadedRendezvous: <_MultiThreadedRendezvous of RPC that terminated with:
	status = StatusCode.UNAVAILABLE
	details = "Connection reset by peer"
	debug_error_string = "{"created":"@1630757824.725541258","description":"Error received from peer ipv4:127.0.0.1:39683","file":"src/core/lib/surface/call.cc","file_line":1069,"grpc_message":"Connection reset by peer","grpc_status":14}"
>
    for response in responses:
  File "<https://ci-beam.apache.org/job/beam_PostCommit_Python38/ws/src/build/gradleenv/2022703442/lib/python3.8/site-packages/grpc/_channel.py",> line 426, in __next__
    return self._next()
  File "<https://ci-beam.apache.org/job/beam_PostCommit_Python38/ws/src/build/gradleenv/2022703442/lib/python3.8/site-packages/grpc/_channel.py",> line 826, in _next
ERROR:apache_beam.runners.worker.data_plane:Failed to read inputs in the data plane.
Traceback (most recent call last):
  File "<https://ci-beam.apache.org/job/beam_PostCommit_Python38/ws/src/sdks/python/apache_beam/runners/worker/data_plane.py",> line 642, in _read_inputs
    for elements in elements_iterator:
  File "<https://ci-beam.apache.org/job/beam_PostCommit_Python38/ws/src/build/gradleenv/2022703442/lib/python3.8/site-packages/grpc/_channel.py",> line 426, in __next__
    return self._next()
  File "<https://ci-beam.apache.org/job/beam_PostCommit_Python38/ws/src/build/gradleenv/2022703442/lib/python3.8/site-packages/grpc/_channel.py",> line 826, in _next
    raise self
grpc._channel._MultiThreadedRendezvous: <_MultiThreadedRendezvous of RPC that terminated with:
	status = StatusCode.UNAVAILABLE
	details = "Connection reset by peer"
	debug_error_string = "{"created":"@1630757824.725509622","description":"Error received from peer ipv4:127.0.0.1:41205","file":"src/core/lib/surface/call.cc","file_line":1069,"grpc_message":"Connection reset by peer","grpc_status":14}"
>
    raise self
grpc._channel._MultiThreadedRendezvous: <_MultiThreadedRendezvous of RPC that terminated with:
	status = StatusCode.UNAVAILABLE
	details = "Connection reset by peer"
	debug_error_string = "{"created":"@1630757824.725532506","description":"Error received from peer ipv4:127.0.0.1:36421","file":"src/core/lib/surface/call.cc","file_line":1069,"grpc_message":"Connection reset by peer","grpc_status":14}"
>
Exception in thread read_grpc_client_inputs:
Traceback (most recent call last):
  File "/usr/lib/python3.8/threading.py", line 932, in _bootstrap_inner
    self.run()
  File "/usr/lib/python3.8/threading.py", line 870, in run
    self._target(*self._args, **self._kwargs)
  File "<https://ci-beam.apache.org/job/beam_PostCommit_Python38/ws/src/sdks/python/apache_beam/runners/worker/data_plane.py",> line 659, in <lambda>
    target=lambda: self._read_inputs(elements_iterator),
  File "<https://ci-beam.apache.org/job/beam_PostCommit_Python38/ws/src/sdks/python/apache_beam/runners/worker/data_plane.py",> line 642, in _read_inputs
    for elements in elements_iterator:
  File "<https://ci-beam.apache.org/job/beam_PostCommit_Python38/ws/src/build/gradleenv/2022703442/lib/python3.8/site-packages/grpc/_channel.py",> line 426, in __next__
    return self._next()
  File "<https://ci-beam.apache.org/job/beam_PostCommit_Python38/ws/src/build/gradleenv/2022703442/lib/python3.8/site-packages/grpc/_channel.py",> line 826, in _next
    raise self
grpc._channel._MultiThreadedRendezvous: <_MultiThreadedRendezvous of RPC that terminated with:
	status = StatusCode.UNAVAILABLE
	details = "Connection reset by peer"
	debug_error_string = "{"created":"@1630757824.725509622","description":"Error received from peer ipv4:127.0.0.1:41205","file":"src/core/lib/surface/call.cc","file_line":1069,"grpc_message":"Connection reset by peer","grpc_status":14}"
>

> Task :sdks:python:test-suites:portable:py38:postCommitPy38
> Task :sdks:python:test-suites:dataflow:py38:postCommitIT FAILED

FAILURE: Build completed with 2 failures.

1: Task failed with an exception.
-----------
* Where:
Script '<https://ci-beam.apache.org/job/beam_PostCommit_Python38/ws/src/sdks/python/test-suites/direct/common.gradle'> line: 143

* What went wrong:
Execution failed for task ':sdks:python:test-suites:direct:py38:hdfsIntegrationTest'.
> Process 'command 'sh'' finished with non-zero exit value 1

* Try:
Run with --stacktrace option to get the stack trace. Run with --info or --debug option to get more log output. Run with --scan to get full insights.
==============================================================================

2: Task failed with an exception.
-----------
* Where:
Script '<https://ci-beam.apache.org/job/beam_PostCommit_Python38/ws/src/sdks/python/test-suites/dataflow/common.gradle'> line: 120

* What went wrong:
Execution failed for task ':sdks:python:test-suites:dataflow:py38:postCommitIT'.
> Process 'command 'sh'' finished with non-zero exit value 1

* Try:
Run with --stacktrace option to get the stack trace. Run with --info or --debug option to get more log output. Run with --scan to get full insights.
==============================================================================

* Get more help at https://help.gradle.org

Deprecated Gradle features were used in this build, making it incompatible with Gradle 7.0.
Use '--warning-mode all' to show the individual deprecation warnings.
See https://docs.gradle.org/6.8.3/userguide/command_line_interface.html#sec:command_line_warnings

BUILD FAILED in 1h 39m 27s
212 actionable tasks: 148 executed, 60 from cache, 4 up-to-date

Publishing build scan...
https://gradle.com/s/l6irps4ysrgq2

Build step 'Invoke Gradle script' changed build result to FAILURE
Build step 'Invoke Gradle script' marked build as failure

---------------------------------------------------------------------
To unsubscribe, e-mail: builds-unsubscribe@beam.apache.org
For additional commands, e-mail: builds-help@beam.apache.org


Jenkins build is back to normal : beam_PostCommit_Python38 #1641

Posted by Apache Jenkins Server <je...@builds.apache.org>.
See <https://ci-beam.apache.org/job/beam_PostCommit_Python38/1641/display/redirect>


---------------------------------------------------------------------
To unsubscribe, e-mail: builds-unsubscribe@beam.apache.org
For additional commands, e-mail: builds-help@beam.apache.org