You are viewing a plain text version of this content. The canonical link for it is here.
Posted to dev@lucene.apache.org by Policeman Jenkins Server <je...@thetaphi.de> on 2018/03/12 20:58:29 UTC

[JENKINS-EA] Lucene-Solr-7.x-Linux (64bit/jdk-10-ea+43) - Build # 1520 - Unstable!

Error processing tokens: Error while parsing action 'Text/ZeroOrMore/FirstOf/Token/DelimitedToken/DelimitedToken_Action3' at input position (line 79, pos 4):
)"}
   ^

java.lang.OutOfMemoryError: Java heap space

[JENKINS] Lucene-Solr-7.x-Linux (64bit/jdk-9.0.4) - Build # 1521 - Still Unstable!

Posted by Policeman Jenkins Server <je...@thetaphi.de>.
Build: https://jenkins.thetaphi.de/job/Lucene-Solr-7.x-Linux/1521/
Java: 64bit/jdk-9.0.4 -XX:-UseCompressedOops -XX:+UseG1GC

5 tests failed.
FAILED:  junit.framework.TestSuite.org.apache.solr.cloud.autoscaling.TriggerIntegrationTest

Error Message:
ObjectTracker found 1 object(s) that were not released!!! [SolrZkClient] org.apache.solr.common.util.ObjectReleaseTracker$ObjectTrackerException: org.apache.solr.common.cloud.SolrZkClient  at org.apache.solr.common.util.ObjectReleaseTracker.track(ObjectReleaseTracker.java:42)  at org.apache.solr.common.cloud.SolrZkClient.<init>(SolrZkClient.java:185)  at org.apache.solr.common.cloud.SolrZkClient.<init>(SolrZkClient.java:120)  at org.apache.solr.common.cloud.SolrZkClient.<init>(SolrZkClient.java:110)  at org.apache.solr.common.cloud.ZkStateReader.<init>(ZkStateReader.java:285)  at org.apache.solr.client.solrj.impl.ZkClientClusterStateProvider.connect(ZkClientClusterStateProvider.java:155)  at org.apache.solr.client.solrj.impl.CloudSolrClient.getZkStateReader(CloudSolrClient.java:342)  at org.apache.solr.client.solrj.impl.SolrClientNodeStateProvider.<init>(SolrClientNodeStateProvider.java:80)  at org.apache.solr.client.solrj.impl.SolrClientCloudManager.getNodeStateProvider(SolrClientCloudManager.java:104)  at org.apache.solr.cloud.autoscaling.MetricTrigger.run(MetricTrigger.java:143)  at org.apache.solr.cloud.autoscaling.ScheduledTriggers$TriggerWrapper.run(ScheduledTriggers.java:572)  at java.base/java.util.concurrent.Executors$RunnableAdapter.call(Executors.java:514)  at java.base/java.util.concurrent.FutureTask.runAndReset(FutureTask.java:305)  at java.base/java.util.concurrent.ScheduledThreadPoolExecutor$ScheduledFutureTask.run(ScheduledThreadPoolExecutor.java:300)  at java.base/java.util.concurrent.ThreadPoolExecutor.runWorker(ThreadPoolExecutor.java:1167)  at java.base/java.util.concurrent.ThreadPoolExecutor$Worker.run(ThreadPoolExecutor.java:641)  at java.base/java.lang.Thread.run(Thread.java:844)  

Stack Trace:
java.lang.AssertionError: ObjectTracker found 1 object(s) that were not released!!! [SolrZkClient]
org.apache.solr.common.util.ObjectReleaseTracker$ObjectTrackerException: org.apache.solr.common.cloud.SolrZkClient
	at org.apache.solr.common.util.ObjectReleaseTracker.track(ObjectReleaseTracker.java:42)
	at org.apache.solr.common.cloud.SolrZkClient.<init>(SolrZkClient.java:185)
	at org.apache.solr.common.cloud.SolrZkClient.<init>(SolrZkClient.java:120)
	at org.apache.solr.common.cloud.SolrZkClient.<init>(SolrZkClient.java:110)
	at org.apache.solr.common.cloud.ZkStateReader.<init>(ZkStateReader.java:285)
	at org.apache.solr.client.solrj.impl.ZkClientClusterStateProvider.connect(ZkClientClusterStateProvider.java:155)
	at org.apache.solr.client.solrj.impl.CloudSolrClient.getZkStateReader(CloudSolrClient.java:342)
	at org.apache.solr.client.solrj.impl.SolrClientNodeStateProvider.<init>(SolrClientNodeStateProvider.java:80)
	at org.apache.solr.client.solrj.impl.SolrClientCloudManager.getNodeStateProvider(SolrClientCloudManager.java:104)
	at org.apache.solr.cloud.autoscaling.MetricTrigger.run(MetricTrigger.java:143)
	at org.apache.solr.cloud.autoscaling.ScheduledTriggers$TriggerWrapper.run(ScheduledTriggers.java:572)
	at java.base/java.util.concurrent.Executors$RunnableAdapter.call(Executors.java:514)
	at java.base/java.util.concurrent.FutureTask.runAndReset(FutureTask.java:305)
	at java.base/java.util.concurrent.ScheduledThreadPoolExecutor$ScheduledFutureTask.run(ScheduledThreadPoolExecutor.java:300)
	at java.base/java.util.concurrent.ThreadPoolExecutor.runWorker(ThreadPoolExecutor.java:1167)
	at java.base/java.util.concurrent.ThreadPoolExecutor$Worker.run(ThreadPoolExecutor.java:641)
	at java.base/java.lang.Thread.run(Thread.java:844)


	at __randomizedtesting.SeedInfo.seed([37322C213120DB0F]:0)
	at org.junit.Assert.fail(Assert.java:93)
	at org.junit.Assert.assertTrue(Assert.java:43)
	at org.junit.Assert.assertNull(Assert.java:551)
	at org.apache.solr.SolrTestCaseJ4.teardownTestCases(SolrTestCaseJ4.java:301)
	at jdk.internal.reflect.GeneratedMethodAccessor76.invoke(Unknown Source)
	at java.base/jdk.internal.reflect.DelegatingMethodAccessorImpl.invoke(DelegatingMethodAccessorImpl.java:43)
	at java.base/java.lang.reflect.Method.invoke(Method.java:564)
	at com.carrotsearch.randomizedtesting.RandomizedRunner.invoke(RandomizedRunner.java:1737)
	at com.carrotsearch.randomizedtesting.RandomizedRunner$7.evaluate(RandomizedRunner.java:897)
	at com.carrotsearch.randomizedtesting.rules.StatementAdapter.evaluate(StatementAdapter.java:36)
	at com.carrotsearch.randomizedtesting.rules.SystemPropertiesRestoreRule$1.evaluate(SystemPropertiesRestoreRule.java:57)
	at org.apache.lucene.util.AbstractBeforeAfterRule$1.evaluate(AbstractBeforeAfterRule.java:45)
	at com.carrotsearch.randomizedtesting.rules.StatementAdapter.evaluate(StatementAdapter.java:36)
	at org.apache.lucene.util.TestRuleStoreClassName$1.evaluate(TestRuleStoreClassName.java:41)
	at com.carrotsearch.randomizedtesting.rules.NoShadowingOrOverridesOnMethodsRule$1.evaluate(NoShadowingOrOverridesOnMethodsRule.java:40)
	at com.carrotsearch.randomizedtesting.rules.NoShadowingOrOverridesOnMethodsRule$1.evaluate(NoShadowingOrOverridesOnMethodsRule.java:40)
	at com.carrotsearch.randomizedtesting.rules.StatementAdapter.evaluate(StatementAdapter.java:36)
	at com.carrotsearch.randomizedtesting.rules.StatementAdapter.evaluate(StatementAdapter.java:36)
	at org.apache.lucene.util.TestRuleAssertionsRequired$1.evaluate(TestRuleAssertionsRequired.java:53)
	at org.apache.lucene.util.TestRuleMarkFailure$1.evaluate(TestRuleMarkFailure.java:47)
	at org.apache.lucene.util.TestRuleIgnoreAfterMaxFailures$1.evaluate(TestRuleIgnoreAfterMaxFailures.java:64)
	at org.apache.lucene.util.TestRuleIgnoreTestSuites$1.evaluate(TestRuleIgnoreTestSuites.java:54)
	at com.carrotsearch.randomizedtesting.rules.StatementAdapter.evaluate(StatementAdapter.java:36)
	at com.carrotsearch.randomizedtesting.ThreadLeakControl$StatementRunner.run(ThreadLeakControl.java:368)
	at java.base/java.lang.Thread.run(Thread.java:844)


FAILED:  junit.framework.TestSuite.org.apache.solr.cloud.autoscaling.TriggerIntegrationTest

Error Message:
3 threads leaked from SUITE scope at org.apache.solr.cloud.autoscaling.TriggerIntegrationTest:     1) Thread[id=23997, name=ScheduledTrigger-8828-thread-1-SendThread(127.0.0.1:39071), state=TIMED_WAITING, group=TGRP-TriggerIntegrationTest]         at java.base@9.0.4/java.lang.Thread.sleep(Native Method)         at app//org.apache.zookeeper.client.StaticHostProvider.next(StaticHostProvider.java:105)         at app//org.apache.zookeeper.ClientCnxn$SendThread.startConnect(ClientCnxn.java:1000)         at app//org.apache.zookeeper.ClientCnxn$SendThread.run(ClientCnxn.java:1063)    2) Thread[id=23999, name=zkConnectionManagerCallback-5588-thread-1, state=WAITING, group=TGRP-TriggerIntegrationTest]         at java.base@9.0.4/jdk.internal.misc.Unsafe.park(Native Method)         at java.base@9.0.4/java.util.concurrent.locks.LockSupport.park(LockSupport.java:194)         at java.base@9.0.4/java.util.concurrent.locks.AbstractQueuedSynchronizer$ConditionObject.await(AbstractQueuedSynchronizer.java:2062)         at java.base@9.0.4/java.util.concurrent.LinkedBlockingQueue.take(LinkedBlockingQueue.java:435)         at java.base@9.0.4/java.util.concurrent.ThreadPoolExecutor.getTask(ThreadPoolExecutor.java:1092)         at java.base@9.0.4/java.util.concurrent.ThreadPoolExecutor.runWorker(ThreadPoolExecutor.java:1152)         at java.base@9.0.4/java.util.concurrent.ThreadPoolExecutor$Worker.run(ThreadPoolExecutor.java:641)         at java.base@9.0.4/java.lang.Thread.run(Thread.java:844)    3) Thread[id=23998, name=ScheduledTrigger-8828-thread-1-EventThread, state=WAITING, group=TGRP-TriggerIntegrationTest]         at java.base@9.0.4/jdk.internal.misc.Unsafe.park(Native Method)         at java.base@9.0.4/java.util.concurrent.locks.LockSupport.park(LockSupport.java:194)         at java.base@9.0.4/java.util.concurrent.locks.AbstractQueuedSynchronizer$ConditionObject.await(AbstractQueuedSynchronizer.java:2062)         at java.base@9.0.4/java.util.concurrent.LinkedBlockingQueue.take(LinkedBlockingQueue.java:435)         at app//org.apache.zookeeper.ClientCnxn$EventThread.run(ClientCnxn.java:502)

Stack Trace:
com.carrotsearch.randomizedtesting.ThreadLeakError: 3 threads leaked from SUITE scope at org.apache.solr.cloud.autoscaling.TriggerIntegrationTest: 
   1) Thread[id=23997, name=ScheduledTrigger-8828-thread-1-SendThread(127.0.0.1:39071), state=TIMED_WAITING, group=TGRP-TriggerIntegrationTest]
        at java.base@9.0.4/java.lang.Thread.sleep(Native Method)
        at app//org.apache.zookeeper.client.StaticHostProvider.next(StaticHostProvider.java:105)
        at app//org.apache.zookeeper.ClientCnxn$SendThread.startConnect(ClientCnxn.java:1000)
        at app//org.apache.zookeeper.ClientCnxn$SendThread.run(ClientCnxn.java:1063)
   2) Thread[id=23999, name=zkConnectionManagerCallback-5588-thread-1, state=WAITING, group=TGRP-TriggerIntegrationTest]
        at java.base@9.0.4/jdk.internal.misc.Unsafe.park(Native Method)
        at java.base@9.0.4/java.util.concurrent.locks.LockSupport.park(LockSupport.java:194)
        at java.base@9.0.4/java.util.concurrent.locks.AbstractQueuedSynchronizer$ConditionObject.await(AbstractQueuedSynchronizer.java:2062)
        at java.base@9.0.4/java.util.concurrent.LinkedBlockingQueue.take(LinkedBlockingQueue.java:435)
        at java.base@9.0.4/java.util.concurrent.ThreadPoolExecutor.getTask(ThreadPoolExecutor.java:1092)
        at java.base@9.0.4/java.util.concurrent.ThreadPoolExecutor.runWorker(ThreadPoolExecutor.java:1152)
        at java.base@9.0.4/java.util.concurrent.ThreadPoolExecutor$Worker.run(ThreadPoolExecutor.java:641)
        at java.base@9.0.4/java.lang.Thread.run(Thread.java:844)
   3) Thread[id=23998, name=ScheduledTrigger-8828-thread-1-EventThread, state=WAITING, group=TGRP-TriggerIntegrationTest]
        at java.base@9.0.4/jdk.internal.misc.Unsafe.park(Native Method)
        at java.base@9.0.4/java.util.concurrent.locks.LockSupport.park(LockSupport.java:194)
        at java.base@9.0.4/java.util.concurrent.locks.AbstractQueuedSynchronizer$ConditionObject.await(AbstractQueuedSynchronizer.java:2062)
        at java.base@9.0.4/java.util.concurrent.LinkedBlockingQueue.take(LinkedBlockingQueue.java:435)
        at app//org.apache.zookeeper.ClientCnxn$EventThread.run(ClientCnxn.java:502)
	at __randomizedtesting.SeedInfo.seed([37322C213120DB0F]:0)


FAILED:  junit.framework.TestSuite.org.apache.solr.cloud.autoscaling.TriggerIntegrationTest

Error Message:
There are still zombie threads that couldn't be terminated:    1) Thread[id=23997, name=ScheduledTrigger-8828-thread-1-SendThread(127.0.0.1:39071), state=TIMED_WAITING, group=TGRP-TriggerIntegrationTest]         at java.base@9.0.4/java.lang.Thread.sleep(Native Method)         at app//org.apache.zookeeper.ClientCnxn$SendThread.run(ClientCnxn.java:1054)    2) Thread[id=23999, name=zkConnectionManagerCallback-5588-thread-1, state=WAITING, group=TGRP-TriggerIntegrationTest]         at java.base@9.0.4/jdk.internal.misc.Unsafe.park(Native Method)         at java.base@9.0.4/java.util.concurrent.locks.LockSupport.park(LockSupport.java:194)         at java.base@9.0.4/java.util.concurrent.locks.AbstractQueuedSynchronizer$ConditionObject.await(AbstractQueuedSynchronizer.java:2062)         at java.base@9.0.4/java.util.concurrent.LinkedBlockingQueue.take(LinkedBlockingQueue.java:435)         at java.base@9.0.4/java.util.concurrent.ThreadPoolExecutor.getTask(ThreadPoolExecutor.java:1092)         at java.base@9.0.4/java.util.concurrent.ThreadPoolExecutor.runWorker(ThreadPoolExecutor.java:1152)         at java.base@9.0.4/java.util.concurrent.ThreadPoolExecutor$Worker.run(ThreadPoolExecutor.java:641)         at java.base@9.0.4/java.lang.Thread.run(Thread.java:844)

Stack Trace:
com.carrotsearch.randomizedtesting.ThreadLeakError: There are still zombie threads that couldn't be terminated:
   1) Thread[id=23997, name=ScheduledTrigger-8828-thread-1-SendThread(127.0.0.1:39071), state=TIMED_WAITING, group=TGRP-TriggerIntegrationTest]
        at java.base@9.0.4/java.lang.Thread.sleep(Native Method)
        at app//org.apache.zookeeper.ClientCnxn$SendThread.run(ClientCnxn.java:1054)
   2) Thread[id=23999, name=zkConnectionManagerCallback-5588-thread-1, state=WAITING, group=TGRP-TriggerIntegrationTest]
        at java.base@9.0.4/jdk.internal.misc.Unsafe.park(Native Method)
        at java.base@9.0.4/java.util.concurrent.locks.LockSupport.park(LockSupport.java:194)
        at java.base@9.0.4/java.util.concurrent.locks.AbstractQueuedSynchronizer$ConditionObject.await(AbstractQueuedSynchronizer.java:2062)
        at java.base@9.0.4/java.util.concurrent.LinkedBlockingQueue.take(LinkedBlockingQueue.java:435)
        at java.base@9.0.4/java.util.concurrent.ThreadPoolExecutor.getTask(ThreadPoolExecutor.java:1092)
        at java.base@9.0.4/java.util.concurrent.ThreadPoolExecutor.runWorker(ThreadPoolExecutor.java:1152)
        at java.base@9.0.4/java.util.concurrent.ThreadPoolExecutor$Worker.run(ThreadPoolExecutor.java:641)
        at java.base@9.0.4/java.lang.Thread.run(Thread.java:844)
	at __randomizedtesting.SeedInfo.seed([37322C213120DB0F]:0)


FAILED:  org.apache.solr.cloud.autoscaling.TriggerIntegrationTest.testEventQueue

Error Message:
action wasn't interrupted

Stack Trace:
java.lang.AssertionError: action wasn't interrupted
	at __randomizedtesting.SeedInfo.seed([37322C213120DB0F:FE876E8F38471DFA]:0)
	at org.junit.Assert.fail(Assert.java:93)
	at org.junit.Assert.assertTrue(Assert.java:43)
	at org.apache.solr.cloud.autoscaling.TriggerIntegrationTest.testEventQueue(TriggerIntegrationTest.java:743)
	at java.base/jdk.internal.reflect.NativeMethodAccessorImpl.invoke0(Native Method)
	at java.base/jdk.internal.reflect.NativeMethodAccessorImpl.invoke(NativeMethodAccessorImpl.java:62)
	at java.base/jdk.internal.reflect.DelegatingMethodAccessorImpl.invoke(DelegatingMethodAccessorImpl.java:43)
	at java.base/java.lang.reflect.Method.invoke(Method.java:564)
	at com.carrotsearch.randomizedtesting.RandomizedRunner.invoke(RandomizedRunner.java:1737)
	at com.carrotsearch.randomizedtesting.RandomizedRunner$8.evaluate(RandomizedRunner.java:934)
	at com.carrotsearch.randomizedtesting.RandomizedRunner$9.evaluate(RandomizedRunner.java:970)
	at com.carrotsearch.randomizedtesting.RandomizedRunner$10.evaluate(RandomizedRunner.java:984)
	at com.carrotsearch.randomizedtesting.rules.SystemPropertiesRestoreRule$1.evaluate(SystemPropertiesRestoreRule.java:57)
	at org.apache.lucene.util.TestRuleSetupTeardownChained$1.evaluate(TestRuleSetupTeardownChained.java:49)
	at org.apache.lucene.util.AbstractBeforeAfterRule$1.evaluate(AbstractBeforeAfterRule.java:45)
	at org.apache.lucene.util.TestRuleThreadAndTestName$1.evaluate(TestRuleThreadAndTestName.java:48)
	at org.apache.lucene.util.TestRuleIgnoreAfterMaxFailures$1.evaluate(TestRuleIgnoreAfterMaxFailures.java:64)
	at org.apache.lucene.util.TestRuleMarkFailure$1.evaluate(TestRuleMarkFailure.java:47)
	at com.carrotsearch.randomizedtesting.rules.StatementAdapter.evaluate(StatementAdapter.java:36)
	at com.carrotsearch.randomizedtesting.ThreadLeakControl$StatementRunner.run(ThreadLeakControl.java:368)
	at com.carrotsearch.randomizedtesting.ThreadLeakControl.forkTimeoutingTask(ThreadLeakControl.java:817)
	at com.carrotsearch.randomizedtesting.ThreadLeakControl$3.evaluate(ThreadLeakControl.java:468)
	at com.carrotsearch.randomizedtesting.RandomizedRunner.runSingleTest(RandomizedRunner.java:943)
	at com.carrotsearch.randomizedtesting.RandomizedRunner$5.evaluate(RandomizedRunner.java:829)
	at com.carrotsearch.randomizedtesting.RandomizedRunner$6.evaluate(RandomizedRunner.java:879)
	at com.carrotsearch.randomizedtesting.RandomizedRunner$7.evaluate(RandomizedRunner.java:890)
	at com.carrotsearch.randomizedtesting.rules.StatementAdapter.evaluate(StatementAdapter.java:36)
	at com.carrotsearch.randomizedtesting.rules.SystemPropertiesRestoreRule$1.evaluate(SystemPropertiesRestoreRule.java:57)
	at org.apache.lucene.util.AbstractBeforeAfterRule$1.evaluate(AbstractBeforeAfterRule.java:45)
	at com.carrotsearch.randomizedtesting.rules.StatementAdapter.evaluate(StatementAdapter.java:36)
	at org.apache.lucene.util.TestRuleStoreClassName$1.evaluate(TestRuleStoreClassName.java:41)
	at com.carrotsearch.randomizedtesting.rules.NoShadowingOrOverridesOnMethodsRule$1.evaluate(NoShadowingOrOverridesOnMethodsRule.java:40)
	at com.carrotsearch.randomizedtesting.rules.NoShadowingOrOverridesOnMethodsRule$1.evaluate(NoShadowingOrOverridesOnMethodsRule.java:40)
	at com.carrotsearch.randomizedtesting.rules.StatementAdapter.evaluate(StatementAdapter.java:36)
	at com.carrotsearch.randomizedtesting.rules.StatementAdapter.evaluate(StatementAdapter.java:36)
	at org.apache.lucene.util.TestRuleAssertionsRequired$1.evaluate(TestRuleAssertionsRequired.java:53)
	at org.apache.lucene.util.TestRuleMarkFailure$1.evaluate(TestRuleMarkFailure.java:47)
	at org.apache.lucene.util.TestRuleIgnoreAfterMaxFailures$1.evaluate(TestRuleIgnoreAfterMaxFailures.java:64)
	at org.apache.lucene.util.TestRuleIgnoreTestSuites$1.evaluate(TestRuleIgnoreTestSuites.java:54)
	at com.carrotsearch.randomizedtesting.rules.StatementAdapter.evaluate(StatementAdapter.java:36)
	at com.carrotsearch.randomizedtesting.ThreadLeakControl$StatementRunner.run(ThreadLeakControl.java:368)
	at java.base/java.lang.Thread.run(Thread.java:844)


FAILED:  org.apache.solr.cloud.autoscaling.TriggerIntegrationTest.testEventQueue

Error Message:
action wasn't interrupted

Stack Trace:
java.lang.AssertionError: action wasn't interrupted
	at __randomizedtesting.SeedInfo.seed([37322C213120DB0F:FE876E8F38471DFA]:0)
	at org.junit.Assert.fail(Assert.java:93)
	at org.junit.Assert.assertTrue(Assert.java:43)
	at org.apache.solr.cloud.autoscaling.TriggerIntegrationTest.testEventQueue(TriggerIntegrationTest.java:743)
	at java.base/jdk.internal.reflect.NativeMethodAccessorImpl.invoke0(Native Method)
	at java.base/jdk.internal.reflect.NativeMethodAccessorImpl.invoke(NativeMethodAccessorImpl.java:62)
	at java.base/jdk.internal.reflect.DelegatingMethodAccessorImpl.invoke(DelegatingMethodAccessorImpl.java:43)
	at java.base/java.lang.reflect.Method.invoke(Method.java:564)
	at com.carrotsearch.randomizedtesting.RandomizedRunner.invoke(RandomizedRunner.java:1737)
	at com.carrotsearch.randomizedtesting.RandomizedRunner$8.evaluate(RandomizedRunner.java:934)
	at com.carrotsearch.randomizedtesting.RandomizedRunner$9.evaluate(RandomizedRunner.java:970)
	at com.carrotsearch.randomizedtesting.RandomizedRunner$10.evaluate(RandomizedRunner.java:984)
	at com.carrotsearch.randomizedtesting.rules.SystemPropertiesRestoreRule$1.evaluate(SystemPropertiesRestoreRule.java:57)
	at org.apache.lucene.util.TestRuleSetupTeardownChained$1.evaluate(TestRuleSetupTeardownChained.java:49)
	at org.apache.lucene.util.AbstractBeforeAfterRule$1.evaluate(AbstractBeforeAfterRule.java:45)
	at org.apache.lucene.util.TestRuleThreadAndTestName$1.evaluate(TestRuleThreadAndTestName.java:48)
	at org.apache.lucene.util.TestRuleIgnoreAfterMaxFailures$1.evaluate(TestRuleIgnoreAfterMaxFailures.java:64)
	at org.apache.lucene.util.TestRuleMarkFailure$1.evaluate(TestRuleMarkFailure.java:47)
	at com.carrotsearch.randomizedtesting.rules.StatementAdapter.evaluate(StatementAdapter.java:36)
	at com.carrotsearch.randomizedtesting.ThreadLeakControl$StatementRunner.run(ThreadLeakControl.java:368)
	at com.carrotsearch.randomizedtesting.ThreadLeakControl.forkTimeoutingTask(ThreadLeakControl.java:817)
	at com.carrotsearch.randomizedtesting.ThreadLeakControl$3.evaluate(ThreadLeakControl.java:468)
	at com.carrotsearch.randomizedtesting.RandomizedRunner.runSingleTest(RandomizedRunner.java:943)
	at com.carrotsearch.randomizedtesting.RandomizedRunner$5.evaluate(RandomizedRunner.java:829)
	at com.carrotsearch.randomizedtesting.RandomizedRunner$6.evaluate(RandomizedRunner.java:879)
	at com.carrotsearch.randomizedtesting.RandomizedRunner$7.evaluate(RandomizedRunner.java:890)
	at com.carrotsearch.randomizedtesting.rules.StatementAdapter.evaluate(StatementAdapter.java:36)
	at com.carrotsearch.randomizedtesting.rules.SystemPropertiesRestoreRule$1.evaluate(SystemPropertiesRestoreRule.java:57)
	at org.apache.lucene.util.AbstractBeforeAfterRule$1.evaluate(AbstractBeforeAfterRule.java:45)
	at com.carrotsearch.randomizedtesting.rules.StatementAdapter.evaluate(StatementAdapter.java:36)
	at org.apache.lucene.util.TestRuleStoreClassName$1.evaluate(TestRuleStoreClassName.java:41)
	at com.carrotsearch.randomizedtesting.rules.NoShadowingOrOverridesOnMethodsRule$1.evaluate(NoShadowingOrOverridesOnMethodsRule.java:40)
	at com.carrotsearch.randomizedtesting.rules.NoShadowingOrOverridesOnMethodsRule$1.evaluate(NoShadowingOrOverridesOnMethodsRule.java:40)
	at com.carrotsearch.randomizedtesting.rules.StatementAdapter.evaluate(StatementAdapter.java:36)
	at com.carrotsearch.randomizedtesting.rules.StatementAdapter.evaluate(StatementAdapter.java:36)
	at org.apache.lucene.util.TestRuleAssertionsRequired$1.evaluate(TestRuleAssertionsRequired.java:53)
	at org.apache.lucene.util.TestRuleMarkFailure$1.evaluate(TestRuleMarkFailure.java:47)
	at org.apache.lucene.util.TestRuleIgnoreAfterMaxFailures$1.evaluate(TestRuleIgnoreAfterMaxFailures.java:64)
	at org.apache.lucene.util.TestRuleIgnoreTestSuites$1.evaluate(TestRuleIgnoreTestSuites.java:54)
	at com.carrotsearch.randomizedtesting.rules.StatementAdapter.evaluate(StatementAdapter.java:36)
	at com.carrotsearch.randomizedtesting.ThreadLeakControl$StatementRunner.run(ThreadLeakControl.java:368)
	at java.base/java.lang.Thread.run(Thread.java:844)




Build Log:
[...truncated 14650 lines...]
   [junit4] Suite: org.apache.solr.cloud.autoscaling.TriggerIntegrationTest
   [junit4]   2> 1783295 INFO  (SUITE-TriggerIntegrationTest-seed#[37322C213120DB0F]-worker) [    ] o.a.s.SolrTestCaseJ4 SecureRandom sanity checks: test.solr.allowed.securerandom=null & java.security.egd=file:/dev/./urandom
   [junit4]   2> Creating dataDir: /home/jenkins/workspace/Lucene-Solr-7.x-Linux/solr/build/solr-core/test/J1/temp/solr.cloud.autoscaling.TriggerIntegrationTest_37322C213120DB0F-001/init-core-data-001
   [junit4]   2> 1783296 INFO  (SUITE-TriggerIntegrationTest-seed#[37322C213120DB0F]-worker) [    ] o.a.s.SolrTestCaseJ4 Using PointFields (NUMERIC_POINTS_SYSPROP=true) w/NUMERIC_DOCVALUES_SYSPROP=false
   [junit4]   2> 1783296 INFO  (SUITE-TriggerIntegrationTest-seed#[37322C213120DB0F]-worker) [    ] o.a.s.SolrTestCaseJ4 Randomized ssl (false) and clientAuth (false) via: @org.apache.solr.util.RandomizeSSL(reason="", ssl=0.0/0.0, value=0.0/0.0, clientAuth=0.0/0.0)
   [junit4]   2> 1783297 INFO  (SUITE-TriggerIntegrationTest-seed#[37322C213120DB0F]-worker) [    ] o.a.s.c.MiniSolrCloudCluster Starting cluster of 2 servers in /home/jenkins/workspace/Lucene-Solr-7.x-Linux/solr/build/solr-core/test/J1/temp/solr.cloud.autoscaling.TriggerIntegrationTest_37322C213120DB0F-001/tempDir-001
   [junit4]   2> 1783297 INFO  (SUITE-TriggerIntegrationTest-seed#[37322C213120DB0F]-worker) [    ] o.a.s.c.ZkTestServer STARTING ZK TEST SERVER
   [junit4]   2> 1783297 INFO  (Thread-6093) [    ] o.a.s.c.ZkTestServer client port:0.0.0.0/0.0.0.0:0
   [junit4]   2> 1783297 INFO  (Thread-6093) [    ] o.a.s.c.ZkTestServer Starting server
   [junit4]   2> 1783299 ERROR (Thread-6093) [    ] o.a.z.s.ZooKeeperServer ZKShutdownHandler is not registered, so ZooKeeper server won't take any action on ERROR or SHUTDOWN server state changes
   [junit4]   2> 1783397 INFO  (SUITE-TriggerIntegrationTest-seed#[37322C213120DB0F]-worker) [    ] o.a.s.c.ZkTestServer start zk server on port:39071
   [junit4]   2> 1783398 INFO  (zkConnectionManagerCallback-5321-thread-1) [    ] o.a.s.c.c.ConnectionManager zkClient has connected
   [junit4]   2> 1783400 INFO  (jetty-launcher-5318-thread-2) [    ] o.e.j.s.Server jetty-9.4.8.v20171121, build timestamp: 2017-11-21T12:27:37-09:00, git hash: 82b8fb23f757335bb3329d540ce37a2a2615f0a8
   [junit4]   2> 1783400 INFO  (jetty-launcher-5318-thread-1) [    ] o.e.j.s.Server jetty-9.4.8.v20171121, build timestamp: 2017-11-21T12:27:37-09:00, git hash: 82b8fb23f757335bb3329d540ce37a2a2615f0a8
   [junit4]   2> 1783402 INFO  (jetty-launcher-5318-thread-2) [    ] o.e.j.s.session DefaultSessionIdManager workerName=node0
   [junit4]   2> 1783402 INFO  (jetty-launcher-5318-thread-1) [    ] o.e.j.s.session DefaultSessionIdManager workerName=node0
   [junit4]   2> 1783402 INFO  (jetty-launcher-5318-thread-2) [    ] o.e.j.s.session No SessionScavenger set, using defaults
   [junit4]   2> 1783402 INFO  (jetty-launcher-5318-thread-1) [    ] o.e.j.s.session No SessionScavenger set, using defaults
   [junit4]   2> 1783402 INFO  (jetty-launcher-5318-thread-2) [    ] o.e.j.s.session Scavenging every 600000ms
   [junit4]   2> 1783402 INFO  (jetty-launcher-5318-thread-1) [    ] o.e.j.s.session Scavenging every 600000ms
   [junit4]   2> 1783402 INFO  (jetty-launcher-5318-thread-1) [    ] o.e.j.s.h.ContextHandler Started o.e.j.s.ServletContextHandler@6b397a59{/solr,null,AVAILABLE}
   [junit4]   2> 1783402 INFO  (jetty-launcher-5318-thread-2) [    ] o.e.j.s.h.ContextHandler Started o.e.j.s.ServletContextHandler@46eb2bea{/solr,null,AVAILABLE}
   [junit4]   2> 1783403 INFO  (jetty-launcher-5318-thread-1) [    ] o.e.j.s.AbstractConnector Started ServerConnector@32123106{HTTP/1.1,[http/1.1]}{127.0.0.1:34681}
   [junit4]   2> 1783403 INFO  (jetty-launcher-5318-thread-2) [    ] o.e.j.s.AbstractConnector Started ServerConnector@2c7da1c{HTTP/1.1,[http/1.1]}{127.0.0.1:45477}
   [junit4]   2> 1783403 INFO  (jetty-launcher-5318-thread-1) [    ] o.e.j.s.Server Started @1785263ms
   [junit4]   2> 1783403 INFO  (jetty-launcher-5318-thread-2) [    ] o.e.j.s.Server Started @1785263ms
   [junit4]   2> 1783403 INFO  (jetty-launcher-5318-thread-1) [    ] o.a.s.c.s.e.JettySolrRunner Jetty properties: {hostContext=/solr, hostPort=34681}
   [junit4]   2> 1783403 INFO  (jetty-launcher-5318-thread-2) [    ] o.a.s.c.s.e.JettySolrRunner Jetty properties: {hostContext=/solr, hostPort=45477}
   [junit4]   2> 1783403 ERROR (jetty-launcher-5318-thread-2) [    ] o.a.s.u.StartupLoggingUtils Missing Java Option solr.log.dir. Logging may be missing or incomplete.
   [junit4]   2> 1783403 ERROR (jetty-launcher-5318-thread-1) [    ] o.a.s.u.StartupLoggingUtils Missing Java Option solr.log.dir. Logging may be missing or incomplete.
   [junit4]   2> 1783404 INFO  (jetty-launcher-5318-thread-2) [    ] o.a.s.s.SolrDispatchFilter  ___      _       Welcome to Apache Solr™ version 7.4.0
   [junit4]   2> 1783404 INFO  (jetty-launcher-5318-thread-1) [    ] o.a.s.s.SolrDispatchFilter  ___      _       Welcome to Apache Solr™ version 7.4.0
   [junit4]   2> 1783404 INFO  (jetty-launcher-5318-thread-2) [    ] o.a.s.s.SolrDispatchFilter / __| ___| |_ _   Starting in cloud mode on port null
   [junit4]   2> 1783404 INFO  (jetty-launcher-5318-thread-1) [    ] o.a.s.s.SolrDispatchFilter / __| ___| |_ _   Starting in cloud mode on port null
   [junit4]   2> 1783404 INFO  (jetty-launcher-5318-thread-2) [    ] o.a.s.s.SolrDispatchFilter \__ \/ _ \ | '_|  Install dir: null
   [junit4]   2> 1783404 INFO  (jetty-launcher-5318-thread-1) [    ] o.a.s.s.SolrDispatchFilter \__ \/ _ \ | '_|  Install dir: null
   [junit4]   2> 1783404 INFO  (jetty-launcher-5318-thread-2) [    ] o.a.s.s.SolrDispatchFilter |___/\___/_|_|    Start time: 2018-03-12T23:36:42.521224Z
   [junit4]   2> 1783404 INFO  (jetty-launcher-5318-thread-1) [    ] o.a.s.s.SolrDispatchFilter |___/\___/_|_|    Start time: 2018-03-12T23:36:42.521262Z
   [junit4]   2> 1783405 INFO  (zkConnectionManagerCallback-5325-thread-1) [    ] o.a.s.c.c.ConnectionManager zkClient has connected
   [junit4]   2> 1783405 INFO  (zkConnectionManagerCallback-5324-thread-1) [    ] o.a.s.c.c.ConnectionManager zkClient has connected
   [junit4]   2> 1783405 INFO  (jetty-launcher-5318-thread-1) [    ] o.a.s.s.SolrDispatchFilter solr.xml found in ZooKeeper. Loading...
   [junit4]   2> 1783405 INFO  (jetty-launcher-5318-thread-2) [    ] o.a.s.s.SolrDispatchFilter solr.xml found in ZooKeeper. Loading...
   [junit4]   2> 1783413 INFO  (jetty-launcher-5318-thread-2) [    ] o.a.s.c.ZkContainer Zookeeper client=127.0.0.1:39071/solr
   [junit4]   2> 1783413 INFO  (jetty-launcher-5318-thread-1) [    ] o.a.s.c.ZkContainer Zookeeper client=127.0.0.1:39071/solr
   [junit4]   2> 1783414 INFO  (zkConnectionManagerCallback-5331-thread-1) [    ] o.a.s.c.c.ConnectionManager zkClient has connected
   [junit4]   2> 1783414 INFO  (zkConnectionManagerCallback-5333-thread-1) [    ] o.a.s.c.c.ConnectionManager zkClient has connected
   [junit4]   2> 1783415 WARN  (NIOServerCxn.Factory:0.0.0.0/0.0.0.0:0) [    ] o.a.z.s.NIOServerCnxn Unable to read additional data from client sessionid 0x1003db718650003, likely client has closed socket
   [junit4]   2> 1783416 INFO  (zkConnectionManagerCallback-5337-thread-1-processing-n:127.0.0.1:45477_solr) [n:127.0.0.1:45477_solr    ] o.a.s.c.c.ConnectionManager zkClient has connected
   [junit4]   2> 1783416 INFO  (zkConnectionManagerCallback-5336-thread-1-processing-n:127.0.0.1:34681_solr) [n:127.0.0.1:34681_solr    ] o.a.s.c.c.ConnectionManager zkClient has connected
   [junit4]   2> 1783511 INFO  (jetty-launcher-5318-thread-2) [n:127.0.0.1:45477_solr    ] o.a.s.c.Overseer Overseer (id=null) closing
   [junit4]   2> 1783512 INFO  (jetty-launcher-5318-thread-1) [n:127.0.0.1:34681_solr    ] o.a.s.c.Overseer Overseer (id=null) closing
   [junit4]   2> 1783512 INFO  (jetty-launcher-5318-thread-2) [n:127.0.0.1:45477_solr    ] o.a.s.c.OverseerElectionContext I am going to be the leader 127.0.0.1:45477_solr
   [junit4]   2> 1783512 INFO  (jetty-launcher-5318-thread-1) [n:127.0.0.1:34681_solr    ] o.a.s.c.ZkController Register node as live in ZooKeeper:/live_nodes/127.0.0.1:34681_solr
   [junit4]   2> 1783512 INFO  (jetty-launcher-5318-thread-2) [n:127.0.0.1:45477_solr    ] o.a.s.c.Overseer Overseer (id=72125450635509765-127.0.0.1:45477_solr-n_0000000000) starting
   [junit4]   2> 1783513 INFO  (zkCallback-5335-thread-1-processing-n:127.0.0.1:45477_solr) [n:127.0.0.1:45477_solr    ] o.a.s.c.c.ZkStateReader Updated live nodes from ZooKeeper... (0) -> (1)
   [junit4]   2> 1783517 INFO  (zkCallback-5334-thread-1-processing-n:127.0.0.1:34681_solr) [n:127.0.0.1:34681_solr    ] o.a.s.c.c.ZkStateReader Updated live nodes from ZooKeeper... (0) -> (1)
   [junit4]   2> 1783525 INFO  (zkConnectionManagerCallback-5343-thread-1-processing-n:127.0.0.1:45477_solr) [n:127.0.0.1:45477_solr    ] o.a.s.c.c.ConnectionManager zkClient has connected
   [junit4]   2> 1783526 INFO  (jetty-launcher-5318-thread-2) [n:127.0.0.1:45477_solr    ] o.a.s.c.c.ZkStateReader Updated live nodes from ZooKeeper... (0) -> (1)
   [junit4]   2> 1783526 INFO  (jetty-launcher-5318-thread-2) [n:127.0.0.1:45477_solr    ] o.a.s.c.s.i.ZkClientClusterStateProvider Cluster at 127.0.0.1:39071/solr ready
   [junit4]   2> 1783529 DEBUG (OverseerAutoScalingTriggerThread-72125450635509765-127.0.0.1:45477_solr-n_0000000000) [n:127.0.0.1:45477_solr    ] o.a.s.c.a.OverseerTriggerThread Adding .autoAddReplicas trigger
   [junit4]   2> 1783529 DEBUG (OverseerAutoScalingTriggerThread-72125450635509765-127.0.0.1:45477_solr-n_0000000000) [n:127.0.0.1:45477_solr    ] o.a.s.c.a.OverseerTriggerThread Refreshing /autoscaling.json with znode version 1
   [junit4]   2> 1783529 INFO  (jetty-launcher-5318-thread-2) [n:127.0.0.1:45477_solr    ] o.a.s.c.ZkController Register node as live in ZooKeeper:/live_nodes/127.0.0.1:45477_solr
   [junit4]   2> 1783529 DEBUG (OverseerAutoScalingTriggerThread-72125450635509765-127.0.0.1:45477_solr-n_0000000000) [n:127.0.0.1:45477_solr    ] o.a.s.c.a.NodeLostTrigger Initial livenodes: [127.0.0.1:34681_solr]
   [junit4]   2> 1783530 DEBUG (OverseerAutoScalingTriggerThread-72125450635509765-127.0.0.1:45477_solr-n_0000000000) [n:127.0.0.1:45477_solr    ] o.a.s.c.a.OverseerTriggerThread Current znodeVersion 1, lastZnodeVersion -1
   [junit4]   2> 1783530 DEBUG (OverseerAutoScalingTriggerThread-72125450635509765-127.0.0.1:45477_solr-n_0000000000) [n:127.0.0.1:45477_solr    ] o.a.s.c.a.OverseerTriggerThread Processed trigger updates upto znodeVersion 1
   [junit4]   2> 1783530 INFO  (zkCallback-5335-thread-1-processing-n:127.0.0.1:45477_solr) [n:127.0.0.1:45477_solr    ] o.a.s.c.c.ZkStateReader Updated live nodes from ZooKeeper... (1) -> (2)
   [junit4]   2> 1783535 INFO  (zkCallback-5334-thread-1-processing-n:127.0.0.1:34681_solr) [n:127.0.0.1:34681_solr    ] o.a.s.c.c.ZkStateReader Updated live nodes from ZooKeeper... (1) -> (2)
   [junit4]   2> 1783536 INFO  (zkCallback-5342-thread-1-processing-n:127.0.0.1:45477_solr) [n:127.0.0.1:45477_solr    ] o.a.s.c.c.ZkStateReader Updated live nodes from ZooKeeper... (1) -> (2)
   [junit4]   2> 1783540 DEBUG (OverseerAutoScalingTriggerThread-72125450635509765-127.0.0.1:45477_solr-n_0000000000) [n:127.0.0.1:45477_solr    ] o.a.s.c.a.OverseerTriggerThread -- clean old nodeAdded markers
   [junit4]   2> 1783541 DEBUG (OverseerAutoScalingTriggerThread-72125450635509765-127.0.0.1:45477_solr-n_0000000000) [n:127.0.0.1:45477_solr    ] o.a.s.c.a.OverseerTriggerThread Current znodeVersion 1, lastZnodeVersion 1
   [junit4]   2> 1783541 DEBUG (ScheduledTrigger-8644-thread-1) [n:127.0.0.1:45477_solr    ] o.a.s.c.a.NodeLostTrigger Running NodeLostTrigger: .auto_add_replicas with currently live nodes: 2
   [junit4]   2> 1783543 INFO  (jetty-launcher-5318-thread-1) [n:127.0.0.1:34681_solr    ] o.a.s.m.r.SolrJmxReporter JMX monitoring for 'solr_34681.solr.node' (registry 'solr.node') enabled at server: com.sun.jmx.mbeanserver.JmxMBeanServer@6b513f0c
   [junit4]   2> 1783551 INFO  (jetty-launcher-5318-thread-1) [n:127.0.0.1:34681_solr    ] o.a.s.m.r.SolrJmxReporter JMX monitoring for 'solr_34681.solr.jvm' (registry 'solr.jvm') enabled at server: com.sun.jmx.mbeanserver.JmxMBeanServer@6b513f0c
   [junit4]   2> 1783552 INFO  (jetty-launcher-5318-thread-1) [n:127.0.0.1:34681_solr    ] o.a.s.m.r.SolrJmxReporter JMX monitoring for 'solr_34681.solr.jetty' (registry 'solr.jetty') enabled at server: com.sun.jmx.mbeanserver.JmxMBeanServer@6b513f0c
   [junit4]   2> 1783553 INFO  (jetty-launcher-5318-thread-1) [n:127.0.0.1:34681_solr    ] o.a.s.c.CorePropertiesLocator Found 0 core definitions underneath /home/jenkins/workspace/Lucene-Solr-7.x-Linux/solr/build/solr-core/test/J1/temp/solr.cloud.autoscaling.TriggerIntegrationTest_37322C213120DB0F-001/tempDir-001/node1/.
   [junit4]   2> 1783555 INFO  (zkConnectionManagerCallback-5347-thread-1-processing-n:127.0.0.1:34681_solr) [n:127.0.0.1:34681_solr    ] o.a.s.c.c.ConnectionManager zkClient has connected
   [junit4]   2> 1783555 INFO  (jetty-launcher-5318-thread-1) [n:127.0.0.1:34681_solr    ] o.a.s.c.c.ZkStateReader Updated live nodes from ZooKeeper... (0) -> (2)
   [junit4]   2> 1783556 INFO  (jetty-launcher-5318-thread-1) [n:127.0.0.1:34681_solr    ] o.a.s.c.s.i.ZkClientClusterStateProvider Cluster at 127.0.0.1:39071/solr ready
   [junit4]   2> 1783567 INFO  (jetty-launcher-5318-thread-2) [n:127.0.0.1:45477_solr    ] o.a.s.m.r.SolrJmxReporter JMX monitoring for 'solr_45477.solr.node' (registry 'solr.node') enabled at server: com.sun.jmx.mbeanserver.JmxMBeanServer@6b513f0c
   [junit4]   2> 1783573 INFO  (jetty-launcher-5318-thread-2) [n:127.0.0.1:45477_solr    ] o.a.s.m.r.SolrJmxReporter JMX monitoring for 'solr_45477.solr.jvm' (registry 'solr.jvm') enabled at server: com.sun.jmx.mbeanserver.JmxMBeanServer@6b513f0c
   [junit4]   2> 1783573 INFO  (jetty-launcher-5318-thread-2) [n:127.0.0.1:45477_solr    ] o.a.s.m.r.SolrJmxReporter JMX monitoring for 'solr_45477.solr.jetty' (registry 'solr.jetty') enabled at server: com.sun.jmx.mbeanserver.JmxMBeanServer@6b513f0c
   [junit4]   2> 1783574 INFO  (jetty-launcher-5318-thread-2) [n:127.0.0.1:45477_solr    ] o.a.s.c.CorePropertiesLocator Found 0 core definitions underneath /home/jenkins/workspace/Lucene-Solr-7.x-Linux/solr/build/solr-core/test/J1/temp/solr.cloud.autoscaling.TriggerIntegrationTest_37322C213120DB0F-001/tempDir-001/node2/.
   [junit4]   2> 1783588 INFO  (zkConnectionManagerCallback-5349-thread-1) [    ] o.a.s.c.c.ConnectionManager zkClient has connected
   [junit4]   2> 1783589 INFO  (zkConnectionManagerCallback-5353-thread-1) [    ] o.a.s.c.c.ConnectionManager zkClient has connected
   [junit4]   2> 1783590 INFO  (SUITE-TriggerIntegrationTest-seed#[37322C213120DB0F]-worker) [    ] o.a.s.c.c.ZkStateReader Updated live nodes from ZooKeeper... (0) -> (2)
   [junit4]   2> 1783590 INFO  (SUITE-TriggerIntegrationTest-seed#[37322C213120DB0F]-worker) [    ] o.a.s.c.s.i.ZkClientClusterStateProvider Cluster at 127.0.0.1:39071/solr ready
   [junit4] IGNOR/A 0.00s J1 | TriggerIntegrationTest.testEventQueue
   [junit4]    > Assumption #1: 'badapple' test group is disabled (@BadApple(bugUrl="https://issues.apache.org/jira/browse/SOLR-12028"))
   [junit4] IGNOR/A 0.00s J1 | TriggerIntegrationTest.testNodeMarkersRegistration
   [junit4]    > Assumption #1: 'badapple' test group is disabled (@BadApple(bugUrl="https://issues.apache.org/jira/browse/SOLR-12028"))
   [junit4]   2> 1783601 INFO  (TEST-TriggerIntegrationTest.testNodeAddedTrigger-seed#[37322C213120DB0F]) [    ] o.a.s.SolrTestCaseJ4 ###Starting testNodeAddedTrigger
   [junit4]   2> 1783601 INFO  (TEST-TriggerIntegrationTest.testNodeAddedTrigger-seed#[37322C213120DB0F]) [    ] o.a.s.c.a.TriggerIntegrationTest Found 2 jetty instances running
   [junit4]   2> 1783602 INFO  (zkConnectionManagerCallback-5355-thread-1) [    ] o.a.s.c.c.ConnectionManager zkClient has connected
   [junit4]   2> 1783604 INFO  (qtp1303836426-23236) [n:127.0.0.1:34681_solr    ] o.a.s.h.a.CollectionsHandler Invoked Collection Action :overseerstatus with params action=OVERSEERSTATUS&wt=javabin&version=2 and sendToOCPQueue=true
   [junit4]   2> 1783608 INFO  (qtp1303836426-23236) [n:127.0.0.1:34681_solr    ] o.a.s.s.HttpSolrCall [admin] webapp=null path=/admin/collections params={action=OVERSEERSTATUS&wt=javabin&version=2} status=0 QTime=4
   [junit4]   2> 1783609 INFO  (TEST-TriggerIntegrationTest.testNodeAddedTrigger-seed#[37322C213120DB0F]) [    ] o.a.s.c.a.ScheduledTriggers -- removing trigger: .auto_add_replicas
   [junit4]   2> 1783610 INFO  (TEST-TriggerIntegrationTest.testNodeAddedTrigger-seed#[37322C213120DB0F]) [    ] o.a.s.c.a.TriggerIntegrationTest /autoscaling.json reset, new znode version 2
   [junit4]   2> 1783610 DEBUG (zkCallback-5342-thread-1-processing-n:127.0.0.1:45477_solr) [n:127.0.0.1:45477_solr    ] o.a.s.c.a.OverseerTriggerThread Refreshing /autoscaling.json with znode version 2
   [junit4]   2> 1783611 DEBUG (OverseerAutoScalingTriggerThread-72125450635509765-127.0.0.1:45477_solr-n_0000000000) [n:127.0.0.1:45477_solr    ] o.a.s.c.a.OverseerTriggerThread Processed trigger updates upto znodeVersion 2
   [junit4]   2> 1783611 DEBUG (OverseerAutoScalingTriggerThread-72125450635509765-127.0.0.1:45477_solr-n_0000000000) [n:127.0.0.1:45477_solr    ] o.a.s.c.a.OverseerTriggerThread -- clean old nodeLost markers
   [junit4]   2> 1783611 INFO  (TEST-TriggerIntegrationTest.testNodeAddedTrigger-seed#[37322C213120DB0F]) [    ] o.a.s.c.c.ZkStateReader Updated live nodes from ZooKeeper... (0) -> (2)
   [junit4]   2> 1783611 DEBUG (OverseerAutoScalingTriggerThread-72125450635509765-127.0.0.1:45477_solr-n_0000000000) [n:127.0.0.1:45477_solr    ] o.a.s.c.a.OverseerTriggerThread -- clean old nodeAdded markers
   [junit4]   2> 1783611 DEBUG (OverseerAutoScalingTriggerThread-72125450635509765-127.0.0.1:45477_solr-n_0000000000) [n:127.0.0.1:45477_solr    ] o.a.s.c.a.OverseerTriggerThread Current znodeVersion 2, lastZnodeVersion 2
   [junit4]   2> 1783611 INFO  (TEST-TriggerIntegrationTest.testNodeAddedTrigger-seed#[37322C213120DB0F]) [    ] o.e.j.s.AbstractConnector Stopped ServerConnector@2c7da1c{HTTP/1.1,[http/1.1]}{127.0.0.1:0}
   [junit4]   2> 1783612 INFO  (TEST-TriggerIntegrationTest.testNodeAddedTrigger-seed#[37322C213120DB0F]) [    ] o.a.s.c.CoreContainer Shutting down CoreContainer instance=681697861
   [junit4]   2> 1783612 INFO  (TEST-TriggerIntegrationTest.testNodeAddedTrigger-seed#[37322C213120DB0F]) [    ] o.a.s.m.SolrMetricManager Closing metric reporters for registry=solr.node, tag=null
   [junit4]   2> 1783612 INFO  (TEST-TriggerIntegrationTest.testNodeAddedTrigger-seed#[37322C213120DB0F]) [    ] o.a.s.m.r.SolrJmxReporter Closing reporter [org.apache.solr.metrics.reporters.SolrJmxReporter@386e9718: rootName = solr_45477, domain = solr.node, service url = null, agent id = null] for registry solr.node / com.codahale.metrics.MetricRegistry@5ebc128d
   [junit4]   2> 1783616 INFO  (TEST-TriggerIntegrationTest.testNodeAddedTrigger-seed#[37322C213120DB0F]) [    ] o.a.s.m.SolrMetricManager Closing metric reporters for registry=solr.jvm, tag=null
   [junit4]   2> 1783617 INFO  (TEST-TriggerIntegrationTest.testNodeAddedTrigger-seed#[37322C213120DB0F]) [    ] o.a.s.m.r.SolrJmxReporter Closing reporter [org.apache.solr.metrics.reporters.SolrJmxReporter@3fbbd3: rootName = solr_45477, domain = solr.jvm, service url = null, agent id = null] for registry solr.jvm / com.codahale.metrics.MetricRegistry@18df8351
   [junit4]   2> 1783620 INFO  (TEST-TriggerIntegrationTest.testNodeAddedTrigger-seed#[37322C213120DB0F]) [    ] o.a.s.m.SolrMetricManager Closing metric reporters for registry=solr.jetty, tag=null
   [junit4]   2> 1783620 INFO  (TEST-TriggerIntegrationTest.testNodeAddedTrigger-seed#[37322C213120DB0F]) [    ] o.a.s.m.r.SolrJmxReporter Closing reporter [org.apache.solr.metrics.reporters.SolrJmxReporter@563e721: rootName = solr_45477, domain = solr.jetty, service url = null, agent id = null] for registry solr.jetty / com.codahale.metrics.MetricRegistry@3a9cf93
   [junit4]   2> 1783621 INFO  (TEST-TriggerIntegrationTest.testNodeAddedTrigger-seed#[37322C213120DB0F]) [    ] o.a.s.c.ZkController Remove node as live in ZooKeeper:/live_nodes/127.0.0.1:45477_solr
   [junit4]   2> 1783621 INFO  (TEST-TriggerIntegrationTest.testNodeAddedTrigger-seed#[37322C213120DB0F]) [    ] o.a.s.m.SolrMetricManager Closing metric reporters for registry=solr.cluster, tag=null
   [junit4]   2> 1783621 INFO  (zkCallback-5342-thread-1-processing-n:127.0.0.1:45477_solr) [n:127.0.0.1:45477_solr    ] o.a.s.c.c.ZkStateReader Updated live nodes from ZooKeeper... (2) -> (1)
   [junit4]   2> 1783621 INFO  (zkCallback-5334-thread-1-processing-n:127.0.0.1:34681_solr) [n:127.0.0.1:34681_solr    ] o.a.s.c.c.ZkStateReader Updated live nodes from ZooKeeper... (2) -> (1)
   [junit4]   2> 1783621 INFO  (zkCallback-5335-thread-1-processing-n:127.0.0.1:45477_solr) [n:127.0.0.1:45477_solr    ] o.a.s.c.c.ZkStateReader Updated live nodes from ZooKeeper... (2) -> (1)
   [junit4]   2> 1783621 INFO  (TEST-TriggerIntegrationTest.testNodeAddedTrigger-seed#[37322C213120DB0F]) [    ] o.a.s.c.TransientSolrCoreCacheDefault Allocating transient cache for 2147483647 transient cores
   [junit4]   2> 1783621 INFO  (zkCallback-5352-thread-2) [    ] o.a.s.c.c.ZkStateReader Updated live nodes from ZooKeeper... (2) -> (1)
   [junit4]   2> 1783621 INFO  (zkCallback-5352-thread-1) [    ] o.a.s.c.c.ZkStateReader Updated live nodes from ZooKeeper... (2) -> (1)
   [junit4]   2> 1783622 INFO  (TEST-TriggerIntegrationTest.testNodeAddedTrigger-seed#[37322C213120DB0F]) [    ] o.a.s.c.Overseer Overseer (id=72125450635509765-127.0.0.1:45477_solr-n_0000000000) closing
   [junit4]   2> 1783622 INFO  (OverseerStateUpdate-72125450635509765-127.0.0.1:45477_solr-n_0000000000) [n:127.0.0.1:45477_solr    ] o.a.s.c.Overseer Overseer Loop exiting : 127.0.0.1:45477_solr
   [junit4]   2> 1783622 WARN  (OverseerAutoScalingTriggerThread-72125450635509765-127.0.0.1:45477_solr-n_0000000000) [n:127.0.0.1:45477_solr    ] o.a.s.c.a.OverseerTriggerThread OverseerTriggerThread woken up but we are closed, exiting.
   [junit4]   2> 1783622 DEBUG (TEST-TriggerIntegrationTest.testNodeAddedTrigger-seed#[37322C213120DB0F]) [    ] o.a.s.c.a.OverseerTriggerThread OverseerTriggerThread has been closed explicitly
   [junit4]   2> 1783623 INFO  (zkCallback-5334-thread-1-processing-n:127.0.0.1:34681_solr) [n:127.0.0.1:34681_solr    ] o.a.s.c.OverseerElectionContext I am going to be the leader 127.0.0.1:34681_solr
   [junit4]   2> 1783623 INFO  (TEST-TriggerIntegrationTest.testNodeAddedTrigger-seed#[37322C213120DB0F]) [    ] o.e.j.s.h.ContextHandler Stopped o.e.j.s.ServletContextHandler@46eb2bea{/solr,null,UNAVAILABLE}
   [junit4]   2> 1783623 INFO  (TEST-TriggerIntegrationTest.testNodeAddedTrigger-seed#[37322C213120DB0F]) [    ] o.e.j.s.session Stopped scavenging
   [junit4]   2> 1783624 INFO  (zkCallback-5334-thread-1-processing-n:127.0.0.1:34681_solr) [n:127.0.0.1:34681_solr    ] o.a.s.c.Overseer Overseer (id=72125450635509766-127.0.0.1:34681_solr-n_0000000001) starting
   [junit4]   2> 1783625 INFO  (zkCallback-5346-thread-1-processing-n:127.0.0.1:34681_solr) [n:127.0.0.1:34681_solr    ] o.a.s.c.c.ZkStateReader Updated live nodes from ZooKeeper... (2) -> (1)
   [junit4]   2> 1783627 DEBUG (OverseerAutoScalingTriggerThread-72125450635509766-127.0.0.1:34681_solr-n_0000000001) [n:127.0.0.1:34681_solr    ] o.a.s.c.a.OverseerTriggerThread Adding .autoAddReplicas trigger
   [junit4]   2> 1783627 DEBUG (OverseerAutoScalingTriggerThread-72125450635509766-127.0.0.1:34681_solr-n_0000000001) [n:127.0.0.1:34681_solr    ] o.a.s.c.a.OverseerTriggerThread Refreshing /autoscaling.json with znode version 3
   [junit4]   2> 1783627 DEBUG (OverseerAutoScalingTriggerThread-72125450635509766-127.0.0.1:34681_solr-n_0000000001) [n:127.0.0.1:34681_solr    ] o.a.s.c.a.NodeLostTrigger Initial livenodes: [127.0.0.1:34681_solr]
   [junit4]   2> 1783627 DEBUG (OverseerAutoScalingTriggerThread-72125450635509766-127.0.0.1:34681_solr-n_0000000001) [n:127.0.0.1:34681_solr    ] o.a.s.c.a.OverseerTriggerThread Current znodeVersion 3, lastZnodeVersion -1
   [junit4]   2> 1783627 DEBUG (OverseerAutoScalingTriggerThread-72125450635509766-127.0.0.1:34681_solr-n_0000000001) [n:127.0.0.1:34681_solr    ] o.a.s.c.a.OverseerTriggerThread Processed trigger updates upto znodeVersion 3
   [junit4]   2> 1783628 DEBUG (OverseerAutoScalingTriggerThread-72125450635509766-127.0.0.1:34681_solr-n_0000000001) [n:127.0.0.1:34681_solr    ] o.a.s.c.a.OverseerTriggerThread -- clean old nodeAdded markers
   [junit4]   2> 1783629 DEBUG (OverseerAutoScalingTriggerThread-72125450635509766-127.0.0.1:34681_solr-n_0000000001) [n:127.0.0.1:34681_solr    ] o.a.s.c.a.OverseerTriggerThread Current znodeVersion 3, lastZnodeVersion 3
   [junit4]   2> 1783629 DEBUG (ScheduledTrigger-8653-thread-1) [n:127.0.0.1:34681_solr    ] o.a.s.c.a.NodeLostTrigger Running NodeLostTrigger: .auto_add_replicas with currently live nodes: 1
   [junit4]   2> 1784629 DEBUG (ScheduledTrigger-8653-thread-1) [n:127.0.0.1:34681_solr    ] o.a.s.c.a.NodeLostTrigger Running NodeLostTrigger: .auto_add_replicas with currently live nodes: 1
   [junit4]   2> 1785630 DEBUG (ScheduledTrigger-8653-thread-2) [n:127.0.0.1:34681_solr    ] o.a.s.c.a.NodeLostTrigger Running NodeLostTrigger: .auto_add_replicas with currently live nodes: 1
   [junit4]   2> 1786630 DEBUG (ScheduledTrigger-8653-thread-1) [n:127.0.0.1:34681_solr    ] o.a.s.c.a.NodeLostTrigger Running NodeLostTrigger: .auto_add_replicas with currently live nodes: 1
   [junit4]   2> 1787630 DEBUG (ScheduledTrigger-8653-thread-1) [n:127.0.0.1:34681_solr    ] o.a.s.c.a.NodeLostTrigger Running NodeLostTrigger: .auto_add_replicas with currently live nodes: 1
   [junit4]   2> 1788624 INFO  (TEST-TriggerIntegrationTest.testNodeAddedTrigger-seed#[37322C213120DB0F]) [    ] o.e.j.s.Server jetty-9.4.8.v20171121, build timestamp: 2017-11-21T12:27:37-09:00, git hash: 82b8fb23f757335bb3329d540ce37a2a2615f0a8
   [junit4]   2> 1788625 INFO  (TEST-TriggerIntegrationTest.testNodeAddedTrigger-seed#[37322C213120DB0F]) [    ] o.e.j.s.session DefaultSessionIdManager workerName=node0
   [junit4]   2> 1788625 INFO  (TEST-TriggerIntegrationTest.testNodeAddedTrigger-seed#[37322C213120DB0F]) [    ] o.e.j.s.session No SessionScavenger set, using defaults
   [junit4]   2> 1788625 INFO  (TEST-TriggerIntegrationTest.testNodeAddedTrigger-seed#[37322C213120DB0F]) [    ] o.e.j.s.session Scavenging every 660000ms
   [junit4]   2> 1788625 INFO  (TEST-TriggerIntegrationTest.testNodeAddedTrigger-seed#[37322C213120DB0F]) [    ] o.e.j.s.h.ContextHandler Started o.e.j.s.ServletContextHandler@56037475{/solr,null,AVAILABLE}
   [junit4]   2> 1788625 INFO  (TEST-TriggerIntegrationTest.testNodeAddedTrigger-seed#[37322C213120DB0F]) [    ] o.e.j.s.AbstractConnector Started ServerConnector@723f45a{HTTP/1.1,[http/1.1]}{127.0.0.1:41889}
   [junit4]   2> 1788626 INFO  (TEST-TriggerIntegrationTest.testNodeAddedTrigger-seed#[37322C213120DB0F]) [    ] o.e.j.s.Server Started @1790485ms
   [junit4]   2> 1788626 INFO  (TEST-TriggerIntegrationTest.testNodeAddedTrigger-seed#[37322C213120DB0F]) [    ] o.a.s.c.s.e.JettySolrRunner Jetty properties: {hostContext=/solr, hostPort=41889}
   [junit4]   2> 1788626 ERROR (TEST-TriggerIntegrationTest.testNodeAddedTrigger-seed#[37322C213120DB0F]) [    ] o.a.s.u.StartupLoggingUtils Missing Java Option solr.log.dir. Logging may be missing or incomplete.
   [junit4]   2> 1788626 INFO  (TEST-TriggerIntegrationTest.testNodeAddedTrigger-seed#[37322C213120DB0F]) [    ] o.a.s.s.SolrDispatchFilter  ___      _       Welcome to Apache Solr™ version 7.4.0
   [junit4]   2> 1788626 INFO  (TEST-TriggerIntegrationTest.testNodeAddedTrigger-seed#[37322C213120DB0F]) [    ] o.a.s.s.SolrDispatchFilter / __| ___| |_ _   Starting in cloud mode on port null
   [junit4]   2> 1788626 INFO  (TEST-TriggerIntegrationTest.testNodeAddedTrigger-seed#[37322C213120DB0F]) [    ] o.a.s.s.SolrDispatchFilter \__ \/ _ \ | '_|  Install dir: null
   [junit4]   2> 1788626 INFO  (TEST-TriggerIntegrationTest.testNodeAddedTrigger-seed#[37322C213120DB0F]) [    ] o.a.s.s.SolrDispatchFilter |___/\___/_|_|    Start time: 2018-03-12T23:36:47.743553Z
   [junit4]   2> 1788627 INFO  (zkConnectionManagerCallback-5358-thread-1) [    ] o.a.s.c.c.ConnectionManager zkClient has connected
   [junit4]   2> 1788628 INFO  (TEST-TriggerIntegrationTest.testNodeAddedTrigger-seed#[37322C213120DB0F]) [    ] o.a.s.s.SolrDispatchFilter solr.xml found in ZooKeeper. Loading...
   [junit4]   2> 1788630 DEBUG (ScheduledTrigger-8653-thread-1) [n:127.0.0.1:34681_solr    ] o.a.s.c.a.NodeLostTrigger Running NodeLostTrigger: .auto_add_replicas with currently live nodes: 1
   [junit4]   2> 1788634 INFO  (TEST-TriggerIntegrationTest.testNodeAddedTrigger-seed#[37322C213120DB0F]) [    ] o.a.s.c.ZkContainer Zookeeper client=127.0.0.1:39071/solr
   [junit4]   2> 1788635 INFO  (zkConnectionManagerCallback-5362-thread-1) [    ] o.a.s.c.c.ConnectionManager zkClient has connected
   [junit4]   2> 1788636 INFO  (zkConnectionManagerCallback-5364-thread-1-processing-n:127.0.0.1:41889_solr) [n:127.0.0.1:41889_solr    ] o.a.s.c.c.ConnectionManager zkClient has connected
   [junit4]   2> 1788639 INFO  (TEST-TriggerIntegrationTest.testNodeAddedTrigger-seed#[37322C213120DB0F]) [n:127.0.0.1:41889_solr    ] o.a.s.c.c.ZkStateReader Updated live nodes from ZooKeeper... (0) -> (1)
   [junit4]   2> 1788640 INFO  (TEST-TriggerIntegrationTest.testNodeAddedTrigger-seed#[37322C213120DB0F]) [n:127.0.0.1:41889_solr    ] o.a.s.c.Overseer Overseer (id=null) closing
   [junit4]   2> 1788642 INFO  (TEST-TriggerIntegrationTest.testNodeAddedTrigger-seed#[37322C213120DB0F]) [n:127.0.0.1:41889_solr    ] o.a.s.c.ZkController Register node as live in ZooKeeper:/live_nodes/127.0.0.1:41889_solr
   [junit4]   2> 1788642 INFO  (zkCallback-5334-thread-1-processing-n:127.0.0.1:34681_solr) [n:127.0.0.1:34681_solr    ] o.a.s.c.c.ZkStateReader Updated live nodes from ZooKeeper... (1) -> (2)
   [junit4]   2> 1788642 INFO  (zkCallback-5346-thread-1-processing-n:127.0.0.1:34681_solr) [n:127.0.0.1:34681_solr    ] o.a.s.c.c.ZkStateReader Updated live nodes from ZooKeeper... (1) -> (2)
   [junit4]   2> 1788642 INFO  (zkCallback-5363-thread-1-processing-n:127.0.0.1:41889_solr) [n:127.0.0.1:41889_solr    ] o.a.s.c.c.ZkStateReader Updated live nodes from ZooKeeper... (1) -> (2)
   [junit4]   2> 1788642 INFO  (zkCallback-5352-thread-1) [    ] o.a.s.c.c.ZkStateReader Updated live nodes from ZooKeeper... (1) -> (2)
   [junit4]   2> 1788642 INFO  (zkCallback-5352-thread-2) [    ] o.a.s.c.c.ZkStateReader Updated live nodes from ZooKeeper... (1) -> (2)
   [junit4]   2> 1788675 INFO  (TEST-TriggerIntegrationTest.testNodeAddedTrigger-seed#[37322C213120DB0F]) [n:127.0.0.1:41889_solr    ] o.a.s.m.r.SolrJmxReporter JMX monitoring for 'solr_41889.solr.node' (registry 'solr.node') enabled at server: com.sun.jmx.mbeanserver.JmxMBeanServer@6b513f0c
   [junit4]   2> 1788687 INFO  (TEST-TriggerIntegrationTest.testNodeAddedTrigger-seed#[37322C213120DB0F]) [n:127.0.0.1:41889_solr    ] o.a.s.m.r.SolrJmxReporter JMX monitoring for 'solr_41889.solr.jvm' (registry 'solr.jvm') enabled at server: com.sun.jmx.mbeanserver.JmxMBeanServer@6b513f0c
   [junit4]   2> 1788687 INFO  (TEST-TriggerIntegrationTest.testNodeAddedTrigger-seed#[37322C213120DB0F]) [n:127.0.0.1:41889_solr    ] o.a.s.m.r.SolrJmxReporter JMX monitoring for 'solr_41889.solr.jetty' (registry 'solr.jetty') enabled at server: com.sun.jmx.mbeanserver.JmxMBeanServer@6b513f0c
   [junit4]   2> 1788689 INFO  (TEST-TriggerIntegrationTest.testNodeAddedTrigger-seed#[37322C213120DB0F]) [n:127.0.0.1:41889_solr    ] o.a.s.c.CorePropertiesLocator Found 0 core definitions underneath /home/jenkins/workspace/Lucene-Solr-7.x-Linux/solr/build/solr-core/test/J1/temp/solr.cloud.autoscaling.TriggerIntegrationTest_37322C213120DB0F-001/tempDir-001/node3/.
   [junit4]   2> 1788691 INFO  (zkConnectionManagerCallback-5369-thread-1-processing-n:127.0.0.1:41889_solr) [n:127.0.0.1:41889_solr    ] o.a.s.c.c.ConnectionManager zkClient has connected
   [junit4]   2> 1788692 INFO  (TEST-TriggerIntegrationTest.testNodeAddedTrigger-seed#[37322C213120DB0F]) [n:127.0.0.1:41889_solr    ] o.a.s.c.c.ZkStateReader Updated live nodes from ZooKeeper... (0) -> (2)
   [junit4]   2> 1788692 INFO  (TEST-TriggerIntegrationTest.testNodeAddedTrigger-seed#[37322C213120DB0F]) [n:127.0.0.1:41889_solr    ] o.a.s.c.s.i.ZkClientClusterStateProvider Cluster at 127.0.0.1:39071/solr ready
   [junit4]   2> 1788714 INFO  (qtp1303836426-23344) [n:127.0.0.1:34681_solr    ] o.a.s.s.HttpSolrCall [admin] webapp=null path=/admin/metrics params={prefix=CONTAINER.fs.usableSpace,CORE.coreName&wt=javabin&version=2&group=solr.node,solr.core} status=0 QTime=0
   [junit4]   2> 1788716 INFO  (qtp667617085-23317) [n:127.0.0.1:41889_solr    ] o.a.s.s.HttpSolrCall [admin] webapp=null path=/admin/metrics params={prefix=CONTAINER.fs.usableSpace,CORE.coreName&wt=javabin&version=2&group=solr.node,solr.core} status=0 QTime=0
   [junit4]   2> 1788716 DEBUG (qtp1303836426-23244) [n:127.0.0.1:34681_solr    ] o.a.s.c.a.AutoScalingHandler Verified autoscaling configuration
   [junit4]   2> 1788716 INFO  (qtp1303836426-23244) [n:127.0.0.1:34681_solr    ] o.a.s.s.HttpSolrCall [admin] webapp=null path=/cluster/autoscaling params={wt=javabin&version=2} status=0 QTime=4
   [junit4]   2> 1788716 DEBUG (zkCallback-5346-thread-1-processing-n:127.0.0.1:34681_solr) [n:127.0.0.1:34681_solr    ] o.a.s.c.a.OverseerTriggerThread Refreshing /autoscaling.json with znode version 4
   [junit4]   2> 1788717 DEBUG (zkCallback-5346-thread-1-processing-n:127.0.0.1:34681_solr) [n:127.0.0.1:34681_solr    ] o.a.s.c.a.NodeLostTrigger Initial livenodes: [127.0.0.1:34681_solr, 127.0.0.1:41889_solr]
   [junit4]   2> 1788717 DEBUG (zkCallback-5346-thread-1-processing-n:127.0.0.1:34681_solr) [n:127.0.0.1:34681_solr    ] o.a.s.c.a.NodeAddedTrigger Initial livenodes: [127.0.0.1:34681_solr, 127.0.0.1:41889_solr]
   [junit4]   2> 1788717 DEBUG (zkCallback-5346-thread-1-processing-n:127.0.0.1:34681_solr) [n:127.0.0.1:34681_solr    ] o.a.s.c.a.NodeAddedTrigger NodeAddedTrigger node_added_trigger instantiated with properties: {event=nodeAdded, waitFor=3, actions=[{name=test, class=org.apache.solr.cloud.autoscaling.TriggerIntegrationTest$TestTriggerAction}], enabled=true}
   [junit4]   2> 1788717 DEBUG (OverseerAutoScalingTriggerThread-72125450635509766-127.0.0.1:34681_solr-n_0000000001) [n:127.0.0.1:34681_solr    ] o.a.s.c.a.OverseerTriggerThread Processed trigger updates upto znodeVersion 4
   [junit4]   2> 1788719 INFO  (OverseerAutoScalingTriggerThread-72125450635509766-127.0.0.1:34681_solr-n_0000000001) [n:127.0.0.1:34681_solr    ] o.a.s.c.a.TriggerIntegrationTest TestTriggerAction init
   [junit4]   2> 1788719 DEBUG (OverseerAutoScalingTriggerThread-72125450635509766-127.0.0.1:34681_solr-n_0000000001) [n:127.0.0.1:34681_solr    ] o.a.s.c.a.OverseerTriggerThread Current znodeVersion 4, lastZnodeVersion 4
   [junit4]   2> 1788719 INFO  (TEST-TriggerIntegrationTest.testNodeAddedTrigger-seed#[37322C213120DB0F]) [    ] o.e.j.s.Server jetty-9.4.8.v20171121, build timestamp: 2017-11-21T12:27:37-09:00, git hash: 82b8fb23f757335bb3329d540ce37a2a2615f0a8
   [junit4]   2> 1788719 DEBUG (ScheduledTrigger-8653-thread-3) [n:127.0.0.1:34681_solr    ] o.a.s.c.a.NodeAddedTrigger Running NodeAddedTrigger node_added_trigger
   [junit4]   2> 1788719 DEBUG (ScheduledTrigger-8653-thread-3) [n:127.0.0.1:34681_solr    ] o.a.s.c.a.NodeAddedTrigger Found livenodes: 2
   [junit4]   2> 1788720 INFO  (TEST-TriggerIntegrationTest.testNodeAddedTrigger-seed#[37322C213120DB0F]) [    ] o.e.j.s.session DefaultSessionIdManager workerName=node0
   [junit4]   2> 1788720 INFO  (TEST-TriggerIntegrationTest.testNodeAddedTrigger-seed#[37322C213120DB0F]) [    ] o.e.j.s.session No SessionScavenger set, using defaults
   [junit4]   2> 1788720 INFO  (TEST-TriggerIntegrationTest.testNodeAddedTrigger-seed#[37322C213120DB0F]) [    ] o.e.j.s.session Scavenging every 600000ms
   [junit4]   2> 1788720 INFO  (TEST-TriggerIntegrationTest.testNodeAddedTrigger-seed#[37322C213120DB0F]) [    ] o.e.j.s.h.ContextHandler Started o.e.j.s.ServletContextHandler@7d18ddb1{/solr,null,AVAILABLE}
   [junit4]   2> 1788720 INFO  (TEST-TriggerIntegrationTest.testNodeAddedTrigger-seed#[37322C213120DB0F]) [    ] o.e.j.s.AbstractConnector Started ServerConnector@404a762a{HTTP/1.1,[http/1.1]}{127.0.0.1:40611}
   [junit4]   2> 1788720 INFO  (TEST-TriggerIntegrationTest.testNodeAddedTrigger-seed#[37322C213120DB0F]) [    ] o.e.j.s.Server Started @1790580ms
   [junit4]   2> 1788720 INFO  (TEST-TriggerIntegrationTest.testNodeAddedTrigger-seed#[37322C213120DB0F]) [    ] o.a.s.c.s.e.JettySolrRunner Jetty properties: {hostContext=/solr, hostPort=40611}
   [junit4]   2> 1788721 ERROR (TEST-TriggerIntegrationTest.testNodeAddedTrigger-seed#[37322C213120DB0F]) [    ] o.a.s.u.StartupLoggingUtils Missing Java Option solr.log.dir. Logging may be missing or incomplete.
   [junit4]   2> 1788721 INFO  (TEST-TriggerIntegrationTest.testNodeAddedTrigger-seed#[37322C213120DB0F]) [    ] o.a.s.s.SolrDispatchFilter  ___      _       Welcome to Apache Solr™ version 7.4.0
   [junit4]   2> 1788721 INFO  (TEST-TriggerIntegrationTest.testNodeAddedTrigger-seed#[37322C213120DB0F]) [    ] o.a.s.s.SolrDispatchFilter / __| ___| |_ _   Starting in cloud mode on port null
   [junit4]   2> 1788721 INFO  (TEST-TriggerIntegrationTest.testNodeAddedTrigger-seed#[37322C213120DB0F]) [    ] o.a.s.s.SolrDispatchFilter \__ \/ _ \ | '_|  Install dir: null
   [junit4]   2> 1788721 INFO  (TEST-TriggerIntegrationTest.testNodeAddedTrigger-seed#[37322C213120DB0F]) [    ] o.a.s.s.SolrDispatchFilter |___/\___/_|_|    Start time: 2018-03-12T23:36:47.838409Z
   [junit4]   2> 1788722 INFO  (zkConnectionManagerCallback-5371-thread-1) [    ] o.a.s.c.c.ConnectionManager zkClient has connected
   [junit4]   2> 1788722 INFO  (TEST-TriggerIntegrationTest.testNodeAddedTrigger-seed#[37322C213120DB0F]) [    ] o.a.s.s.SolrDispatchFilter solr.xml found in ZooKeeper. Loading...
   [junit4]   2> 1788726 INFO  (TEST-TriggerIntegrationTest.testNodeAddedTrigger-seed#[37322C213120DB0F]) [    ] o.a.s.c.ZkContainer Zookeeper client=127.0.0.1:39071/solr
   [junit4]   2> 1788728 INFO  (zkConnectionManagerCallback-5375-thread-1) [    ] o.a.s.c.c.ConnectionManager zkClient has connected
   [junit4]   2> 1788730 INFO  (zkConnectionManagerCallback-5377-thread-1-processing-n:127.0.0.1:40611_solr) [n:127.0.0.1:40611_solr    ] o.a.s.c.c.ConnectionManager zkClient has connected
   [junit4]   2> 1788733 INFO  (TEST-TriggerIntegrationTest.testNodeAddedTrigger-seed#[37322C213120DB0F]) [n:127.0.0.1:40611_solr    ] o.a.s.c.c.ZkStateReader Updated live nodes from ZooKeeper... (0) -> (2)
   [junit4]   2> 1788734 INFO  (TEST-TriggerIntegrationTest.testNodeAddedTrigger-seed#[37322C213120DB0F]) [n:127.0.0.1:40611_solr    ] o.a.s.c.Overseer Overseer (id=null) closing
   [junit4]   2> 1788735 INFO  (TEST-TriggerIntegrationTest.testNodeAddedTrigger-seed#[37322C213120DB0F]) [n:127.0.0.1:40611_solr    ] o.a.s.c.ZkController Register node as live in ZooKeeper:/live_nodes/127.0.0.1:40611_solr
   [junit4]   2> 1788736 INFO  (zkCallback-5334-thread-1-processing-n:127.0.0.1:34681_solr) [n:127.0.0.1:34681_solr    ] o.a.s.c.c.ZkStateReader Updated live nodes from ZooKeeper... (2) -> (3)
   [junit4]   2> 1788736 INFO  (zkCallback-5352-thread-1) [    ] o.a.s.c.c.ZkStateReader Updated live nodes from ZooKeeper... (2) -> (3)
   [junit4]   2> 1788736 INFO  (zkCallback-5363-thread-1-processing-n:127.0.0.1:41889_solr) [n:127.0.0.1:41889_solr    ] o.a.s.c.c.ZkStateReader Updated live nodes from ZooKeeper... (2) -> (3)
   [junit4]   2> 1788736 INFO  (zkCallback-5368-thread-1-processing-n:127.0.0.1:41889_solr) [n:127.0.0.1:41889_solr    ] o.a.s.c.c.ZkStateReader Updated live nodes from ZooKeeper... (2) -> (3)
   [junit4]   2> 1788736 INFO  (zkCallback-5346-thread-1-processing-n:127.0.0.1:34681_solr) [n:127.0.0.1:34681_solr    ] o.a.s.c.c.ZkStateReader Updated live nodes from ZooKeeper... (2) -> (3)
   [junit4]   2> 1788736 INFO  (zkCallback-5352-thread-2) [    ] o.a.s.c.c.ZkStateReader Updated live nodes from ZooKeeper... (2) -> (3)
   [junit4]   2> 1788740 INFO  (zkCallback-5376-thread-1-processing-n:127.0.0.1:40611_solr) [n:127.0.0.1:40611_solr    ] o.a.s.c.c.ZkStateReader Updated live nodes from ZooKeeper... (2) -> (3)
   [junit4]   2> 1788805 INFO  (TEST-TriggerIntegrationTest.testNodeAddedTrigger-seed#[37322C213120DB0F]) [n:127.0.0.1:40611_solr    ] o.a.s.m.r.SolrJmxReporter JMX monitoring for 'solr_40611.solr.node' (registry 'solr.node') enabled at server: com.sun.jmx.mbeanserver.JmxMBeanServer@6b513f0c
   [junit4]   2> 1788816 INFO  (TEST-TriggerIntegrationTest.testNodeAddedTrigger-seed#[37322C213120DB0F]) [n:127.0.0.1:40611_solr    ] o.a.s.m.r.SolrJmxReporter JMX monitoring for 'solr_40611.solr.jvm' (registry 'solr.jvm') enabled at server: com.sun.jmx.mbeanserver.JmxMBeanServer@6b513f0c
   [junit4]   2> 1788817 INFO  (TEST-TriggerIntegrationTest.testNodeAddedTrigger-seed#[37322C213120DB0F]) [n:127.0.0.1:40611_solr    ] o.a.s.m.r.SolrJmxReporter JMX monitoring for 'solr_40611.solr.jetty' (registry 'solr.jetty') enabled at server: com.sun.jmx.mbeanserver.JmxMBeanServer@6b513f0c
   [junit4]   2> 1788818 INFO  (TEST-TriggerIntegrationTest.testNodeAddedTrigger-seed#[37322C213120DB0F]) [n:127.0.0.1:40611_solr    ] o.a.s.c.CorePropertiesLocator Found 0 core definitions underneath /home/jenkins/workspace/Lucene-Solr-7.x-Linux/solr/build/solr-core/test/J1/temp/solr.cloud.autoscaling.TriggerIntegrationTest_37322C213120DB0F-001/tempDir-001/node4/.
   [junit4]   2> 1788821 INFO  (zkConnectionManagerCallback-5382-thread-1-processing-n:127.0.0.1:40611_solr) [n:127.0.0.1:40611_solr    ] o.a.s.c.c.ConnectionManager zkClient has connected
   [junit4]   2> 1788822 INFO  (TEST-TriggerIntegrationTest.testNodeAddedTrigger-seed#[37322C213120DB0F]) [n:127.0.0.1:40611_solr    ] o.a.s.c.c.ZkStateReader Updated live nodes from ZooKeeper... (0) -> (3)
   [junit4]   2> 1788822 INFO  (TEST-TriggerIntegrationTest.testNodeAddedTrigger-seed#[37322C213120DB0F]) [n:127.0.0.1:40611_solr    ] o.a.s.c.s.i.ZkClientClusterStateProvider Cluster at 127.0.0.1:39071/solr ready
   [junit4]   2> 1789631 DEBUG (ScheduledTrigger-8653-thread-2) [n:127.0.0.1:34681_solr    ] o.a.s.c.a.NodeLostTrigger Running NodeLostTrigger: .auto_add_replicas with currently live nodes: 3
   [junit4]   2> 1789720 DEBUG (ScheduledTrigger-8653-thread-1) [n:127.0.0.1:34681_solr    ] o.a.s.c.a.NodeAddedTrigger Running NodeAddedTrigger node_added_trigger
   [junit4]   2> 1789720 DEBUG (ScheduledTrigger-8653-thread-1) [n:127.0.0.1:34681_solr    ] o.a.s.c.a.NodeAddedTrigger Found livenodes: 3
   [junit4]   2> 1789720 DEBUG (ScheduledTrigger-8653-thread-1) [n:127.0.0.1:34681_solr    ] o.a.s.c.a.NodeAddedTrigger Tracking new node: 127.0.0.1:40611_solr at time 1035415932281657
   [junit4]   2> 1790632 DEBUG (ScheduledTrigger-8653-thread-3) [n:127.0.0.1:34681_solr    ] o.a.s.c.a.NodeLostTrigger Running NodeLostTrigger: .auto_add_replicas with currently live nodes: 3
   [junit4]   2> 1790721 DEBUG (ScheduledTrigger-8653-thread-4) [n:127.0.0.1:34681_solr    ] o.a.s.c.a.NodeAddedTrigger Running NodeAddedTrigger node_added_trigger
   [junit4]   2> 1790721 DEBUG (ScheduledTrigger-8653-thread-4) [n:127.0.0.1:34681_solr    ] o.a.s.c.a.NodeAddedTrigger Found livenodes: 3
   [junit4]   2> 1791632 DEBUG (ScheduledTrigger-8653-thread-2) [n:127.0.0.1:34681_solr    ] o.a.s.c.a.NodeLostTrigger Running NodeLostTrigger: .auto_add_replicas with currently live nodes: 3
   [junit4]   2> 1791721 DEBUG (ScheduledTrigger-8653-thread-1) [n:127.0.0.1:34681_solr    ] o.a.s.c.a.NodeAddedTrigger Running NodeAddedTrigger node_added_trigger
   [junit4]   2> 1791721 DEBUG (ScheduledTrigger-8653-thread-1) [n:127.0.0.1:34681_solr    ] o.a.s.c.a.NodeAddedTrigger Found livenodes: 3
   [junit4]   2> 1792632 DEBUG (ScheduledTrigger-8653-thread-3) [n:127.0.0.1:34681_solr    ] o.a.s.c.a.NodeLostTrigger Running NodeLostTrigger: .auto_add_replicas with currently live nodes: 3
   [junit4]   2> 1792722 DEBUG (ScheduledTrigger-8653-thread-4) [n:127.0.0.1:34681_solr    ] o.a.s.c.a.NodeAddedTrigger Running NodeAddedTrigger node_added_trigger
   [junit4]   2> 1792722 DEBUG (ScheduledTrigger-8653-thread-4) [n:127.0.0.1:34681_solr    ] o.a.s.c.a.NodeAddedTrigger Found livenodes: 3
   [junit4]   2> 1792722 DEBUG (ScheduledTrigger-8653-thread-4) [n:127.0.0.1:34681_solr    ] o.a.s.c.a.NodeAddedTrigger NodeAddedTrigger node_added_trigger firing registered processor for nodes: [127.0.0.1:40611_solr] added at times [1035415932281657], now=1035418933526468
   [junit4]   2> 1792722 DEBUG (ScheduledTrigger-8653-thread-4) [n:127.0.0.1:34681_solr    ] o.a.s.c.a.ScheduledTriggers ++++++++ Cooldown inactive - processing event: {
   [junit4]   2>   "id":"3adb48ed6a339Tayp2yt84fwgg5188i2nygx53v",
   [junit4]   2>   "source":"node_added_trigger",
   [junit4]   2>   "eventTime":1035415932281657,
   [junit4]   2>   "eventType":"NODEADDED",
   [junit4]   2>   "properties":{
   [junit4]   2>     "eventTimes":[1035415932281657],
   [junit4]   2>     "nodeNames":["127.0.0.1:40611_solr"]}}
   [junit4]   2> 1792722 DEBUG (ScheduledTrigger-8653-thread-4) [n:127.0.0.1:34681_solr    ] o.a.s.c.a.ScheduledTriggers Pausing all triggers: [.auto_add_replicas, node_added_trigger]
   [junit4]   2> 1792723 INFO  (ScheduledTrigger-8653-thread-4) [n:127.0.0.1:34681_solr    ] o.a.s.c.a.SystemLogListener Collection .system does not exist, disabling logging.
   [junit4]   2> 1792724 DEBUG (AutoscalingActionExecutor-8654-thread-1-processing-n:127.0.0.1:34681_solr) [n:127.0.0.1:34681_solr    ] o.a.s.c.a.ScheduledTriggers -- processing actions for {
   [junit4]   2>   "id":"3adb48ed6a339Tayp2yt84fwgg5188i2nygx53v",
   [junit4]   2>   "source":"node_added_trigger",
   [junit4]   2>   "eventTime":1035415932281657,
   [junit4]   2>   "eventType":"NODEADDED",
   [junit4]   2>   "properties":{
   [junit4]   2>     "eventTimes":[1035415932281657],
   [junit4]   2>     "_enqueue_time_":1035418934046897,
   [junit4]   2>     "nodeNames":["127.0.0.1:40611_solr"]}}
   [junit4]   2> 1792725 DEBUG (AutoscalingActionExecutor-8654-thread-1-processing-n:127.0.0.1:34681_solr) [n:127.0.0.1:34681_solr    ] o.a.s.c.a.ScheduledTriggers Resuming trigger: .auto_add_replicas after 5000ms
   [junit4]   2> 1792725 DEBUG (AutoscalingActionExecutor-8654-thread-1-processing-n:127.0.0.1:34681_solr) [n:127.0.0.1:34681_solr    ] o.a.s.c.a.ScheduledTriggers Resuming trigger: node_added_trigger after 5000ms
   [junit4]   2> 1792725 DEBUG (AutoscalingActionExecutor-8654-thread-1-processing-n:127.0.0.1:34681_solr) [n:127.0.0.1:34681_solr    ] o.a.s.c.a.ScheduledTriggers -- processing took 1 ms for event id=3adb48ed6a339Tayp2yt84fwgg5188i2nygx53v
   [junit4]   2> 1792726 INFO  (qtp1303836426-23244) [n:127.0.0.1:34681_solr    ] o.a.s.s.HttpSolrCall [admin] webapp=null path=/admin/metrics params={prefix=CONTAINER.fs.usableSpace,CORE.coreName&wt=javabin&version=2&group=solr.node,solr.core} status=0 QTime=0
   [junit4]   2> 1792727 INFO  (qtp1709194721-23349) [n:127.0.0.1:40611_solr    ] o.a.s.s.HttpSolrCall [admin] webapp=null path=/admin/metrics params={prefix=CONTAINER.fs.usableSpace,CORE.coreName&wt=javabin&version=2&group=solr.node,solr.core} status=0 QTime=0
   [junit4]   2> 1792728 INFO  (qtp667617085-23322) [n:127.0.0.1:41889_solr    ] o.a.s.s.HttpSolrCall [admin] webapp=null path=/admin/metrics params={prefix=CONTAINER.fs.usableSpace,CORE.coreName&wt=javabin&version=2&group=solr.node,solr.core} status=0 QTime=0
   [junit4]   2> 1792728 DEBUG (qtp667617085-23323) [n:127.0.0.1:41889_solr    ] o.a.s.c.a.AutoScalingHandler Verified autoscaling configuration
   [junit4]   2> 1792728 INFO  (qtp667617085-23323) [n:127.0.0.1:41889_solr    ] o.a.s.s.HttpSolrCall [admin] webapp=null path=/cluster/autoscaling params={wt=javabin&version=2} status=0 QTime=3
   [junit4]   2> 1792729 DEBUG (zkCallback-5346-thread-1-processing-n:127.0.0.1:34681_solr) [n:127.0.0.1:34681_solr    ] o.a.s.c.a.OverseerTriggerThread Refreshing /autoscaling.json with znode version 5
   [junit4]   2> 1792729 DEBUG (zkCallback-5346-thread-1-processing-n:127.0.0.1:34681_solr) [n:127.0.0.1:34681_solr    ] o.a.s.c.a.NodeLostTrigger Initial livenodes: [127.0.0.1:40611_solr, 127.0.0.1:34681_solr, 127.0.0.1:41889_solr]
   [junit4]   2> 1792729 DEBUG (zkCallback-5346-thread-1-processing-n:127.0.0.1:34681_solr) [n:127.0.0.1:34681_solr    ] o.a.s.c.a.NodeAddedTrigger Initial livenodes: [127.0.0.1:40611_solr, 127.0.0.1:34681_solr, 127.0.0.1:41889_solr]
   [junit4]   2> 1792729 DEBUG (zkCallback-5346-thread-1-processing-n:127.0.0.1:34681_solr) [n:127.0.0.1:34681_solr    ] o.a.s.c.a.NodeAddedTrigger NodeAddedTrigger node_added_trigger instantiated with properties: {event=nodeAdded, waitFor=3, actions=[{name=test, class=org.apache.solr.cloud.autoscaling.TriggerIntegrationTest$TestTriggerAction}], enabled=true}
   [junit4]   2> 1792729 DEBUG (OverseerAutoScalingTriggerThread-72125450635509766-127.0.0.1:34681_solr-n_0000000001) [n:127.0.0.1:34681_solr    ] o.a.s.c.a.OverseerTriggerThread Processed trigger updates upto znodeVersion 5
   [junit4]   2> 1792729 DEBUG (OverseerAutoScalingTriggerThread-72125450635509766-127.0.0.1:34681_solr-n_0000000001) [n:127.0.0.1:34681_solr    ] o.a.s.c.a.OverseerTriggerThread Current znodeVersion 5, lastZnodeVersion 5
   [junit4]   2> 1794729 INFO  (TEST-TriggerIntegrationTest.testNodeAddedTrigger-seed#[37322C213120DB0F]) [    ] o.a.s.SolrTestCaseJ4 ###Ending testNodeAddedTrigger
   [junit4]   2> 1794741 INFO  (TEST-TriggerIntegrationTest.testCooldown-seed#[37322C213120DB0F]) [    ] o.a.s.SolrTestCaseJ4 ###Starting testCooldown
   [junit4]   2> 1794741 INFO  (TEST-TriggerIntegrationTest.testCooldown-seed#[37322C213120DB0F]) [    ] o.a.s.c.a.TriggerIntegrationTest Found 3 jetty instances running
   [junit4]   2> 1794741 INFO  (TEST-TriggerIntegrationTest.testCooldown-seed#[37322C213120DB0F]) [    ] o.a.s.c.a.TriggerIntegrationTest Shutdown extra jetty instance at port 40611
   [junit4]   2> 1794741 INFO  (TEST-TriggerIntegrationTest.testCooldown-seed#[37322C213120DB0F]) [    ] o.e.j.s.AbstractConnector Stopped ServerConnector@404a762a{HTTP/1.1,[http/1.1]}{127.0.0.1:0}
   [junit4]   2> 1794741 INFO  (TEST-TriggerIntegrationTest.testCooldown-seed#[37322C213120DB0F]) [    ] o.a.s.c.CoreContainer Shutting down CoreContainer instance=1502469311
   [junit4]   2> 1794742 INFO  (TEST-TriggerIntegrationTest.testCooldown-seed#[37322C213120DB0F]) [    ] o.a.s.m.SolrMetricManager Closing metric reporters for registry=solr.node, tag=null
   [junit4]   2> 1794742 INFO  (TEST-TriggerIntegrationTest.testCooldown-seed#[37322C213120DB0F]) [    ] o.a.s.m.r.SolrJmxReporter Closing reporter [org.apache.solr.metrics.reporters.SolrJmxReporter@1f81be4a: rootName = solr_40611, domain = solr.node, service url = null, agent id = null] for registry solr.node / com.codahale.metrics.MetricRegistry@43472331
   [junit4]   2> 1794746 INFO  (TEST-TriggerIntegrationTest.testCooldown-seed#[37322C213120DB0F]) [    ] o.a.s.m.SolrMetricManager Closing metric reporters for registry=solr.jvm, tag=null
   [junit4]   2> 1794746 INFO  (TEST-TriggerIntegrationTest.testCooldown-seed#[37322C213120DB0F]) [    ] o.a.s.m.r.SolrJmxReporter Closing reporter [org.apache.solr.metrics.reporters.SolrJmxReporter@523f83c6: rootName = solr_40611, domain = solr.jvm, service url = null, agent id = null] for registry solr.jvm / com.codahale.metrics.MetricRegistry@18df8351
   [junit4]   2> 1794750 INFO  (TEST-TriggerIntegrationTest.testCooldown-seed#[37322C213120DB0F]) [    ] o.a.s.m.SolrMetricManager Closing metric reporters for registry=solr.jetty, tag=null
   [junit4]   2> 1794750 INFO  (TEST-TriggerIntegrationTest.testCooldown-seed#[37322C213120DB0F]) [    ] o.a.s.m.r.SolrJmxReporter Closing reporter [org.apache.solr.metrics.reporters.SolrJmxReporter@684417f6: rootName = solr_40611, domain = solr.jetty, service url = null, agent id = null] for registry solr.jetty / com.codahale.metrics.MetricRegistry@3a9cf93
   [junit4]   2> 1794751 INFO  (TEST-TriggerIntegrationTest.testCooldown-seed#[37322C213120DB0F]) [    ] o.a.s.c.ZkController Remove node as live in ZooKeeper:/live_nodes/127.0.0.1:40611_solr
   [junit4]   2> 1794751 INFO  (TEST-TriggerIntegrationTest.testCooldown-seed#[37322C213120DB0F]) [    ] o.a.s.m.SolrMetricManager Closing metric reporters for registry=solr.cluster, tag=null
   [junit4]   2> 1794751 INFO  (zkCallback-5363-thread-1-processing-n:127.0.0.1:41889_solr) [n:127.0.0.1:41889_solr    ] o.a.s.c.c.ZkStateReader Updated live nodes from ZooKeeper... (3) -> (2)
   [junit4]   2> 1794751 INFO  (TEST-TriggerIntegrationTest.testCooldown-seed#[37322C213120DB0F]) [    ] o.a.s.c.TransientSolrCoreCacheDefault Allocating transient cache for 2147483647 transient cores
   [junit4]   2> 1794751 INFO  (zkCallback-5352-thread-1) [    ] o.a.s.c.c.ZkStateReader Updated live nodes from ZooKeeper... (3) -> (2)
   [junit4]   2> 1794751 INFO  (zkCallback-5368-thread-1-processing-n:127.0.0.1:41889_solr) [n:127.0.0.1:41889_solr    ] o.a.s.c.c.ZkStateReader Updated live nodes from ZooKeeper... (3) -> (2)
   [junit4]   2> 1794751 INFO  (zkCallback-5352-thread-2) [    ] o.a.s.c.c.ZkStateReader Updated live nodes from ZooKeeper... (3) -> (2)
   [junit4]   2> 1794751 INFO  (zkCallback-5334-thread-1-processing-n:127.0.0.1:34681_solr) [n:127.0.0.1:34681_solr    ] o.a.s.c.c.ZkStateReader Updated live nodes from ZooKeeper... (3) -> (2)
   [junit4]   2> 1794751 INFO  (zkCallback-5346-thread-1-processing-n:127.0.0.1:34681_solr) [n:127.0.0.1:34681_solr    ] o.a.s.c.c.ZkStateReader Updated live nodes from ZooKeeper... (3) -> (2)
   [junit4]   2> 1794751 INFO  (zkCallback-5376-thread-1-processing-n:127.0.0.1:40611_solr) [n:127.0.0.1:40611_solr    ] o.a.s.c.c.ZkStateReader Updated live nodes from ZooKeeper... (3) -> (2)
   [junit4]   2> 1794752 WARN  (NIOServerCxn.Factory:0.0.0.0/0.0.0.0:0) [    ] o.a.z.s.NIOServerCnxn Unable to read additional data from client sessionid 0x1003db718650013, likely client has closed socket
   [junit4]   2> 1794752 WARN  (zkCallback-5381-thread-1-processing-n:127.0.0.1:40611_solr) [n:127.0.0.1:40611_solr    ] o.a.s.c.c.ZkStateReader ZooKeeper watch triggered, but Solr cannot talk to ZK: [KeeperErrorCode = Session expired for /live_nodes]
   [junit4]   2> 1794753 INFO  (TEST-TriggerIntegrationTest.testCooldown-seed#[37322C213120DB0F]) [    ] o.e.j.s.h.ContextHandler Stopped o.e.j.s.ServletContextHandler@7d18ddb1{/solr,null,UNAVAILABLE}
   [junit4]   2> 1794753 INFO  (TEST-TriggerIntegrationTest.testCooldown-seed#[37322C213120DB0F]) [    ] o.e.j.s.session Stopped scavenging
   [junit4]   2> 1794753 INFO  (zkConnectionManagerCallback-5384-thread-1) [    ] o.a.s.c.c.ConnectionManager zkClient has connected
   [junit4]   2> 1794755 INFO  (qtp1303836426-23247) [n:127.0.0.1:34681_solr    ] o.a.s.h.a.CollectionsHandler Invoked Collection Action :overseerstatus with params action=OVERSEERSTATUS&wt=javabin&version=2 and sendToOCPQueue=true
   [junit4]   2> 1794757 INFO  (qtp1303836426-23247) [n:127.0.0.1:34681_solr    ] o.a.s.s.HttpSolrCall [admin] webapp=null path=/admin/collections params={action=OVERSEERSTATUS&wt=javabin&version=2} status=0 QTime=1
   [junit4]   2> 1794757 INFO  (TEST-TriggerIntegrationTest.testCooldown-seed#[37322C213120DB0F]) [    ] o.a.s.c.a.ScheduledTriggers -- removing trigger: .auto_add_replicas
   [junit4]   2> 1794758 INFO  (TEST-TriggerIntegrationTest.testCooldown-seed#[37322C213120DB0F]) [    ] o.a.s.c.a.ScheduledTriggers -- removing trigger: node_added_trigger
   [junit4]   2> 1794758 INFO  (TEST-TriggerIntegrationTest.testCooldown-seed#[37322C213120DB0F]) [    ] o.a.s.c.a.TriggerIntegrationTest /autoscaling.json reset, new znode version 6
   [junit4]   2> 1794758 DEBUG (zkCallback-5346-thread-1-processing-n:127.0.0.1:34681_solr) [n:127.0.0.1:34681_solr    ] o.a.s.c.a.OverseerTriggerThread Refreshing /autoscaling.json with znode version 6
   [junit4]   2> 1794758 DEBUG (OverseerAutoScalingTriggerThread-72125450635509766-127.0.0.1:34681_solr-n_0000000001) [n:127.0.0.1:34681_solr    ] o.a.s.c.a.OverseerTriggerThread Processed trigger updates upto znodeVersion 6
   [junit4]   2> 1794758 DEBUG (OverseerAutoScalingTriggerThread-72125450635509766-127.0.0.1:34681_solr-n_0000000001) [n:127.0.0.1:34681_solr    ] o.a.s.c.a.OverseerTriggerThread -- clean old nodeLost markers
   [junit4]   2> 1794759 INFO  (TEST-TriggerIntegrationTest.testCooldown-seed#[37322C213120DB0F]) [    ] o.a.s.c.c.ZkStateReader Updated live nodes from ZooKeeper... (0) -> (2)
   [junit4]   2> 1794759 DEBUG (OverseerAutoScalingTriggerThread-72125450635509766-127.0.0.1:34681_solr-n_0000000001) [n:127.0.0.1:34681_solr    ] o.a.s.c.a.OverseerTriggerThread   -- deleted /autoscaling/nodeLost/127.0.0.1:40611_solr
   [junit4]   2> 1794759 DEBUG (OverseerAutoScalingTriggerThread-72125450635509766-127.0.0.1:34681_solr-n_0000000001) [n:127.0.0.1:34681_solr    ] o.a.s.c.a.OverseerTriggerThread -- clean old nodeAdded markers
   [junit4]   2> 1794759 DEBUG (OverseerAutoScalingTriggerThread-72125450635509766-127.0.0.1:34681_solr-n_0000000001) [n:127.0.0.1:34681_solr    ] o.a.s.c.a.OverseerTriggerThread Current znodeVersion 6, lastZnodeVersion 6
   [junit4]   2> 1794761 INFO  (TEST-TriggerIntegrationTest.testCooldown-seed#[37322C213120DB0F]) [    ] o.e.j.s.AbstractConnector Stopped ServerConnector@32123106{HTTP/1.1,[http/1.1]}{127.0.0.1:0}
   [junit4]   2> 1794761 INFO  (TEST-TriggerIntegrationTest.testCooldown-seed#[37322C213120DB0F]) [    ] o.a.s.c.CoreContainer Shutting down CoreContainer instance=1134783469
   [junit4]   2> 1794761 INFO  (TEST-TriggerIntegrationTest.testCooldown-seed#[37322C213120DB0F]) [    ] o.a.s.m.SolrMetricManager Closing metric reporters for registry=solr.node, tag=null
   [junit4]   2> 1794761 INFO  (TEST-TriggerIntegrationTest.testCooldown-seed#[37322C213120DB0F]) [    ] o.a.s.m.r.SolrJmxReporter Closing reporter [org.apache.solr.metrics.reporters.SolrJmxReporter@78712bb0: rootName = solr_34681, domain = solr.node, service url = null, agent id = null] for registry solr.node / com.codahale.metrics.MetricRegistry@2888b173
   [junit4]   2> 1794767 INFO  (TEST-TriggerIntegrationTest.testCooldown-seed#[37322C213120DB0F]) [    ] o.a.s.m.SolrMetricManager Closing metric reporters for registry=solr.jvm, tag=null
   [junit4]   2> 1794767 INFO  (TEST-TriggerIntegrationTest.testCooldown-seed#[37322C213120DB0F]) [    ] o.a.s.m.r.SolrJmxReporter Closing reporter [org.apache.solr.metrics.reporters.SolrJmxReporter@1931176f: rootName = solr_34681, domain = solr.jvm, service url = null, agent id = null] for registry solr.jvm / com.codahale.metrics.MetricRegistry@18df8351
   [junit4]   2> 1794772 INFO  (TEST-TriggerIntegrationTest.testCooldown-seed#[37322C213120DB0F]) [    ] o.a.s.m.SolrMetricManager Closing metric reporters for registry=solr.jetty, tag=null
   [junit4]   2> 1794772 INFO  (TEST-TriggerIntegrationTest.testCooldown-seed#[37322C213120DB0F]) [    ] o.a.s.m.r.SolrJmxReporter Closing reporter [org.apache.solr.metrics.reporters.SolrJmxReporter@7ff86b6a: rootName = solr_34681, domain = solr.jetty, service url = null, agent id = null] for registry solr.jetty / com.codahale.metrics.MetricRegistry@3a9cf93
   [junit4]   2> 1794773 INFO  (TEST-TriggerIntegrationTest.testCooldown-seed#[37322C213120DB0F]) [    ] o.a.s.c.ZkController Remove node as live in ZooKeeper:/live_nodes/127.0.0.1:34681_solr
   [junit4]   2> 1794773 INFO  (zkCallback-5363-thread-1-processing-n:127.0.0.1:41889_solr) [n:127.0.0.1:41889_solr    ] o.a.s.c.c.ZkStateReader Updated live nodes from ZooKeeper... (2) -> (1)
   [junit4]   2> 1794773 INFO  (zkCallback-5352-thread-2) [    ] o.a.s.c.c.ZkStateReader Updated live nodes from ZooKeeper... (2) -> (1)
   [junit4]   2> 1794773 INFO  (zkCallback-5368-thread-1-processing-n:127.0.0.1:41889_solr) [n:127.0.0.1:41889_solr    ] o.a.s.c.c.ZkStateReader Updated live nodes from ZooKeeper... (2) -> (1)
   [junit4]   2> 1794774 INFO  (TEST-TriggerIntegrationTest.testCooldown-seed#[37322C213120DB0F]) [    ] o.a.s.m.SolrMetricManager Closing metric reporters for registry=solr.cluster, tag=null
   [junit4]   2> 1794774 INFO  (zkCallback-5352-thread-1) [    ] o.a.s.c.c.ZkStateReader Updated live nodes from ZooKeeper... (2) -> (1)
   [junit4]   2> 1794774 INFO  (zkCallback-5346-thread-1-processing-n:127.0.0.1:34681_solr) [n:127.0.0.1:34681_solr    ] o.a.s.c.c.ZkStateReader Updated live nodes from ZooKeeper... (2) -> (1)
   [junit4]   2> 1794774 INFO  (TEST-TriggerIntegrationTest.testCooldown-seed#[37322C213120DB0F]) [    ] o.a.s.c.TransientSolrCoreCacheDefault Allocating transient cache for 2147483647 transient cores
   [junit4]   2> 1794774 INFO  (zkCallback-5334-thread-1-processing-n:127.0.0.1:34681_solr) [n:127.0.0.1:34681_solr    ] o.a.s.c.c.ZkStateReader Updated live nodes from ZooKeeper... (2) -> (1)
   [junit4]   2> 1794774 INFO  (TEST-TriggerIntegrationTest.testCooldown-seed#[37322C213120DB0F]) [    ] o.a.s.c.Overseer Overseer (id=72125450635509766-127.0.0.1:34681_solr-n_0000000001) closing
   [junit4]   2> 1794774 INFO  (zkCallback-5352-thread-3) [    ] o.a.s.c.c.ZkStateReader Updated live nodes from ZooKeeper... (2) -> (1)
   [junit4]   2> 1794774 INFO  (OverseerStateUpdate-72125450635509766-127.0.0.1:34681_solr-n_0000000001) [n:127.0.0.1:34681_solr    ] o.a.s.c.Overseer Overseer Loop exiting : 127.0.0.1:34681_solr
   [junit4]   2> 1794774 WARN  (OverseerAutoScalingTriggerThread-72125450635509766-127.0.0.1:34681_solr-n_0000000001) [n:127.0.0.1:34681_solr    ] o.a.s.c.a.OverseerTriggerThread OverseerTriggerThread woken up but we are closed, exiting.
   [junit4]   2> 1794774 DEBUG (TEST-TriggerIntegrationTest.testCooldown-seed#[37322C213120DB0F]) [    ] o.a.s.c.a.OverseerTriggerThread OverseerTriggerThread has been closed explicitly
   [junit4]   2> 1794775 INFO  (zkCallback-5363-thread-1-processing-n:127.0.0.1:41889_solr) [n:127.0.0.1:41889_solr    ] o.a.s.c.OverseerElectionContext I am going to be the leader 127.0.0.1:41889_solr
   [junit4]   2> 1794775 INFO  (TEST-TriggerIntegrationTest.testCooldown-seed#[37322C213120DB0F]) [    ] o.e.j.s.h.ContextHandler Stopped o.e.j.s.ServletContextHandler@6b397a59{/solr,null,UNAVAILABLE}
   [junit4]   2> 1794775 INFO  (TEST-TriggerIntegrationTest.testCooldown-seed#[37322C213120DB0F]) [    ] o.e.j.s.session Stopped scavenging
   [junit4]   2> 1794776 INFO  (zkCallback-5363-thread-1-processing-n:127.0.0.1:41889_solr) [n:127.0.0.1:41889_solr    ] o.a.s.c.Overseer Overseer (id=72125450635509774-127.0.0.1:41889_solr-n_0000000002) starting
   [junit4]   2> 1794777 DEBUG (OverseerAutoScalingTriggerThread-72125450635509774-127.0.0.1:41889_solr-n_0000000002) [n:127.0.0.1:41889_solr    ] o.a.s.c.a.OverseerTriggerThread Adding .autoAddReplicas trigger
   [junit4]   2> 1794778 DEBUG (OverseerAutoScalingTriggerThread-72125450635509774-127.0.0.1:41889_solr-n_0000000002) [n:127.0.0.1:41889_solr    ] o.a.s.c.a.OverseerTriggerThread Refreshing /autoscaling.json with znode version 7
   [junit4]   2> 1794778 DEBUG (OverseerAutoScalingTriggerThread-72125450635509774-127.0.0.1:41889_solr-n_0000000002) [n:127.0.0.1:41889_solr    ] o.a.s.c.a.NodeLostTrigger Initial livenodes: [127.0.0.1:41889_solr]
   [junit4]   2> 1794778 DEBUG (OverseerAutoScalingTriggerThread-72125450635509774-127.0.0.1:41889_solr-n_0000000002) [n:127.0.0.1:41889_solr    ] o.a.s.c.a.OverseerTriggerThread Current znodeVersion 7, lastZnodeVersion -1
   [junit4]   2> 1794778 DEBUG (OverseerAutoScalingTriggerThread-72125450635509774-127.0.0.1:41889_solr-n_0000000002) [n:127.0.0.1:41889_solr    ] o.a.s.c.a.OverseerTriggerThread Processed trigger updates upto znodeVersion 7
   [junit4]   2> 1794779 DEBUG (OverseerAutoScalingTriggerThread-72125450635509774-127.0.0.1:41889_solr-n_0000000002) [n:127.0.0.1:41889_solr    ] o.a.s.c.a.OverseerTriggerThread -- clean old nodeAdded markers
   [junit4]   2> 1794779 DEBUG (OverseerAutoScalingTriggerThread-72125450635509774-127.0.0.1:41889_solr-n_0000000002) [n:127.0.0.1:41889_solr    ] o.a.s.c.a.OverseerTriggerThread Current znodeVersion 7, lastZnodeVersion 7
   [junit4]   2> 1794779 DEBUG (ScheduledTrigger-8671-thread-1) [n:127.0.0.1:41889_solr    ] o.a.s.c.a.NodeLostTrigger Running NodeLostTrigger: .auto_add_replicas with currently live nodes: 1
   [junit4]   2> 1795779 DEBUG (ScheduledTrigger-8671-thread-1) [n:127.0.0.1:41889_solr    ] o.a.s.c.a.NodeLostTrigger Running NodeLostTrigger: .auto_add_replicas with currently live nodes: 1
   [junit4]   2> 1796780 DEBUG (ScheduledTrigger-8671-thread-2) [n:127.0.0.1:41889_solr    ] o.a.s.c.a.NodeLostTrigger Running NodeLostTrigger: .auto_add_replicas with currently live nodes: 1
   [junit4]   2> 1797781 DEBUG (ScheduledTrigger-8671-thread-1) [n:127.0.0.1:41889_solr    ] o.a.s.c.a.NodeLostTrigger Running NodeLostTrigger: .auto_add_replicas with currently live nodes: 1
   [junit4]   2> 1798781 DEBUG (ScheduledTrigger-8671-thread-1) [n:127.0.0.1:41889_solr    ] o.a.s.c.a.NodeLostTrigger Running NodeLostTrigger: .auto_add_replicas with currently live nodes: 1
   [junit4]   2> 1799776 INFO  (TEST-TriggerIntegrationTest.testCooldown-seed#[37322C213120DB0F]) [    ] o.e.j.s.Server jetty-9.4.8.v20171121, build timestamp: 2017-11-21T12:27:37-09:00, git hash: 82b8fb23f757335bb3329d540ce37a2a2615f0a8
   [junit4]   2> 1799777 INFO  (TEST-TriggerIntegrationTest.testCooldown-seed#[37322C213120DB0F]) [    ] o.e.j.s.session DefaultSessionIdManager workerName=node0
   [junit4]   2> 1799777 INFO  (TEST-TriggerIntegrationTest.testCooldown-seed#[37322C213120DB0F]) [    ] o.e.j.s.session No SessionScavenger set, using defaults
   [junit4]   2> 1799777 INFO  (TEST-TriggerIntegrationTest.testCooldown-seed#[37322C213120DB0F]) [    ] o.e.j.s.session Scavenging every 660000ms
   [junit4]   2> 1799778 INFO  (TEST-TriggerIntegrationTest.testCooldown-seed#[37322C213120DB0F]) [    ] o.e.j.s.h.ContextHandler Started o.e.j.s.ServletContextHandler@5431c4af{/solr,null,AVAILABLE}
   [junit4]   2> 1799778 INFO  (TEST-TriggerIntegrationTest.testCooldown-seed#[37322C213120DB0F]) [    ] o.e.j.s.AbstractConnector Started ServerConnector@13046c25{HTTP/1.1,[http/1.1]}{127.0.0.1:41513}
   [junit4]   2> 1799778 INFO  (TEST-TriggerIntegrationTest.testCooldown-seed#[37322C213120DB0F]) [    ] o.e.j.s.Server Started @1801638ms
   [junit4]   2> 1799778 INFO  (TEST-TriggerIntegrationTest.testCooldown-seed#[37322C213120DB0F]) [    ] o.a.s.c.s.e.JettySolrRunner Jetty properties: {hostContext=/solr, hostPort=41513}
   [junit4]   2> 1799778 ERROR (TEST-TriggerIntegrationTest.testCooldown-seed#[37322C213120DB0F]) [    ] o.a.s.u.StartupLoggingUtils Missing Java Option solr.log.dir. Logging may be missing or incomplete.
   [junit4]   2> 1799778 INFO  (TEST-TriggerIntegrationTest.testCooldown-seed#[37322C213120DB0F]) [    ] o.a.s.s.SolrDispatchFilter  ___      _       Welcome to Apache Solr™ version 7.4.0
   [junit4]   2> 1799779 INFO  (TEST-TriggerIntegrationTest.testCooldown-seed#[37322C213120DB0F]) [    ] o.a.s.s.SolrDispatchFilter / __| ___| |_ _   Starting in cloud mode on port null
   [junit4]   2> 1799779 INFO  (TEST-TriggerIntegrationTest.testCooldown-seed#[37322C213120DB0F]) [    ] o.a.s.s.SolrDispatchFilter \__ \/ _ \ | '_|  Install dir: null
   [junit4]   2> 1799779 INFO  (TEST-TriggerIntegrationTest.testCooldown-seed#[37322C213120DB0F]) [    ] o.a.s.s.SolrDispatchFilter |___/\___/_|_|    Start time: 2018-03-12T23:36:58.896137Z
   [junit4]   2> 1799780 INFO  (zkConnectionManagerCallback-5387-thread-1) [    ] o.a.s.c.c.ConnectionManager zkClient has connected
   [junit4]   2> 1799780 INFO  (TEST-TriggerIntegrationTest.testCooldown-seed#[37322C213120DB0F]) [    ] o.a.s.s.SolrDispatchFilter solr.xml found in ZooKeeper. Loading...
   [junit4]   2> 1799781 DEBUG (ScheduledTrigger-8671-thread-1) [n:127.0.0.1:41889_solr    ] o.a.s.c.a.NodeLostTrigger Running NodeLostTrigger: .au

[...truncated too long message...]

= null] for registry solr.jetty / com.codahale.metrics.MetricRegistry@c4d03f9
   [junit4]   2> 612379 INFO  (jetty-closer-589-thread-2) [    ] o.a.s.c.ZkController Remove node as live in ZooKeeper:/live_nodes/127.0.0.1:37951_solr
   [junit4]   2> 612379 INFO  (jetty-closer-589-thread-2) [    ] o.a.s.m.SolrMetricManager Closing metric reporters for registry=solr.cluster, tag=null
   [junit4]   2> 612379 INFO  (jetty-closer-589-thread-2) [    ] o.a.s.c.TransientSolrCoreCacheDefault Allocating transient cache for 2147483647 transient cores
   [junit4]   2> 612379 INFO  (zkCallback-1144-thread-1-processing-n:127.0.0.1:45163_solr) [n:127.0.0.1:45163_solr    ] o.a.s.c.c.ZkStateReader Updated live nodes from ZooKeeper... (2) -> (1)
   [junit4]   2> 612379 INFO  (zkCallback-1139-thread-1-processing-n:127.0.0.1:45163_solr) [n:127.0.0.1:45163_solr    ] o.a.s.c.c.ZkStateReader Updated live nodes from ZooKeeper... (2) -> (1)
   [junit4]   2> 612379 INFO  (zkCallback-1160-thread-1-processing-n:127.0.0.1:37951_solr) [n:127.0.0.1:37951_solr    ] o.a.s.c.c.ZkStateReader Updated live nodes from ZooKeeper... (2) -> (1)
   [junit4]   2> 612380 INFO  (zkCallback-1155-thread-1-processing-n:127.0.0.1:37951_solr) [n:127.0.0.1:37951_solr    ] o.a.s.c.c.ZkStateReader Updated live nodes from ZooKeeper... (2) -> (1)
   [junit4]   2> 612381 INFO  (jetty-closer-589-thread-2) [    ] o.e.j.s.h.ContextHandler Stopped o.e.j.s.ServletContextHandler@7dfcc55c{/solr,null,UNAVAILABLE}
   [junit4]   2> 612381 INFO  (jetty-closer-589-thread-2) [    ] o.e.j.s.session Stopped scavenging
   [junit4]   2> 612382 INFO  (jetty-closer-589-thread-1) [    ] o.a.s.m.SolrMetricManager Closing metric reporters for registry=solr.jetty, tag=null
   [junit4]   2> 612382 INFO  (jetty-closer-589-thread-1) [    ] o.a.s.m.r.SolrJmxReporter Closing reporter [org.apache.solr.metrics.reporters.SolrJmxReporter@6b5eeac4: rootName = solr_45163, domain = solr.jetty, service url = null, agent id = null] for registry solr.jetty / com.codahale.metrics.MetricRegistry@c4d03f9
   [junit4]   2> 612383 INFO  (jetty-closer-589-thread-1) [    ] o.a.s.c.ZkController Remove node as live in ZooKeeper:/live_nodes/127.0.0.1:45163_solr
   [junit4]   2> 612383 INFO  (jetty-closer-589-thread-1) [    ] o.a.s.m.SolrMetricManager Closing metric reporters for registry=solr.cluster, tag=null
   [junit4]   2> 612383 INFO  (jetty-closer-589-thread-1) [    ] o.a.s.c.TransientSolrCoreCacheDefault Allocating transient cache for 2147483647 transient cores
   [junit4]   2> 612383 INFO  (zkCallback-1139-thread-1-processing-n:127.0.0.1:45163_solr) [n:127.0.0.1:45163_solr    ] o.a.s.c.c.ZkStateReader Updated live nodes from ZooKeeper... (1) -> (0)
   [junit4]   2> 612383 INFO  (zkCallback-1144-thread-1-processing-n:127.0.0.1:45163_solr) [n:127.0.0.1:45163_solr    ] o.a.s.c.c.ZkStateReader Updated live nodes from ZooKeeper... (1) -> (0)
   [junit4]   2> 612383 INFO  (jetty-closer-589-thread-1) [    ] o.a.s.c.Overseer Overseer (id=72125532028600490-127.0.0.1:45163_solr-n_0000000037) closing
   [junit4]   2> 612383 INFO  (OverseerStateUpdate-72125532028600490-127.0.0.1:45163_solr-n_0000000037) [n:127.0.0.1:45163_solr    ] o.a.s.c.Overseer Overseer Loop exiting : 127.0.0.1:45163_solr
   [junit4]   2> 612384 WARN  (OverseerAutoScalingTriggerThread-72125532028600490-127.0.0.1:45163_solr-n_0000000037) [n:127.0.0.1:45163_solr    ] o.a.s.c.a.OverseerTriggerThread OverseerTriggerThread woken up but we are closed, exiting.
   [junit4]   2> 612384 DEBUG (jetty-closer-589-thread-1) [    ] o.a.s.c.a.OverseerTriggerThread OverseerTriggerThread has been closed explicitly
   [junit4]   2> 612385 INFO  (jetty-closer-589-thread-1) [    ] o.e.j.s.h.ContextHandler Stopped o.e.j.s.ServletContextHandler@7a06784b{/solr,null,UNAVAILABLE}
   [junit4]   2> 612385 INFO  (jetty-closer-589-thread-1) [    ] o.e.j.s.session Stopped scavenging
   [junit4]   2> 612386 ERROR (SUITE-TriggerIntegrationTest-seed#[37322C213120DB0F]-worker) [    ] o.a.z.s.ZooKeeperServer ZKShutdownHandler is not registered, so ZooKeeper server won't take any action on ERROR or SHUTDOWN server state changes
   [junit4]   2> 612386 INFO  (SUITE-TriggerIntegrationTest-seed#[37322C213120DB0F]-worker) [    ] o.a.s.c.ZkTestServer connecting to 127.0.0.1:45677 45677
   [junit4]   2> 613267 INFO  (Thread-467) [    ] o.a.s.c.ZkTestServer connecting to 127.0.0.1:45677 45677
   [junit4]   2> 613268 WARN  (Thread-467) [    ] o.a.s.c.ZkTestServer Watch limit violations: 
   [junit4]   2> Maximum concurrent create/delete watches above limit:
   [junit4]   2> 
   [junit4]   2> 	96	/solr/aliases.json
   [junit4]   2> 	96	/solr/clusterprops.json
   [junit4]   2> 	47	/solr/collections/collection1/terms/shard1
   [junit4]   2> 	40	/solr/security.json
   [junit4]   2> 	33	/solr/collections/testMetricTrigger/terms/shard1
   [junit4]   2> 	21	/solr/collections/testScheduledTrigger/terms/shard1
   [junit4]   2> 	9	/solr/configs/conf
   [junit4]   2> 	7	/solr/collections/testMetricTrigger/terms/shard2
   [junit4]   2> 	5	/solr/collections/collection1/collectionprops.json
   [junit4]   2> 	4	/solr/collections/testMetricTrigger/collectionprops.json
   [junit4]   2> 	4	/solr/configs/testScheduledTrigger.AUTOCREATED/managed-schema
   [junit4]   2> 	3	/solr/collections/testScheduledTrigger/collectionprops.json
   [junit4]   2> 	3	/solr/configs/testScheduledTrigger.AUTOCREATED
   [junit4]   2> 
   [junit4]   2> Maximum concurrent data watches above limit:
   [junit4]   2> 
   [junit4]   2> 	96	/solr/clusterstate.json
   [junit4]   2> 	46	/solr/collections/collection1/state.json
   [junit4]   2> 	38	/solr/collections/testMetricTrigger/state.json
   [junit4]   2> 	34	/solr/collections/testScheduledTrigger/state.json
   [junit4]   2> 	28	/solr/autoscaling.json
   [junit4]   2> 	3	/solr/overseer_elect/election/72125532028600395-127.0.0.1:43067_solr-n_0000000016
   [junit4]   2> 	3	/solr/overseer_elect/election/72125532028600365-127.0.0.1:41427_solr-n_0000000009
   [junit4]   2> 	3	/solr/overseer_elect/election/72125532028600451-127.0.0.1:36563_solr-n_0000000028
   [junit4]   2> 	2	/solr/collections/collection1/leader_elect/shard1/election/72125532028600451-core_node4-n_0000000000
   [junit4]   2> 	2	/solr/overseer_elect/election/72125532028600356-127.0.0.1:34589_solr-n_0000000007
   [junit4]   2> 	2	/solr/collections/testScheduledTrigger/leader_elect/shard1/election/72125532028600422-core_node6-n_0000000000
   [junit4]   2> 	2	/solr/collections/collection1/leader_elect/shard1/election/72125532028600446-core_node6-n_0000000002
   [junit4]   2> 	2	/solr/overseer_elect/election/72125532028600377-127.0.0.1:39165_solr-n_0000000012
   [junit4]   2> 	2	/solr/overseer_elect/election/72125532028600438-127.0.0.1:41025_solr-n_0000000025
   [junit4]   2> 
   [junit4]   2> Maximum concurrent children watches above limit:
   [junit4]   2> 
   [junit4]   2> 	681	/solr/live_nodes
   [junit4]   2> 	155	/solr/collections
   [junit4]   2> 	28	/solr/overseer/queue-work
   [junit4]   2> 	28	/solr/overseer/queue
   [junit4]   2> 	28	/solr/overseer/collection-queue-work
   [junit4]   2> 	27	/solr/autoscaling/events/.auto_add_replicas
   [junit4]   2> 	2	/solr/autoscaling/events/node_lost_triggerMR
   [junit4]   2> 	2	/solr/autoscaling/events/node_added_triggerCTOOR
   [junit4]   2> 	2	/solr/autoscaling/events/metric_trigger
   [junit4]   2> 
   [junit4]   2> NOTE: leaving temporary files on disk at: /home/jenkins/workspace/Lucene-Solr-7.x-Linux/solr/build/solr-core/test/J2/temp/solr.cloud.autoscaling.TriggerIntegrationTest_37322C213120DB0F-001
   [junit4]   2> NOTE: test params are: codec=Lucene70, sim=RandomSimilarity(queryNorm=false): {}, locale=tk-TM, timezone=Pacific/Kosrae
   [junit4]   2> NOTE: Linux 4.13.0-36-generic amd64/Oracle Corporation 9.0.4 (64-bit)/cpus=8,threads=1,free=214098912,total=536870912
   [junit4]   2> NOTE: All tests run in this JVM: [TriggerIntegrationTest, TriggerIntegrationTest]
   [junit4] Completed [5/5 (2!)] on J2 in 303.70s, 15 tests, 1 failure <<< FAILURES!

[...truncated 12 lines...]
BUILD FAILED
/home/jenkins/workspace/Lucene-Solr-7.x-Linux/lucene/common-build.xml:1561: The following error occurred while executing this line:
/home/jenkins/workspace/Lucene-Solr-7.x-Linux/lucene/common-build.xml:1085: There were test failures: 5 suites, 75 tests, 2 failures [seed: 37322C213120DB0F]

Total time: 10 minutes 17 seconds

[repro] Setting last failure code to 256

[repro] Failures:
[repro]   2/5 failed: org.apache.solr.cloud.autoscaling.TriggerIntegrationTest
[repro] Exiting with code 256
+ mv lucene/build lucene/build.repro
+ mv solr/build solr/build.repro
+ mv lucene/build.orig lucene/build
+ mv solr/build.orig solr/build
Archiving artifacts
Setting ANT_1_8_2_HOME=/var/lib/jenkins/tools/hudson.tasks.Ant_AntInstallation/ANT_1.8.2
[WARNINGS] Parsing warnings in console log with parser Java Compiler (javac)
Setting ANT_1_8_2_HOME=/var/lib/jenkins/tools/hudson.tasks.Ant_AntInstallation/ANT_1.8.2
Setting ANT_1_8_2_HOME=/var/lib/jenkins/tools/hudson.tasks.Ant_AntInstallation/ANT_1.8.2
<Git Blamer> Using GitBlamer to create author and commit information for all warnings.
<Git Blamer> GIT_COMMIT=0ed0f2a219703e383bb9938c7e5851a41c12e248, workspace=/var/lib/jenkins/workspace/Lucene-Solr-7.x-Linux
[WARNINGS] Computing warning deltas based on reference build #1520
Recording test results
Setting ANT_1_8_2_HOME=/var/lib/jenkins/tools/hudson.tasks.Ant_AntInstallation/ANT_1.8.2
Build step 'Publish JUnit test result report' changed build result to UNSTABLE
Email was triggered for: Unstable (Test Failures)
Sending email for trigger: Unstable (Test Failures)
Setting ANT_1_8_2_HOME=/var/lib/jenkins/tools/hudson.tasks.Ant_AntInstallation/ANT_1.8.2
Setting ANT_1_8_2_HOME=/var/lib/jenkins/tools/hudson.tasks.Ant_AntInstallation/ANT_1.8.2
Setting ANT_1_8_2_HOME=/var/lib/jenkins/tools/hudson.tasks.Ant_AntInstallation/ANT_1.8.2
Setting ANT_1_8_2_HOME=/var/lib/jenkins/tools/hudson.tasks.Ant_AntInstallation/ANT_1.8.2