You are viewing a plain text version of this content. The canonical link for it is here.
Posted to dev@brooklyn.apache.org by Apache Jenkins Server <je...@builds.apache.org> on 2021/09/07 17:12:53 UTC

Build failed in Jenkins: Brooklyn » Brooklyn - Client module » master #18

See <https://ci-builds.apache.org/job/Brooklyn/job/brooklyn-client/job/master/18/display/redirect>

Changes:


------------------------------------------
[...truncated 5084 lines...]
     [exec] go: finding module for package k8s.io/apimachinery/pkg/util/wait
     [exec] go: finding module for package k8s.io/api/imagepolicy/v1alpha1
     [exec] go: finding module for package github.com/Azure/go-autorest/autorest
     [exec] go: downloading github.com/davecgh/go-spew v1.1.1
     [exec] go: finding module for package k8s.io/apimachinery/pkg/types
     [exec] go: finding module for package k8s.io/apimachinery/pkg/runtime
     [exec] go: finding module for package k8s.io/api/apps/v1
     [exec] go: downloading github.com/Azure/go-autorest v1.1.1
     [exec] go: finding module for package k8s.io/apimachinery/pkg/runtime/serializer
     [exec] go: finding module for package k8s.io/apimachinery/pkg/util/yaml
     [exec] go: finding module for package k8s.io/apimachinery/pkg/api/errors
     [exec] go: downloading github.com/gophercloud/gophercloud v0.20.0
     [exec] go: downloading golang.org/x/net v0.0.0-20190404232315-eb5bcb51f2a3
     [exec] go: downloading golang.org/x/time v0.0.0-20210723032227-1f47c861a9ac
     [exec] go: downloading github.com/Azure/go-autorest/autorest v0.11.20
     [exec] go: finding module for package github.com/golang/groupcache/lru
     [exec] go: finding module for package k8s.io/apimachinery/pkg/apis/meta/internalversion
     [exec] go: downloading github.com/golang/groupcache v0.0.0-20210331224755-41bb18bfe9da
     [exec] go: finding module for package k8s.io/api/events/v1beta1
     [exec] go: finding module for package k8s.io/apimachinery/pkg/util/httpstream
     [exec] go: finding module for package k8s.io/klog
     [exec] go: finding module for package k8s.io/apimachinery/pkg/util/errors
     [exec] go: finding module for package github.com/imdario/mergo
     [exec] go: finding module for package k8s.io/apimachinery/pkg/fields
     [exec] go: finding module for package k8s.io/apimachinery/pkg/util/diff
     [exec] go: downloading github.com/Azure/go-autorest v14.2.0+incompatible
     [exec] go: downloading k8s.io/klog v1.0.0
     [exec] go: finding module for package github.com/Azure/go-autorest/autorest/adal
     [exec] go: downloading github.com/imdario/mergo v0.3.12
     [exec] go: finding module for package k8s.io/utils/buffer
     [exec] go: downloading github.com/Azure/go-autorest/autorest/adal v0.9.15
     [exec] go: downloading k8s.io/utils v0.0.0-20210820185131-d34e5cb4466e
     [exec] go: finding module for package k8s.io/api/batch/v2alpha1
     [exec] go: finding module for package k8s.io/api/batch/v1
     [exec] go: finding module for package github.com/evanphx/json-patch
     [exec] go: finding module for package github.com/spf13/pflag
     [exec] go: downloading github.com/evanphx/json-patch v0.5.2
     [exec] go: finding module for package github.com/stretchr/testify/assert
     [exec] go: finding module for package github.com/google/gofuzz
     [exec] go: downloading github.com/spf13/pflag v1.0.5
     [exec] go: finding module for package k8s.io/apimachinery/pkg/util/intstr
     [exec] go: finding module for package k8s.io/utils/integer
     [exec] go: downloading github.com/stretchr/testify v1.7.0
     [exec] go: downloading github.com/google/gofuzz v1.2.0
     [exec] go: finding module for package github.com/gophercloud/gophercloud
     [exec] go: finding module for package k8s.io/apimachinery/pkg/apis/meta/v1/unstructured
     [exec] go: finding module for package k8s.io/utils/trace
     [exec] go: finding module for package k8s.io/api/autoscaling/v2beta2
     [exec] go: finding module for package k8s.io/api/batch/v1beta1
     [exec] go: downloading golang.org/x/text v0.3.0
     [exec] go: finding module for package k8s.io/apimachinery/pkg/util/cache
     [exec] go: finding module for package k8s.io/api/authentication/v1
     [exec] go: finding module for package k8s.io/apimachinery/pkg/util/naming
     [exec] go: finding module for package k8s.io/apimachinery/pkg/util/json
     [exec] go: finding module for package k8s.io/apimachinery/pkg/util/validation
     [exec] go: finding module for package k8s.io/api/storage/v1beta1
     [exec] go: finding module for package k8s.io/api/apps/v1beta1
     [exec] go: finding module for package k8s.io/apimachinery/pkg/apis/meta/v1beta1
     [exec] go: finding module for package k8s.io/apimachinery/pkg/api/equality
     [exec] go: finding module for package sigs.k8s.io/yaml
     [exec] go: finding module for package k8s.io/apimachinery/pkg/util/sets
     [exec] go: finding module for package github.com/Azure/go-autorest/autorest/azure
     [exec] go: finding module for package k8s.io/apimachinery/pkg/api/apitesting/roundtrip
     [exec] go: finding module for package k8s.io/apimachinery/pkg/util/httpstream/spdy
     [exec] go: finding module for package github.com/gogo/protobuf/proto
     [exec] go: downloading github.com/gogo/protobuf v1.3.2
     [exec] go: downloading sigs.k8s.io/yaml v1.2.0
     [exec] go: found k8s.io/apimachinery/pkg/api/meta in k8s.io/apimachinery v0.22.1
     [exec] go: found k8s.io/apimachinery/pkg/apis/meta/v1 in k8s.io/apimachinery v0.22.1
     [exec] go: found k8s.io/apimachinery/pkg/apis/meta/v1/unstructured in k8s.io/apimachinery v0.22.1
     [exec] go: found k8s.io/apimachinery/pkg/runtime in k8s.io/apimachinery v0.22.1
     [exec] go: found k8s.io/apimachinery/pkg/runtime/schema in k8s.io/apimachinery v0.22.1
     [exec] go: found k8s.io/apimachinery/pkg/runtime/serializer in k8s.io/apimachinery v0.22.1
     [exec] go: found k8s.io/apimachinery/pkg/types in k8s.io/apimachinery v0.22.1
     [exec] go: found k8s.io/apimachinery/pkg/watch in k8s.io/apimachinery v0.22.1
     [exec] go: found github.com/golang/protobuf/proto in github.com/golang/protobuf v1.5.2
     [exec] go: found k8s.io/apimachinery/pkg/api/errors in k8s.io/apimachinery v0.22.1
     [exec] go: found k8s.io/apimachinery/pkg/util/runtime in k8s.io/apimachinery v0.22.1
     [exec] go: found k8s.io/apimachinery/pkg/util/sets in k8s.io/apimachinery v0.22.1
     [exec] go: found k8s.io/apimachinery/pkg/version in k8s.io/apimachinery v0.22.1
     [exec] go: found github.com/gregjones/httpcache in github.com/gregjones/httpcache v0.0.0-20190611155906-901d90724c79
     [exec] go: found github.com/gregjones/httpcache/diskcache in github.com/gregjones/httpcache v0.0.0-20190611155906-901d90724c79
     [exec] go: found github.com/peterbourgon/diskv in github.com/peterbourgon/diskv v2.0.1+incompatible
     [exec] go: found k8s.io/klog in k8s.io/klog v1.0.0
     [exec] go: found k8s.io/apimachinery/pkg/runtime/serializer/json in k8s.io/apimachinery v0.22.1
     [exec] go: found k8s.io/apimachinery/pkg/runtime/serializer/streaming in k8s.io/apimachinery v0.22.1
     [exec] go: found k8s.io/apimachinery/pkg/runtime/serializer/versioning in k8s.io/apimachinery v0.22.1
     [exec] go: found k8s.io/apimachinery/pkg/labels in k8s.io/apimachinery v0.22.1
     [exec] go: found k8s.io/api/apps/v1 in k8s.io/api v0.22.1
     [exec] go: found k8s.io/api/core/v1 in k8s.io/api v0.22.1
     [exec] go: found k8s.io/apimachinery/pkg/fields in k8s.io/apimachinery v0.22.1
     [exec] go: found k8s.io/apimachinery/pkg/util/wait in k8s.io/apimachinery v0.22.1
     [exec] go: found k8s.io/api/admissionregistration/v1beta1 in k8s.io/api v0.22.1
     [exec] go: found k8s.io/api/apps/v1beta1 in k8s.io/api v0.22.1
     [exec] go: found k8s.io/api/apps/v1beta2 in k8s.io/api v0.22.1
     [exec] go: found k8s.io/api/autoscaling/v1 in k8s.io/api v0.22.1
     [exec] go: found k8s.io/api/autoscaling/v2beta1 in k8s.io/api v0.22.1
     [exec] go: found k8s.io/api/autoscaling/v2beta2 in k8s.io/api v0.22.1
     [exec] go: found k8s.io/api/batch/v1 in k8s.io/api v0.22.1
     [exec] go: found k8s.io/api/batch/v1beta1 in k8s.io/api v0.22.1
     [exec] go: found k8s.io/api/certificates/v1beta1 in k8s.io/api v0.22.1
     [exec] go: found k8s.io/api/coordination/v1 in k8s.io/api v0.22.1
     [exec] go: found k8s.io/api/coordination/v1beta1 in k8s.io/api v0.22.1
     [exec] go: found k8s.io/api/events/v1beta1 in k8s.io/api v0.22.1
     [exec] go: found k8s.io/api/extensions/v1beta1 in k8s.io/api v0.22.1
     [exec] go: found k8s.io/api/networking/v1 in k8s.io/api v0.22.1
     [exec] go: found k8s.io/api/networking/v1beta1 in k8s.io/api v0.22.1
     [exec] go: found k8s.io/api/node/v1alpha1 in k8s.io/api v0.22.1
     [exec] go: found k8s.io/api/node/v1beta1 in k8s.io/api v0.22.1
     [exec] go: found k8s.io/api/policy/v1beta1 in k8s.io/api v0.22.1
     [exec] go: found k8s.io/api/rbac/v1 in k8s.io/api v0.22.1
     [exec] go: found k8s.io/api/rbac/v1alpha1 in k8s.io/api v0.22.1
     [exec] go: found k8s.io/api/rbac/v1beta1 in k8s.io/api v0.22.1
     [exec] go: found k8s.io/api/scheduling/v1 in k8s.io/api v0.22.1
     [exec] go: found k8s.io/api/scheduling/v1alpha1 in k8s.io/api v0.22.1
     [exec] go: found k8s.io/api/scheduling/v1beta1 in k8s.io/api v0.22.1
     [exec] go: found k8s.io/api/storage/v1 in k8s.io/api v0.22.1
     [exec] go: found k8s.io/api/storage/v1alpha1 in k8s.io/api v0.22.1
     [exec] go: found k8s.io/api/storage/v1beta1 in k8s.io/api v0.22.1
     [exec] go: found k8s.io/api/authentication/v1 in k8s.io/api v0.22.1
     [exec] go: found k8s.io/api/authentication/v1beta1 in k8s.io/api v0.22.1
     [exec] go: found k8s.io/api/authorization/v1 in k8s.io/api v0.22.1
     [exec] go: found k8s.io/api/authorization/v1beta1 in k8s.io/api v0.22.1
     [exec] go: found k8s.io/apimachinery/pkg/util/net in k8s.io/apimachinery v0.22.1
     [exec] go: found k8s.io/api/imagepolicy/v1alpha1 in k8s.io/api v0.22.1
     [exec] go: found k8s.io/apimachinery/pkg/conversion in k8s.io/apimachinery v0.22.1
     [exec] go: found github.com/Azure/go-autorest/autorest in github.com/Azure/go-autorest/autorest v0.11.20
     [exec] go: found github.com/Azure/go-autorest/autorest/adal in github.com/Azure/go-autorest/autorest/adal v0.9.15
     [exec] go: found github.com/Azure/go-autorest/autorest/azure in github.com/Azure/go-autorest/autorest v0.11.20
     [exec] go: found github.com/davecgh/go-spew/spew in github.com/davecgh/go-spew v1.1.1
     [exec] go: found golang.org/x/oauth2 in golang.org/x/oauth2 v0.0.0-20210819190943-2bc19b11175f
     [exec] go: found golang.org/x/oauth2/google in golang.org/x/oauth2 v0.0.0-20210819190943-2bc19b11175f
     [exec] go: found k8s.io/apimachinery/pkg/util/yaml in k8s.io/apimachinery v0.22.1
     [exec] go: found github.com/gophercloud/gophercloud in github.com/gophercloud/gophercloud v0.20.0
     [exec] go: found github.com/gophercloud/gophercloud/openstack in github.com/gophercloud/gophercloud v0.20.0
     [exec] go: found github.com/evanphx/json-patch in github.com/evanphx/json-patch v0.5.2
     [exec] go: found k8s.io/apimachinery/pkg/util/json in k8s.io/apimachinery v0.22.1
     [exec] go: found k8s.io/apimachinery/pkg/util/strategicpatch in k8s.io/apimachinery v0.22.1
     [exec] go: found k8s.io/apimachinery/pkg/util/cache in k8s.io/apimachinery v0.22.1
     [exec] go: found k8s.io/apimachinery/pkg/util/clock in k8s.io/apimachinery v0.22.1
     [exec] go: found k8s.io/apimachinery/pkg/util/diff in k8s.io/apimachinery v0.22.1
     [exec] go: found k8s.io/apimachinery/pkg/util/naming in k8s.io/apimachinery v0.22.1
     [exec] go: found k8s.io/utils/buffer in k8s.io/utils v0.0.0-20210820185131-d34e5cb4466e
     [exec] go: found k8s.io/utils/trace in k8s.io/utils v0.0.0-20210820185131-d34e5cb4466e
     [exec] go: found github.com/imdario/mergo in github.com/imdario/mergo v0.3.12
     [exec] go: found github.com/spf13/pflag in github.com/spf13/pflag v1.0.5
     [exec] go: found k8s.io/apimachinery/pkg/util/errors in k8s.io/apimachinery v0.22.1
     [exec] go: found k8s.io/apimachinery/pkg/util/validation in k8s.io/apimachinery v0.22.1
     [exec] go: found k8s.io/apimachinery/pkg/apis/meta/internalversion in k8s.io/apimachinery v0.22.1
     [exec] go: found k8s.io/apimachinery/pkg/util/httpstream in k8s.io/apimachinery v0.22.1
     [exec] go: found github.com/golang/groupcache/lru in github.com/golang/groupcache v0.0.0-20210331224755-41bb18bfe9da
     [exec] go: found k8s.io/apimachinery/pkg/util/remotecommand in k8s.io/apimachinery v0.22.1
     [exec] go: found k8s.io/apimachinery/pkg/util/httpstream/spdy in k8s.io/apimachinery v0.22.1
     [exec] go: found golang.org/x/time/rate in golang.org/x/time v0.0.0-20210723032227-1f47c861a9ac
     [exec] go: found k8s.io/utils/integer in k8s.io/utils v0.0.0-20210820185131-d34e5cb4466e
     [exec] go: found github.com/gogo/protobuf/proto in github.com/gogo/protobuf v1.3.2
     [exec] go: found github.com/stretchr/testify/assert in github.com/stretchr/testify v1.7.0
     [exec] go: found k8s.io/apimachinery/pkg/api/equality in k8s.io/apimachinery v0.22.1
     [exec] go: found github.com/google/gofuzz in github.com/google/gofuzz v1.2.0
     [exec] go: found k8s.io/apimachinery/pkg/util/intstr in k8s.io/apimachinery v0.22.1
     [exec] go: found k8s.io/apimachinery/pkg/api/apitesting/roundtrip in k8s.io/apimachinery v0.22.1
     [exec] go: found sigs.k8s.io/yaml in sigs.k8s.io/yaml v1.2.0
     [exec] go: found k8s.io/apimachinery/pkg/apis/meta/v1beta1 in k8s.io/apimachinery v0.22.1
     [exec] go: downloading k8s.io/klog/v2 v2.9.0
     [exec] go: downloading github.com/Azure/go-autorest/autorest/date v0.3.0
     [exec] go: downloading github.com/google/go-cmp v0.5.5
     [exec] go: downloading gopkg.in/inf.v0 v0.9.1
     [exec] go: finding module for package k8s.io/api/batch/v2alpha1
     [exec] go: downloading golang.org/x/net v0.0.0-20210520170846-37e1c6afe023
     [exec] go: downloading k8s.io/kube-openapi v0.0.0-20210421082810-95288971da7e
     [exec] go: finding module for package k8s.io/api/auditregistration/v1alpha1
     [exec] go: downloading cloud.google.com/go v0.65.0
     [exec] go: finding module for package k8s.io/api/settings/v1alpha1
     [exec] go: downloading github.com/golang-jwt/jwt/v4 v4.0.0
     [exec] go: downloading gopkg.in/yaml.v2 v2.4.0
     [exec] go: downloading github.com/go-logr/logr v0.4.0
     [exec] go: downloading google.golang.org/protobuf v1.26.0
     [exec] go: downloading github.com/Azure/go-autorest/tracing v0.6.0
     [exec] go: downloading sigs.k8s.io/structured-merge-diff/v4 v4.1.2
     [exec] go: downloading github.com/Azure/go-autorest/logger v0.2.1
     [exec] go: downloading github.com/pmezard/go-difflib v1.0.0
     [exec] go: downloading github.com/json-iterator/go v1.1.11
     [exec] go: downloading github.com/modern-go/reflect2 v1.0.1
     [exec] go: finding module for package github.com/googleapis/gnostic/OpenAPIv2
     [exec] go: downloading gopkg.in/yaml.v3 v3.0.0-20210107192922-496545a6307b
     [exec] go: downloading github.com/evanphx/json-patch v4.11.0+incompatible
     [exec] go: downloading golang.org/x/sys v0.0.0-20210616094352-59db8d763f22
     [exec] go: downloading github.com/pkg/errors v0.9.1
     [exec] go: downloading github.com/moby/spdystream v0.2.0
     [exec] go: downloading github.com/google/btree v1.0.0
     [exec] go: downloading golang.org/x/text v0.3.6
     [exec] go: downloading github.com/modern-go/concurrent v0.0.0-20180306012644-bacd9c7ef1dd
     [exec] target/pkg/mod/k8s.io/client-go@v11.0.0+incompatible/kubernetes/scheme/register.go:26:2: module k8s.io/api@latest found (v0.22.1), but does not contain package k8s.io/api/auditregistration/v1alpha1
     [exec] target/pkg/mod/k8s.io/client-go@v11.0.0+incompatible/kubernetes/scheme/register.go:36:2: module k8s.io/api@latest found (v0.22.1), but does not contain package k8s.io/api/batch/v2alpha1
     [exec] target/pkg/mod/k8s.io/client-go@v11.0.0+incompatible/kubernetes/scheme/register.go:54:2: module k8s.io/api@latest found (v0.22.1), but does not contain package k8s.io/api/settings/v1alpha1
     [exec] target/pkg/mod/k8s.io/client-go@v11.0.0+incompatible/discovery/discovery_client.go:29:2: module github.com/googleapis/gnostic@latest found (v0.5.5), but does not contain package github.com/googleapis/gnostic/OpenAPIv2
     [exec] target/pkg/mod/k8s.io/kube-openapi@v0.0.0-20210421082810-95288971da7e/pkg/util/proto/document.go:24:2: case-insensitive import collision: "github.com/googleapis/gnostic/openapiv2" and "github.com/googleapis/gnostic/OpenAPIv2"
[INFO] ------------------------------------------------------------------------
[INFO] Reactor Summary:
[INFO] 
[INFO] Brooklyn Client 1.1.0-SNAPSHOT ..................... SUCCESS [ 11.813 s]
[INFO] Brooklyn Client Command Line Interface ............. FAILURE [ 41.967 s]
[INFO] Brooklyn REST java Client 1.1.0-SNAPSHOT ........... SKIPPED
[INFO] ------------------------------------------------------------------------
[INFO] BUILD FAILURE
[INFO] ------------------------------------------------------------------------
[INFO] Total time: 55.780 s
[INFO] Finished at: 2021-09-07T17:12:35Z
[INFO] ------------------------------------------------------------------------
[ERROR] Failed to execute goal org.apache.maven.plugins:maven-antrun-plugin:1.8:run (process-build-all) on project brooklyn-client-cli: An Ant BuildException has occured: The following error occurred while executing this line:
[ERROR] /home/jenkins/workspace/Brooklyn_brooklyn-client_master/cli/build.xml:34: exec returned: 1
[ERROR] around Ant part ...<ant target="all"/>... @ 4:22 in /home/jenkins/workspace/Brooklyn_brooklyn-client_master/cli/target/antrun/build-main.xml
[ERROR] -> [Help 1]
[ERROR] 
[ERROR] To see the full stack trace of the errors, re-run Maven with the -e switch.
[ERROR] Re-run Maven using the -X switch to enable full debug logging.
[ERROR] 
[ERROR] For more information about the errors and possible solutions, please read the following articles:
[ERROR] [Help 1] http://cwiki.apache.org/confluence/display/MAVEN/MojoExecutionException
[ERROR] 
[ERROR] After correcting the problems, you can resume the build with the command
[ERROR]   mvn <goals> -rf :brooklyn-client-cli
[Pipeline] }
$ docker stop --time=1 0ec4a040243e6977fa60ae1a1d56adfe4750af7d48411d9a611d7e25b65ca77c
$ docker rm -f 0ec4a040243e6977fa60ae1a1d56adfe4750af7d48411d9a611d7e25b65ca77c
[Pipeline] // withDockerContainer
[Pipeline] }
[Pipeline] // stage
[Pipeline] }
[Pipeline] // withEnv
[Pipeline] }
ERROR: script returned exit code 1
[Pipeline] // catchError
[Pipeline] stage
[Pipeline] { (Publish test results)
[Pipeline] junit
Recording test results
[Checks API] No suitable checks publisher found.
[Pipeline] step
TestNG Reports Processing: START
Looking for TestNG results report in workspace using pattern: **/testng-results.xml
Saving reports...
Processing '/home/jenkins/jenkins-home/jobs/Brooklyn/jobs/brooklyn-client/branches/master/builds/18/testng/testng-results.xml'
TestNG Reports Processing: FINISH
[Pipeline] }
[Pipeline] // stage
[Pipeline] stage
[Pipeline] { (Send notifications)
[Pipeline] step

Build failed in Jenkins: Brooklyn » Brooklyn - Client module » master #20

Posted by Apache Jenkins Server <je...@builds.apache.org>.
See <https://ci-builds.apache.org/job/Brooklyn/job/brooklyn-client/job/master/20/display/redirect>

Changes:


------------------------------------------
[...truncated 39950 lines...]
     [exec] go: finding module for package k8s.io/apimachinery/pkg/util/remotecommand
     [exec] go: finding module for package github.com/peterbourgon/diskv
     [exec] go: finding module for package k8s.io/api/scheduling/v1beta1
     [exec] go: downloading github.com/peterbourgon/diskv v1.0.0
     [exec] go: finding module for package k8s.io/apimachinery/pkg/apis/meta/v1/unstructured
     [exec] go: finding module for package k8s.io/api/node/v1alpha1
     [exec] go: finding module for package k8s.io/api/apps/v1beta1
     [exec] go: finding module for package k8s.io/api/authentication/v1beta1
     [exec] go: finding module for package k8s.io/apimachinery/pkg/runtime
     [exec] go: finding module for package k8s.io/utils/integer
     [exec] go: finding module for package k8s.io/api/scheduling/v1alpha1
     [exec] go: finding module for package github.com/golang/groupcache/lru
     [exec] go: downloading github.com/golang/groupcache v0.0.0-20210331224755-41bb18bfe9da
     [exec] go: downloading k8s.io/utils v0.0.0-20210820185131-d34e5cb4466e
     [exec] go: downloading github.com/peterbourgon/diskv v2.0.1+incompatible
     [exec] go: finding module for package k8s.io/apimachinery/pkg/util/yaml
     [exec] go: finding module for package k8s.io/apimachinery/pkg/watch
     [exec] go: finding module for package k8s.io/apimachinery/pkg/util/json
     [exec] go: finding module for package k8s.io/apimachinery/pkg/apis/meta/internalversion
     [exec] go: finding module for package k8s.io/api/coordination/v1
     [exec] go: finding module for package k8s.io/api/batch/v1beta1
     [exec] go: finding module for package k8s.io/api/authentication/v1
     [exec] go: finding module for package k8s.io/api/auditregistration/v1alpha1
     [exec] go: finding module for package k8s.io/api/autoscaling/v2beta2
     [exec] go: finding module for package k8s.io/api/authorization/v1beta1
     [exec] go: finding module for package k8s.io/apimachinery/pkg/util/sets
     [exec] go: finding module for package k8s.io/apimachinery/pkg/util/errors
     [exec] go: finding module for package github.com/stretchr/testify/assert
     [exec] go: finding module for package k8s.io/apimachinery/pkg/util/wait
     [exec] go: finding module for package k8s.io/api/rbac/v1alpha1
     [exec] go: finding module for package golang.org/x/oauth2/google
     [exec] go: downloading github.com/stretchr/testify v1.7.0
     [exec] go: downloading golang.org/x/oauth2 v0.0.0-20210819190943-2bc19b11175f
     [exec] go: finding module for package golang.org/x/oauth2
     [exec] go: finding module for package github.com/Azure/go-autorest/autorest
     [exec] go: finding module for package k8s.io/apimachinery/pkg/api/equality
     [exec] go: downloading github.com/Azure/go-autorest v1.1.1
     [exec] go: downloading github.com/Azure/go-autorest/autorest v0.11.20
     [exec] go: downloading github.com/Azure/go-autorest v14.2.0+incompatible
     [exec] go: finding module for package github.com/google/gofuzz
     [exec] go: finding module for package k8s.io/apimachinery/pkg/runtime/serializer
     [exec] go: finding module for package k8s.io/apimachinery/pkg/apis/meta/v1beta1
     [exec] go: finding module for package k8s.io/apimachinery/pkg/util/intstr
     [exec] go: downloading github.com/google/gofuzz v1.2.0
     [exec] go: finding module for package github.com/gophercloud/gophercloud/openstack
     [exec] go: finding module for package k8s.io/apimachinery/pkg/util/strategicpatch
     [exec] go: finding module for package k8s.io/api/scheduling/v1
     [exec] go: finding module for package github.com/gogo/protobuf/proto
     [exec] go: finding module for package k8s.io/apimachinery/pkg/util/httpstream
     [exec] go: finding module for package github.com/Azure/go-autorest/autorest/adal
     [exec] go: downloading github.com/gogo/protobuf v1.3.2
     [exec] go: downloading github.com/Azure/go-autorest/autorest/adal v0.9.15
     [exec] go: finding module for package k8s.io/api/imagepolicy/v1alpha1
     [exec] go: finding module for package k8s.io/api/storage/v1
     [exec] go: finding module for package k8s.io/apimachinery/pkg/util/httpstream/spdy
     [exec] go: finding module for package github.com/Azure/go-autorest/autorest/azure
     [exec] go: finding module for package k8s.io/utils/trace
     [exec] go: finding module for package k8s.io/api/certificates/v1beta1
     [exec] go: finding module for package k8s.io/apimachinery/pkg/types
     [exec] go: finding module for package github.com/gregjones/httpcache
     [exec] go: downloading golang.org/x/net v0.0.0-20190404232315-eb5bcb51f2a3
     [exec] go: finding module for package github.com/spf13/pflag
     [exec] go: downloading github.com/spf13/pflag v1.0.5
     [exec] go: finding module for package sigs.k8s.io/yaml
     [exec] go: finding module for package k8s.io/utils/buffer
     [exec] go: downloading sigs.k8s.io/yaml v1.2.0
     [exec] go: downloading golang.org/x/text v0.3.0
     [exec] go: found k8s.io/apimachinery/pkg/api/meta in k8s.io/apimachinery v0.22.1
     [exec] go: found k8s.io/apimachinery/pkg/apis/meta/v1 in k8s.io/apimachinery v0.22.1
     [exec] go: found k8s.io/apimachinery/pkg/apis/meta/v1/unstructured in k8s.io/apimachinery v0.22.1
     [exec] go: found k8s.io/apimachinery/pkg/runtime in k8s.io/apimachinery v0.22.1
     [exec] go: found k8s.io/apimachinery/pkg/runtime/schema in k8s.io/apimachinery v0.22.1
     [exec] go: found k8s.io/apimachinery/pkg/runtime/serializer in k8s.io/apimachinery v0.22.1
     [exec] go: found k8s.io/apimachinery/pkg/types in k8s.io/apimachinery v0.22.1
     [exec] go: found k8s.io/apimachinery/pkg/watch in k8s.io/apimachinery v0.22.1
     [exec] go: found github.com/golang/protobuf/proto in github.com/golang/protobuf v1.5.2
     [exec] go: found k8s.io/apimachinery/pkg/api/errors in k8s.io/apimachinery v0.22.1
     [exec] go: found k8s.io/apimachinery/pkg/util/runtime in k8s.io/apimachinery v0.22.1
     [exec] go: found k8s.io/apimachinery/pkg/util/sets in k8s.io/apimachinery v0.22.1
     [exec] go: found k8s.io/apimachinery/pkg/version in k8s.io/apimachinery v0.22.1
     [exec] go: found github.com/gregjones/httpcache in github.com/gregjones/httpcache v0.0.0-20190611155906-901d90724c79
     [exec] go: found github.com/gregjones/httpcache/diskcache in github.com/gregjones/httpcache v0.0.0-20190611155906-901d90724c79
     [exec] go: found github.com/peterbourgon/diskv in github.com/peterbourgon/diskv v2.0.1+incompatible
     [exec] go: found k8s.io/klog in k8s.io/klog v1.0.0
     [exec] go: found k8s.io/apimachinery/pkg/runtime/serializer/json in k8s.io/apimachinery v0.22.1
     [exec] go: found k8s.io/apimachinery/pkg/runtime/serializer/streaming in k8s.io/apimachinery v0.22.1
     [exec] go: found k8s.io/apimachinery/pkg/runtime/serializer/versioning in k8s.io/apimachinery v0.22.1
     [exec] go: found k8s.io/apimachinery/pkg/labels in k8s.io/apimachinery v0.22.1
     [exec] go: found k8s.io/api/apps/v1 in k8s.io/api v0.22.1
     [exec] go: found k8s.io/api/core/v1 in k8s.io/api v0.22.1
     [exec] go: found k8s.io/apimachinery/pkg/fields in k8s.io/apimachinery v0.22.1
     [exec] go: found k8s.io/apimachinery/pkg/util/wait in k8s.io/apimachinery v0.22.1
     [exec] go: found k8s.io/api/admissionregistration/v1beta1 in k8s.io/api v0.22.1
     [exec] go: found k8s.io/api/apps/v1beta1 in k8s.io/api v0.22.1
     [exec] go: found k8s.io/api/apps/v1beta2 in k8s.io/api v0.22.1
     [exec] go: found k8s.io/api/autoscaling/v1 in k8s.io/api v0.22.1
     [exec] go: found k8s.io/api/autoscaling/v2beta1 in k8s.io/api v0.22.1
     [exec] go: found k8s.io/api/autoscaling/v2beta2 in k8s.io/api v0.22.1
     [exec] go: found k8s.io/api/batch/v1 in k8s.io/api v0.22.1
     [exec] go: found k8s.io/api/batch/v1beta1 in k8s.io/api v0.22.1
     [exec] go: found k8s.io/api/certificates/v1beta1 in k8s.io/api v0.22.1
     [exec] go: found k8s.io/api/coordination/v1 in k8s.io/api v0.22.1
     [exec] go: found k8s.io/api/coordination/v1beta1 in k8s.io/api v0.22.1
     [exec] go: found k8s.io/api/events/v1beta1 in k8s.io/api v0.22.1
     [exec] go: found k8s.io/api/extensions/v1beta1 in k8s.io/api v0.22.1
     [exec] go: found k8s.io/api/networking/v1 in k8s.io/api v0.22.1
     [exec] go: found k8s.io/api/networking/v1beta1 in k8s.io/api v0.22.1
     [exec] go: found k8s.io/api/node/v1alpha1 in k8s.io/api v0.22.1
     [exec] go: found k8s.io/api/node/v1beta1 in k8s.io/api v0.22.1
     [exec] go: found k8s.io/api/policy/v1beta1 in k8s.io/api v0.22.1
     [exec] go: found k8s.io/api/rbac/v1 in k8s.io/api v0.22.1
     [exec] go: found k8s.io/api/rbac/v1alpha1 in k8s.io/api v0.22.1
     [exec] go: found k8s.io/api/rbac/v1beta1 in k8s.io/api v0.22.1
     [exec] go: found k8s.io/api/scheduling/v1 in k8s.io/api v0.22.1
     [exec] go: found k8s.io/api/scheduling/v1alpha1 in k8s.io/api v0.22.1
     [exec] go: found k8s.io/api/scheduling/v1beta1 in k8s.io/api v0.22.1
     [exec] go: found k8s.io/api/storage/v1 in k8s.io/api v0.22.1
     [exec] go: found k8s.io/api/storage/v1alpha1 in k8s.io/api v0.22.1
     [exec] go: found k8s.io/api/storage/v1beta1 in k8s.io/api v0.22.1
     [exec] go: found k8s.io/api/authentication/v1 in k8s.io/api v0.22.1
     [exec] go: found k8s.io/api/authentication/v1beta1 in k8s.io/api v0.22.1
     [exec] go: found k8s.io/api/authorization/v1 in k8s.io/api v0.22.1
     [exec] go: found k8s.io/api/authorization/v1beta1 in k8s.io/api v0.22.1
     [exec] go: found k8s.io/apimachinery/pkg/util/net in k8s.io/apimachinery v0.22.1
     [exec] go: found k8s.io/api/imagepolicy/v1alpha1 in k8s.io/api v0.22.1
     [exec] go: found k8s.io/apimachinery/pkg/conversion in k8s.io/apimachinery v0.22.1
     [exec] go: found github.com/Azure/go-autorest/autorest in github.com/Azure/go-autorest/autorest v0.11.20
     [exec] go: found github.com/Azure/go-autorest/autorest/adal in github.com/Azure/go-autorest/autorest/adal v0.9.15
     [exec] go: found github.com/Azure/go-autorest/autorest/azure in github.com/Azure/go-autorest/autorest v0.11.20
     [exec] go: found github.com/davecgh/go-spew/spew in github.com/davecgh/go-spew v1.1.1
     [exec] go: found golang.org/x/oauth2 in golang.org/x/oauth2 v0.0.0-20210819190943-2bc19b11175f
     [exec] go: found golang.org/x/oauth2/google in golang.org/x/oauth2 v0.0.0-20210819190943-2bc19b11175f
     [exec] go: found k8s.io/apimachinery/pkg/util/yaml in k8s.io/apimachinery v0.22.1
     [exec] go: found github.com/gophercloud/gophercloud in github.com/gophercloud/gophercloud v0.20.0
     [exec] go: found github.com/gophercloud/gophercloud/openstack in github.com/gophercloud/gophercloud v0.20.0
     [exec] go: found github.com/evanphx/json-patch in github.com/evanphx/json-patch v0.5.2
     [exec] go: found k8s.io/apimachinery/pkg/util/json in k8s.io/apimachinery v0.22.1
     [exec] go: found k8s.io/apimachinery/pkg/util/strategicpatch in k8s.io/apimachinery v0.22.1
     [exec] go: found k8s.io/apimachinery/pkg/util/cache in k8s.io/apimachinery v0.22.1
     [exec] go: found k8s.io/apimachinery/pkg/util/clock in k8s.io/apimachinery v0.22.1
     [exec] go: found k8s.io/apimachinery/pkg/util/diff in k8s.io/apimachinery v0.22.1
     [exec] go: found k8s.io/apimachinery/pkg/util/naming in k8s.io/apimachinery v0.22.1
     [exec] go: found k8s.io/utils/buffer in k8s.io/utils v0.0.0-20210820185131-d34e5cb4466e
     [exec] go: found k8s.io/utils/trace in k8s.io/utils v0.0.0-20210820185131-d34e5cb4466e
     [exec] go: found github.com/imdario/mergo in github.com/imdario/mergo v0.3.12
     [exec] go: found github.com/spf13/pflag in github.com/spf13/pflag v1.0.5
     [exec] go: found k8s.io/apimachinery/pkg/util/errors in k8s.io/apimachinery v0.22.1
     [exec] go: found k8s.io/apimachinery/pkg/util/validation in k8s.io/apimachinery v0.22.1
     [exec] go: found k8s.io/apimachinery/pkg/apis/meta/internalversion in k8s.io/apimachinery v0.22.1
     [exec] go: found k8s.io/apimachinery/pkg/util/httpstream in k8s.io/apimachinery v0.22.1
     [exec] go: found github.com/golang/groupcache/lru in github.com/golang/groupcache v0.0.0-20210331224755-41bb18bfe9da
     [exec] go: found k8s.io/apimachinery/pkg/util/remotecommand in k8s.io/apimachinery v0.22.1
     [exec] go: found k8s.io/apimachinery/pkg/util/httpstream/spdy in k8s.io/apimachinery v0.22.1
     [exec] go: found golang.org/x/time/rate in golang.org/x/time v0.0.0-20210723032227-1f47c861a9ac
     [exec] go: found k8s.io/utils/integer in k8s.io/utils v0.0.0-20210820185131-d34e5cb4466e
     [exec] go: found github.com/gogo/protobuf/proto in github.com/gogo/protobuf v1.3.2
     [exec] go: found github.com/stretchr/testify/assert in github.com/stretchr/testify v1.7.0
     [exec] go: found k8s.io/apimachinery/pkg/api/equality in k8s.io/apimachinery v0.22.1
     [exec] go: found github.com/google/gofuzz in github.com/google/gofuzz v1.2.0
     [exec] go: found k8s.io/apimachinery/pkg/util/intstr in k8s.io/apimachinery v0.22.1
     [exec] go: found k8s.io/apimachinery/pkg/api/apitesting/roundtrip in k8s.io/apimachinery v0.22.1
     [exec] go: found sigs.k8s.io/yaml in sigs.k8s.io/yaml v1.2.0
     [exec] go: found k8s.io/apimachinery/pkg/apis/meta/v1beta1 in k8s.io/apimachinery v0.22.1
     [exec] go: downloading github.com/evanphx/json-patch v4.11.0+incompatible
     [exec] go: finding module for package k8s.io/api/auditregistration/v1alpha1
     [exec] go: downloading google.golang.org/protobuf v1.26.0
     [exec] go: finding module for package github.com/googleapis/gnostic/OpenAPIv2
     [exec] go: downloading golang.org/x/net v0.0.0-20210520170846-37e1c6afe023
     [exec] go: finding module for package k8s.io/api/settings/v1alpha1
     [exec] go: downloading github.com/moby/spdystream v0.2.0
     [exec] go: downloading github.com/Azure/go-autorest/tracing v0.6.0
     [exec] go: downloading github.com/json-iterator/go v1.1.11
     [exec] go: downloading github.com/Azure/go-autorest/logger v0.2.1
     [exec] go: downloading k8s.io/kube-openapi v0.0.0-20210421082810-95288971da7e
     [exec] go: downloading sigs.k8s.io/structured-merge-diff/v4 v4.1.2
     [exec] go: downloading github.com/google/btree v1.0.0
     [exec] go: downloading github.com/modern-go/reflect2 v1.0.1
     [exec] go: finding module for package k8s.io/api/batch/v2alpha1
     [exec] go: downloading github.com/golang-jwt/jwt/v4 v4.0.0
     [exec] go: downloading k8s.io/klog/v2 v2.9.0
     [exec] go: downloading github.com/pkg/errors v0.9.1
     [exec] go: downloading github.com/pmezard/go-difflib v1.0.0
     [exec] go: downloading cloud.google.com/go v0.65.0
     [exec] go: downloading github.com/Azure/go-autorest/autorest/date v0.3.0
     [exec] go: downloading golang.org/x/sys v0.0.0-20210616094352-59db8d763f22
     [exec] go: downloading github.com/modern-go/concurrent v0.0.0-20180306012644-bacd9c7ef1dd
     [exec] go: downloading gopkg.in/yaml.v2 v2.4.0
     [exec] go: downloading golang.org/x/text v0.3.6
     [exec] go: downloading github.com/google/go-cmp v0.5.5
     [exec] go: downloading github.com/go-logr/logr v0.4.0
     [exec] go: downloading gopkg.in/yaml.v3 v3.0.0-20210107192922-496545a6307b
     [exec] go: downloading gopkg.in/inf.v0 v0.9.1
     [exec] target/pkg/mod/k8s.io/client-go@v11.0.0+incompatible/kubernetes/scheme/register.go:26:2: module k8s.io/api@latest found (v0.22.1), but does not contain package k8s.io/api/auditregistration/v1alpha1
     [exec] target/pkg/mod/k8s.io/client-go@v11.0.0+incompatible/kubernetes/scheme/register.go:36:2: module k8s.io/api@latest found (v0.22.1), but does not contain package k8s.io/api/batch/v2alpha1
     [exec] target/pkg/mod/k8s.io/client-go@v11.0.0+incompatible/kubernetes/scheme/register.go:54:2: module k8s.io/api@latest found (v0.22.1), but does not contain package k8s.io/api/settings/v1alpha1
     [exec] target/pkg/mod/k8s.io/client-go@v11.0.0+incompatible/discovery/discovery_client.go:29:2: module github.com/googleapis/gnostic@latest found (v0.5.5), but does not contain package github.com/googleapis/gnostic/OpenAPIv2
     [exec] target/pkg/mod/k8s.io/kube-openapi@v0.0.0-20210421082810-95288971da7e/pkg/util/proto/document.go:24:2: case-insensitive import collision: "github.com/googleapis/gnostic/openapiv2" and "github.com/googleapis/gnostic/OpenAPIv2"
[INFO] ------------------------------------------------------------------------
[INFO] Reactor Summary:
[INFO] 
[INFO] Brooklyn Client 1.1.0-SNAPSHOT ..................... SUCCESS [  9.474 s]
[INFO] Brooklyn Client Command Line Interface ............. FAILURE [ 29.631 s]
[INFO] Brooklyn REST java Client 1.1.0-SNAPSHOT ........... SKIPPED
[INFO] ------------------------------------------------------------------------
[INFO] BUILD FAILURE
[INFO] ------------------------------------------------------------------------
[INFO] Total time: 40.526 s
[INFO] Finished at: 2021-09-08T09:37:29Z
[INFO] ------------------------------------------------------------------------
[ERROR] Failed to execute goal org.apache.maven.plugins:maven-antrun-plugin:1.8:run (process-build-all) on project brooklyn-client-cli: An Ant BuildException has occured: The following error occurred while executing this line:
[ERROR] /home/jenkins/workspace/Brooklyn_brooklyn-client_master/cli/build.xml:34: exec returned: 1
[ERROR] around Ant part ...<ant target="all"/>... @ 4:22 in /home/jenkins/workspace/Brooklyn_brooklyn-client_master/cli/target/antrun/build-main.xml
[ERROR] -> [Help 1]
[ERROR] 
[ERROR] To see the full stack trace of the errors, re-run Maven with the -e switch.
[ERROR] Re-run Maven using the -X switch to enable full debug logging.
[ERROR] 
[ERROR] For more information about the errors and possible solutions, please read the following articles:
[ERROR] [Help 1] http://cwiki.apache.org/confluence/display/MAVEN/MojoExecutionException
[ERROR] 
[ERROR] After correcting the problems, you can resume the build with the command
[ERROR]   mvn <goals> -rf :brooklyn-client-cli
[Pipeline] }
$ docker stop --time=1 f8570d50e29619d5906a40e93205f41d9e64bb07a66674dc4e796727e77096e8
$ docker rm -f f8570d50e29619d5906a40e93205f41d9e64bb07a66674dc4e796727e77096e8
[Pipeline] // withDockerContainer
[Pipeline] }
[Pipeline] // stage
[Pipeline] }
[Pipeline] // withEnv
[Pipeline] }
ERROR: script returned exit code 1
[Pipeline] // catchError
[Pipeline] stage
[Pipeline] { (Publish test results)
[Pipeline] junit
Recording test results
[Checks API] No suitable checks publisher found.
[Pipeline] step
TestNG Reports Processing: START
Looking for TestNG results report in workspace using pattern: **/testng-results.xml
Saving reports...
Processing '/home/jenkins/jenkins-home/jobs/Brooklyn/jobs/brooklyn-client/branches/master/builds/20/testng/testng-results.xml'
TestNG Reports Processing: FINISH
[Pipeline] }
[Pipeline] // stage
[Pipeline] stage
[Pipeline] { (Send notifications)
[Pipeline] step

Build failed in Jenkins: Brooklyn » Brooklyn - Client module » master #19

Posted by Apache Jenkins Server <je...@builds.apache.org>.
See <https://ci-builds.apache.org/job/Brooklyn/job/brooklyn-client/job/master/19/display/redirect>

Changes:


------------------------------------------
[...truncated 15578 lines...]
Progress (1): 1.6/2.0 MB
Progress (1): 1.6/2.0 MB
Progress (1): 1.6/2.0 MB
Progress (1): 1.6/2.0 MB
Progress (1): 1.6/2.0 MB
Progress (1): 1.6/2.0 MB
Progress (1): 1.6/2.0 MB
Progress (1): 1.6/2.0 MB
Progress (1): 1.6/2.0 MB
Progress (1): 1.6/2.0 MB
Progress (1): 1.6/2.0 MB
Progress (1): 1.6/2.0 MB
Progress (1): 1.6/2.0 MB
Progress (1): 1.6/2.0 MB
Progress (1): 1.6/2.0 MB
Progress (1): 1.6/2.0 MB
Progress (1): 1.6/2.0 MB
Progress (1): 1.6/2.0 MB
Progress (1): 1.6/2.0 MB
Progress (1): 1.6/2.0 MB
Progress (1): 1.6/2.0 MB
Progress (1): 1.7/2.0 MB
Progress (1): 1.7/2.0 MB
Progress (1): 1.7/2.0 MB
Progress (1): 1.7/2.0 MB
Progress (1): 1.7/2.0 MB
Progress (1): 1.7/2.0 MB
Progress (1): 1.7/2.0 MB
Progress (1): 1.7/2.0 MB
Progress (1): 1.7/2.0 MB
Progress (1): 1.7/2.0 MB
Progress (1): 1.7/2.0 MB
Progress (1): 1.7/2.0 MB
Progress (1): 1.7/2.0 MB
Progress (1): 1.7/2.0 MB
Progress (1): 1.7/2.0 MB
Progress (1): 1.7/2.0 MB
Progress (1): 1.7/2.0 MB
Progress (1): 1.7/2.0 MB
Progress (1): 1.7/2.0 MB
Progress (1): 1.7/2.0 MB
Progress (1): 1.7/2.0 MB
Progress (1): 1.7/2.0 MB
Progress (1): 1.7/2.0 MB
Progress (1): 1.7/2.0 MB
Progress (1): 1.8/2.0 MB
Progress (1): 1.8/2.0 MB
Progress (1): 1.8/2.0 MB
Progress (1): 1.8/2.0 MB
Progress (1): 1.8/2.0 MB
Progress (1): 1.8/2.0 MB
Progress (1): 1.8/2.0 MB
Progress (1): 1.8/2.0 MB
Progress (1): 1.8/2.0 MB
Progress (1): 1.8/2.0 MB
Progress (1): 1.8/2.0 MB
Progress (1): 1.8/2.0 MB
Progress (1): 1.8/2.0 MB
Progress (1): 1.8/2.0 MB
Progress (1): 1.8/2.0 MB
Progress (1): 1.8/2.0 MB
Progress (1): 1.8/2.0 MB
Progress (1): 1.8/2.0 MB
Progress (1): 1.8/2.0 MB
Progress (1): 1.8/2.0 MB
Progress (1): 1.8/2.0 MB
Progress (1): 1.8/2.0 MB
Progress (1): 1.8/2.0 MB
Progress (1): 1.8/2.0 MB
Progress (1): 1.8/2.0 MB
Progress (1): 1.9/2.0 MB
Progress (1): 1.9/2.0 MB
Progress (1): 1.9/2.0 MB
Progress (1): 1.9/2.0 MB
Progress (1): 1.9/2.0 MB
Progress (1): 1.9/2.0 MB
Progress (1): 1.9/2.0 MB
Progress (1): 1.9/2.0 MB
Progress (1): 1.9/2.0 MB
Progress (1): 1.9/2.0 MB
Progress (1): 1.9/2.0 MB
Progress (1): 1.9/2.0 MB
Progress (1): 1.9/2.0 MB
Progress (1): 1.9/2.0 MB
Progress (1): 1.9/2.0 MB
Progress (1): 1.9/2.0 MB
Progress (1): 1.9/2.0 MB
Progress (1): 1.9/2.0 MB
Progress (1): 1.9/2.0 MB
Progress (1): 1.9/2.0 MB
Progress (1): 1.9/2.0 MB
Progress (1): 1.9/2.0 MB
Progress (1): 1.9/2.0 MB
Progress (1): 1.9/2.0 MB
Progress (1): 1.9/2.0 MB
Progress (1): 2.0/2.0 MB
Progress (1): 2.0/2.0 MB
Progress (1): 2.0/2.0 MB
Progress (1): 2.0/2.0 MB
Progress (1): 2.0/2.0 MB
Progress (1): 2.0/2.0 MB
Progress (1): 2.0/2.0 MB
Progress (1): 2.0/2.0 MB
Progress (1): 2.0/2.0 MB
Progress (1): 2.0/2.0 MB
Progress (1): 2.0/2.0 MB
Progress (1): 2.0/2.0 MB
Progress (1): 2.0/2.0 MB
Progress (1): 2.0/2.0 MB
Progress (1): 2.0/2.0 MB
Progress (1): 2.0/2.0 MB
Progress (1): 2.0 MB    
                    
Downloaded from central: https://repo.maven.apache.org/maven2/org/apache/ant/ant/1.9.4/ant-1.9.4.jar (2.0 MB at 7.6 MB/s)
[INFO] Executing tasks

main:

pre-clean:
[INFO] Executed tasks
[INFO] 
[INFO] --- maven-clean-plugin:2.6.1:clean (default-clean) @ brooklyn-client-cli ---
[INFO] Deleting /home/jenkins/jenkins-agent/workspace/Brooklyn_brooklyn-client_master/cli/target
[INFO] Deleting /home/jenkins/jenkins-agent/workspace/Brooklyn_brooklyn-client_master/cli (includes = [brooklyn*.log, brooklyn*.log.*, stacktrace.log, test-output, prodDb.*], excludes = [])
[INFO] 
[INFO] --- maven-replacer-plugin:1.4.1:replace (fix-eclipse-dot-classpath-mangling) @ brooklyn-client-cli ---
[INFO] Ignoring missing file
[INFO] Replacement run on 0 file.
[INFO] 
[INFO] --- buildnumber-maven-plugin:1.3:create (default) @ brooklyn-client-cli ---
[INFO] Executing: /bin/sh -c cd /home/jenkins/jenkins-agent/workspace/Brooklyn_brooklyn-client_master/cli && git rev-parse --verify HEAD
[INFO] Working directory: /home/jenkins/jenkins-agent/workspace/Brooklyn_brooklyn-client_master/cli
[INFO] Storing buildNumber: 8922191e2defece3affbdc8661facf05dc58af04 at timestamp: 1631085359854
[WARNING] Cannot get the branch information from the git repository: 
Detecting the current branch failed: fatal: ref HEAD is not a symbolic ref

[INFO] Executing: /bin/sh -c cd /home/jenkins/jenkins-agent/workspace/Brooklyn_brooklyn-client_master/cli && git rev-parse --verify HEAD
[INFO] Working directory: /home/jenkins/jenkins-agent/workspace/Brooklyn_brooklyn-client_master/cli
[INFO] Storing buildScmBranch: UNKNOWN
[INFO] 
[INFO] --- maven-enforcer-plugin:1.4.1:enforce (brooklyn-build-req) @ brooklyn-client-cli ---
[INFO] 
[INFO] --- maven-remote-resources-plugin:1.5:process (default) @ brooklyn-client-cli ---
[INFO] 
[INFO] --- maven-antrun-plugin:1.8:run (process-build-all) @ brooklyn-client-cli ---
[INFO] Executing tasks

main:

all:
     [exec] Setting up go environmentfailed to initialize build cache at /.cache/go-build: mkdir /.cache: permission denied
     [exec] 
     [exec] GO386=softfloat
     [exec] Starting build.sh (brooklyn-client go build script)
     [exec] GO_VERSION is go1.15.8
     [exec] Run unit tests
     [exec] go: downloading github.com/urfave/cli/v2 v2.3.0
     [exec] go: downloading k8s.io/client-go v11.0.0+incompatible
     [exec] go: downloading github.com/matryer/is v1.2.0
     [exec] go: downloading golang.org/x/crypto v0.0.0-20210220033148-5ea612d1eb83
     [exec] go: downloading github.com/cpuguy83/go-md2man/v2 v2.0.0-20190314233015-f79a8a8ca69d
     [exec] go: downloading github.com/russross/blackfriday/v2 v2.0.1
     [exec] go: downloading github.com/shurcooL/sanitized_anchor_name v1.0.0
     [exec] go: downloading golang.org/x/term v0.0.0-20210220032956-6a3ed077a48d
     [exec] go: downloading golang.org/x/sys v0.0.0-20201119102817-f84b799fce68
     [exec] ?   	github.com/apache/brooklyn-client/cli/api/access_control	[no test files]
     [exec] ?   	github.com/apache/brooklyn-client/cli/api/activities	[no test files]
     [exec] ?   	github.com/apache/brooklyn-client/cli/api/application	[no test files]
     [exec] ?   	github.com/apache/brooklyn-client/cli/api/catalog	[no test files]
     [exec] ?   	github.com/apache/brooklyn-client/cli/api/entities	[no test files]
     [exec] ?   	github.com/apache/brooklyn-client/cli/api/entity_config	[no test files]
     [exec] ?   	github.com/apache/brooklyn-client/cli/api/entity_effectors	[no test files]
     [exec] ?   	github.com/apache/brooklyn-client/cli/api/entity_policies	[no test files]
     [exec] ?   	github.com/apache/brooklyn-client/cli/api/entity_policy_config	[no test files]
     [exec] ?   	github.com/apache/brooklyn-client/cli/api/entity_sensors	[no test files]
     [exec] ?   	github.com/apache/brooklyn-client/cli/api/locations	[no test files]
     [exec] ?   	github.com/apache/brooklyn-client/cli/api/server	[no test files]
     [exec] ?   	github.com/apache/brooklyn-client/cli/api/usage	[no test files]
     [exec] ?   	github.com/apache/brooklyn-client/cli/api/version	[no test files]
     [exec] ?   	github.com/apache/brooklyn-client/cli/app	[no test files]
     [exec] ?   	github.com/apache/brooklyn-client/cli/br	[no test files]
     [exec] ?   	github.com/apache/brooklyn-client/cli/command	[no test files]
     [exec] ?   	github.com/apache/brooklyn-client/cli/command_factory	[no test files]
     [exec] ?   	github.com/apache/brooklyn-client/cli/command_metadata	[no test files]
     [exec] ?   	github.com/apache/brooklyn-client/cli/command_runner	[no test files]
     [exec] ok  	github.com/apache/brooklyn-client/cli/commands	0.011s
     [exec] ?   	github.com/apache/brooklyn-client/cli/error_handler	[no test files]
     [exec] ok  	github.com/apache/brooklyn-client/cli/io	0.006s
     [exec] ok  	github.com/apache/brooklyn-client/cli/models	0.006s
     [exec] ?   	github.com/apache/brooklyn-client/cli/net	[no test files]
     [exec] ok  	github.com/apache/brooklyn-client/cli/scope	0.004s
     [exec] ?   	github.com/apache/brooklyn-client/cli/terminal	[no test files]
     [exec] Building br for default OS/ARCH:
     [exec]     darwin/amd64
     [exec]     linux/386
     [exec] go tool compile: exit status 1
     [exec] unsupported setting GO386=softfloat
     [exec] go tool compile: exit status 1
     [exec] unsupported setting GO386=softfloat
[INFO] ------------------------------------------------------------------------
[INFO] Reactor Summary:
[INFO] 
[INFO] Brooklyn Client 1.1.0-SNAPSHOT ..................... SUCCESS [ 20.318 s]
[INFO] Brooklyn Client Command Line Interface ............. FAILURE [ 28.658 s]
[INFO] Brooklyn REST java Client 1.1.0-SNAPSHOT ........... SKIPPED
[INFO] ------------------------------------------------------------------------
[INFO] BUILD FAILURE
[INFO] ------------------------------------------------------------------------
[INFO] Total time: 01:03 min
[INFO] Finished at: 2021-09-08T07:16:27Z
[INFO] ------------------------------------------------------------------------
[ERROR] Failed to execute goal org.apache.maven.plugins:maven-antrun-plugin:1.8:run (process-build-all) on project brooklyn-client-cli: An Ant BuildException has occured: The following error occurred while executing this line:
[ERROR] /home/jenkins/jenkins-agent/workspace/Brooklyn_brooklyn-client_master/cli/build.xml:34: exec returned: 1
[ERROR] around Ant part ...<ant target="all"/>... @ 4:22 in /home/jenkins/jenkins-agent/workspace/Brooklyn_brooklyn-client_master/cli/target/antrun/build-main.xml
[ERROR] -> [Help 1]
[ERROR] 
[ERROR] To see the full stack trace of the errors, re-run Maven with the -e switch.
[ERROR] Re-run Maven using the -X switch to enable full debug logging.
[ERROR] 
[ERROR] For more information about the errors and possible solutions, please read the following articles:
[ERROR] [Help 1] http://cwiki.apache.org/confluence/display/MAVEN/MojoExecutionException
[ERROR] 
[ERROR] After correcting the problems, you can resume the build with the command
[ERROR]   mvn <goals> -rf :brooklyn-client-cli
[Pipeline] }
$ docker stop --time=1 d4a85bd7f04d81015df1a9d6eaaab8ac404be1b4b6804ece31d380375d3d992e
$ docker rm -f d4a85bd7f04d81015df1a9d6eaaab8ac404be1b4b6804ece31d380375d3d992e
[Pipeline] // withDockerContainer
[Pipeline] }
[Pipeline] // stage
[Pipeline] }
[Pipeline] // withEnv
[Pipeline] }
ERROR: script returned exit code 1
[Pipeline] // catchError
[Pipeline] stage
[Pipeline] { (Publish test results)
[Pipeline] junit
Recording test results
[Checks API] No suitable checks publisher found.
[Pipeline] step
TestNG Reports Processing: START
Looking for TestNG results report in workspace using pattern: **/testng-results.xml
Did not find any matching files.
[Pipeline] }
[Pipeline] // stage
[Pipeline] stage
[Pipeline] { (Send notifications)
[Pipeline] step