You are viewing a plain text version of this content. The canonical link for it is here.
Posted to builds@cassandra.apache.org by Apache Jenkins Server <je...@builds.apache.org> on 2022/05/14 01:45:43 UTC

Build complete: Cassandra-trunk #1146 [FAILURE] d6cfa3396bb1467b7b99ffc52c8777c1bfcc6a3e

-------------------------------------------------------------------------------
Build Cassandra-trunk #1146 Failure
URL: https://ci-cassandra.apache.org/job/Cassandra-trunk/1146/
-------------------------------------------------------------------------------
Changes:
[David Capwell] jvm-dtest unhandled exceptions failing the test no longer work


-------------------------------------------------------------------------------
Failed Tests:
41 tests failed.
FAILED:  dtest-novnode.hintedhandoff_test.TestHintedHandoff.test_hintedhandoff_window
FAILED:  dtest-upgrade.upgrade_tests.upgrade_through_versions_test.TestProtoV4Upgrade_AllVersions_EndsAt_Trunk_HEAD.test_parallel_upgrade
FAILED:  org.apache.cassandra.distributed.upgrade.MixedModeFrom3UnloggedBatchTest.testSimpleStrategy
FAILED:  org.apache.cassandra.distributed.test.SchemaTest.readRepairWithCompaction
FAILED:  org.apache.cassandra.distributed.test.SchemaTest.readRepair
FAILED:  org.apache.cassandra.distributed.test.repair.ForceRepairTest.force
FAILED:  org.apache.cassandra.distributed.test.CASTest.testSuccessfulWriteBeforeRangeMovement
FAILED:  org.apache.cassandra.distributed.test.CASTest.testSuccessfulWriteDuringRangeMovementFollowedByConflicting
FAILED:  org.apache.cassandra.distributed.test.TopPartitionsTest.basicRangeTombstonesTest[Incremental]
FAILED:  org.apache.cassandra.db.commitlog.GroupCommitLogTest.testOutOfOrderFlushRecoveryWithCompaction[3]-cdc
FAILED:  org.apache.cassandra.db.commitlog.BatchCommitLogTest.testBatchCLShutDownImmediately[4]-cdc
FAILED:  org.apache.cassandra.net.ProxyHandlerConnectionsTest.testExpireSome-cdc
FAILED:  org.apache.cassandra.db.commitlog.CommitLogSegmentManagerCDCTest.testNonblockingShouldMaintainSteadyDiskUsage
FAILED:  org.apache.cassandra.net.ProxyHandlerConnectionsTest.testExpireSome-compression
FAILED:  org.apache.cassandra.db.compaction.writers.CompactionAwareWriterTest.testMajorLeveledCompactionWriter
FAILED:  junit.framework.TestSuite.org.apache.cassandra.tools.nodetool.SetDefaultKeyspaceRFTest
FAILED:  org.apache.cassandra.db.SinglePartitionSliceCommandTest.testPartitionDeletionRowDeletionTie
FAILED:  org.apache.cassandra.db.commitlog.BatchCommitLogTest.testRecoveryWithBadSizeChecksum[3]
FAILED:  org.apache.cassandra.io.sstable.SSTableReaderTest.testGetScannerForNoIntersectingRanges
FAILED:  org.apache.cassandra.io.sstable.SSTableReaderTest.testGetPositionsKeyCacheStats
FAILED:  org.apache.cassandra.io.sstable.SSTableReaderTest.testGetPositionsBloomFilterStats
FAILED:  org.apache.cassandra.io.sstable.SSTableReaderTest.testIndexSummaryReplacement
FAILED:  org.apache.cassandra.io.sstable.SSTableReaderTest.testReadRateTracking
FAILED:  org.apache.cassandra.io.sstable.SSTableReaderTest.testVerifyCompressionInfoExistencePasses
FAILED:  org.apache.cassandra.io.sstable.SSTableReaderTest.testVerifyCompressionInfoExistenceThrows
FAILED:  org.apache.cassandra.io.sstable.SSTableReaderTest.testSpannedIndexPositions
FAILED:  org.apache.cassandra.io.sstable.SSTableReaderTest.testGetPositionsForRanges
FAILED:  org.apache.cassandra.io.sstable.SSTableReaderTest.testMoveAndOpenSSTable
FAILED:  org.apache.cassandra.io.sstable.SSTableReaderTest.testPersistentStatisticsWithSecondaryIndex
FAILED:  org.apache.cassandra.io.sstable.SSTableReaderTest.testGetPositionsForRangesWithKeyCache
FAILED:  org.apache.cassandra.io.sstable.SSTableReaderTest.testVerifyCompressionInfoExistenceWhenTOCUnableToOpen
FAILED:  org.apache.cassandra.io.sstable.SSTableReaderTest.testIndexSummaryUpsampleAndReload
FAILED:  org.apache.cassandra.io.sstable.SSTableReaderTest.testGetPositionsForRangesFromTableOpenedForBulkLoading
FAILED:  org.apache.cassandra.io.sstable.SSTableReaderTest.testOpeningSSTable
FAILED:  org.apache.cassandra.io.sstable.SSTableReaderTest.testPersistentStatistics
FAILED:  org.apache.cassandra.io.sstable.SSTableReaderTest.testLoadingSummaryUsesCorrectPartitioner
FAILED:  org.apache.cassandra.db.commitlog.CommitLogSegmentManagerCDCTest.testSwitchingCDCWriteModes
FAILED:  org.apache.cassandra.db.commitlog.CommitLogSegmentManagerCDCTest.testSwitchingCDCWriteModes
FAILED:  org.apache.cassandra.db.commitlog.CommitLogSegmentManagerCDCTest.testSwitchingCDCWriteModes
FAILED:  org.apache.cassandra.db.commitlog.CommitLogSegmentManagerCDCTest.testSwitchingCDCWriteModes
FAILED:  org.apache.cassandra.distributed.upgrade.CompactStorageUpgradeTest.compactStorageUpgradeTest

-------------------------------------------------------------------------------
For complete test report and logs see https://nightlies.apache.org/cassandra/Cassandra-trunk/1146/