You are viewing a plain text version of this content. The canonical link for it is here.
Posted to builds@cassandra.apache.org by Apache Jenkins Server <je...@builds.apache.org> on 2025/05/06 18:05:36 UTC

Build complete: Cassandra-5.0 #455 [UNSTABLE] 6a81306876d151085e41e54794a36096e672e6bc

-------------------------------------------------------------------------------
  Build Cassandra-5.0 #455 Still Unstable
  URL: https://ci-cassandra.apache.org/job/Cassandra-5.0/455/
  -------------------------------------------------------------------------------
  Changes:
  [Brandon Williams] Reading mmapped trie-index exceeding 2GiB results in exception


  -------------------------------------------------------------------------------
  Failed Tests:
  20 tests failed.
FAILED:  dtest-latest.bootstrap_test.TestBootstrap.Tests / dtest-latest jdk11 15/64 / test_decommissioned_wiped_node_can_join
FAILED:  dtest-latest.bootstrap_test.TestBootstrap.Tests / dtest-latest jdk11 2/64 / test_read_from_bootstrapped_node
FAILED:  dtest-upgrade-large.upgrade_tests.upgrade_through_versions_test.TestUpgrade_indev_5_0_x_To_indev_trunk.Tests / dtest-upgrade-large jdk11 31/32 / test_parallel_upgrade_with_internode_ssl
FAILED:  dtest-upgrade-novnode-large.upgrade_tests.upgrade_through_versions_test.TestUpgrade_current_4_1_x_To_indev_5_0_x.Tests / dtest-upgrade-novnode-large jdk11 3/32 / test_bootstrap
FAILED:  dtest-upgrade-novnode.upgrade_tests.cql_tests.TestCQLNodes3RF3_Upgrade_indev_4_0_x_To_indev_5_0_x.Tests / dtest-upgrade-novnode jdk11 8/128 / test_deletion
FAILED:  dtest-upgrade.upgrade_tests.paging_test.TestPagingSizeNodes3RF3_Upgrade_indev_4_0_x_To_indev_5_0_x.Tests / dtest-upgrade jdk11 58/128 / test_with_equal_results_to_page_size
FAILED:  dtest.bootstrap_test.TestBootstrap.Tests / dtest jdk17 2/64 / test_read_from_bootstrapped_node
FAILED:  dtest.cqlsh_tests.test_cqlsh_copy.TestCqlshCopy.Tests / dtest jdk11 8/64 / test_bulk_round_trip_with_backoff
FAILED:  dtest.global_row_key_cache_test.TestGlobalRowKeyCache.Tests / dtest jdk11 57/64 / test_functional
FAILED:  dtest.topology_test.TestTopology.Tests / dtest jdk11 8/64 / test_decommissioned_node_cant_rejoin
FAILED:  org.apache.cassandra.io.sstable.SSTableReaderTest.Tests / test-oa jdk17 13/16 / testSpannedIndexPositions-cassandra.testtag_IS_UNDEFINED
FAILED:  org.apache.cassandra.io.sstable.SSTableReaderTest.Tests / test-oa jdk11 13/16 / testSpannedIndexPositions-cassandra.testtag_IS_UNDEFINED
FAILED:  org.apache.cassandra.io.sstable.SSTableReaderTest.Tests / test-cdc jdk11 5/8 / testSpannedIndexPositions-cassandra.testtag_IS_UNDEFINED
FAILED:  org.apache.cassandra.io.sstable.SSTableReaderTest.Tests / test-compression jdk17 13/16 / testSpannedIndexPositions-cassandra.testtag_IS_UNDEFINED
FAILED:  org.apache.cassandra.io.sstable.SSTableReaderTest.Tests / test jdk17 13/16 / testSpannedIndexPositions-cassandra.testtag_IS_UNDEFINED
FAILED:  org.apache.cassandra.io.sstable.SSTableReaderTest.Tests / test-compression jdk11 13/16 / testSpannedIndexPositions-cassandra.testtag_IS_UNDEFINED
FAILED:  org.apache.cassandra.io.sstable.SSTableReaderTest.Tests / test-cdc jdk17 5/8 / testSpannedIndexPositions-cassandra.testtag_IS_UNDEFINED
FAILED:  org.apache.cassandra.io.sstable.SSTableReaderTest.Tests / test-system-keyspace-directory jdk11 13/16 / testSpannedIndexPositions-cassandra.testtag_IS_UNDEFINED
FAILED:  org.apache.cassandra.io.sstable.SSTableReaderTest.Tests / test-system-keyspace-directory jdk17 13/16 / testSpannedIndexPositions-cassandra.testtag_IS_UNDEFINED
FAILED:  org.apache.cassandra.io.sstable.SSTableReaderTest.Tests / test jdk11 13/16 / testSpannedIndexPositions-cassandra.testtag_IS_UNDEFINED

  -------------------------------------------------------------------------------
  For complete test report and logs see https://nightlies.apache.org/cassandra/Cassandra-5.0/455/