You are viewing a plain text version of this content. The canonical link for it is here.
Posted to dev@lucene.apache.org by Policeman Jenkins Server <je...@thetaphi.de> on 2016/07/31 22:28:38 UTC

[JENKINS] Lucene-Solr-6.x-Linux (32bit/jdk1.8.0_102) - Build # 1330 - Unstable!

Build: http://jenkins.thetaphi.de/job/Lucene-Solr-6.x-Linux/1330/
Java: 32bit/jdk1.8.0_102 -client -XX:+UseConcMarkSweepGC

1 tests failed.
FAILED:  org.apache.solr.cloud.ForceLeaderTest.testReplicasInLIRNoLeader

Error Message:
org.apache.solr.client.solrj.SolrServerException: No live SolrServers available to handle this request:[http://127.0.0.1:38677/la_/ld/forceleader_test_collection_shard1_replica2]

Stack Trace:
org.apache.solr.client.solrj.SolrServerException: org.apache.solr.client.solrj.SolrServerException: No live SolrServers available to handle this request:[http://127.0.0.1:38677/la_/ld/forceleader_test_collection_shard1_replica2]
	at __randomizedtesting.SeedInfo.seed([1894A19C0ED5E479:FE03955C37571D18]:0)
	at org.apache.solr.client.solrj.impl.CloudSolrClient.directUpdate(CloudSolrClient.java:774)
	at org.apache.solr.client.solrj.impl.CloudSolrClient.sendRequest(CloudSolrClient.java:1172)
	at org.apache.solr.client.solrj.impl.CloudSolrClient.requestWithRetryOnStaleState(CloudSolrClient.java:1061)
	at org.apache.solr.client.solrj.impl.CloudSolrClient.request(CloudSolrClient.java:997)
	at org.apache.solr.cloud.AbstractFullDistribZkTestBase.sendDocsWithRetry(AbstractFullDistribZkTestBase.java:753)
	at org.apache.solr.cloud.AbstractFullDistribZkTestBase.sendDocsWithRetry(AbstractFullDistribZkTestBase.java:741)
	at org.apache.solr.cloud.ForceLeaderTest.sendDoc(ForceLeaderTest.java:424)
	at org.apache.solr.cloud.ForceLeaderTest.assertSendDocFails(ForceLeaderTest.java:315)
	at org.apache.solr.cloud.ForceLeaderTest.testReplicasInLIRNoLeader(ForceLeaderTest.java:110)
	at sun.reflect.NativeMethodAccessorImpl.invoke0(Native Method)
	at sun.reflect.NativeMethodAccessorImpl.invoke(NativeMethodAccessorImpl.java:62)
	at sun.reflect.DelegatingMethodAccessorImpl.invoke(DelegatingMethodAccessorImpl.java:43)
	at java.lang.reflect.Method.invoke(Method.java:498)
	at com.carrotsearch.randomizedtesting.RandomizedRunner.invoke(RandomizedRunner.java:1764)
	at com.carrotsearch.randomizedtesting.RandomizedRunner$8.evaluate(RandomizedRunner.java:871)
	at com.carrotsearch.randomizedtesting.RandomizedRunner$9.evaluate(RandomizedRunner.java:907)
	at com.carrotsearch.randomizedtesting.RandomizedRunner$10.evaluate(RandomizedRunner.java:921)
	at org.apache.solr.BaseDistributedSearchTestCase$ShardsRepeatRule$ShardsFixedStatement.callStatement(BaseDistributedSearchTestCase.java:992)
	at org.apache.solr.BaseDistributedSearchTestCase$ShardsRepeatRule$ShardsStatement.evaluate(BaseDistributedSearchTestCase.java:967)
	at com.carrotsearch.randomizedtesting.rules.SystemPropertiesRestoreRule$1.evaluate(SystemPropertiesRestoreRule.java:57)
	at org.apache.lucene.util.TestRuleSetupTeardownChained$1.evaluate(TestRuleSetupTeardownChained.java:49)
	at org.apache.lucene.util.AbstractBeforeAfterRule$1.evaluate(AbstractBeforeAfterRule.java:45)
	at org.apache.lucene.util.TestRuleThreadAndTestName$1.evaluate(TestRuleThreadAndTestName.java:48)
	at org.apache.lucene.util.TestRuleIgnoreAfterMaxFailures$1.evaluate(TestRuleIgnoreAfterMaxFailures.java:64)
	at org.apache.lucene.util.TestRuleMarkFailure$1.evaluate(TestRuleMarkFailure.java:47)
	at com.carrotsearch.randomizedtesting.rules.StatementAdapter.evaluate(StatementAdapter.java:36)
	at com.carrotsearch.randomizedtesting.ThreadLeakControl$StatementRunner.run(ThreadLeakControl.java:367)
	at com.carrotsearch.randomizedtesting.ThreadLeakControl.forkTimeoutingTask(ThreadLeakControl.java:809)
	at com.carrotsearch.randomizedtesting.ThreadLeakControl$3.evaluate(ThreadLeakControl.java:460)
	at com.carrotsearch.randomizedtesting.RandomizedRunner.runSingleTest(RandomizedRunner.java:880)
	at com.carrotsearch.randomizedtesting.RandomizedRunner$5.evaluate(RandomizedRunner.java:781)
	at com.carrotsearch.randomizedtesting.RandomizedRunner$6.evaluate(RandomizedRunner.java:816)
	at com.carrotsearch.randomizedtesting.RandomizedRunner$7.evaluate(RandomizedRunner.java:827)
	at com.carrotsearch.randomizedtesting.rules.StatementAdapter.evaluate(StatementAdapter.java:36)
	at com.carrotsearch.randomizedtesting.rules.SystemPropertiesRestoreRule$1.evaluate(SystemPropertiesRestoreRule.java:57)
	at org.apache.lucene.util.AbstractBeforeAfterRule$1.evaluate(AbstractBeforeAfterRule.java:45)
	at com.carrotsearch.randomizedtesting.rules.StatementAdapter.evaluate(StatementAdapter.java:36)
	at org.apache.lucene.util.TestRuleStoreClassName$1.evaluate(TestRuleStoreClassName.java:41)
	at com.carrotsearch.randomizedtesting.rules.NoShadowingOrOverridesOnMethodsRule$1.evaluate(NoShadowingOrOverridesOnMethodsRule.java:40)
	at com.carrotsearch.randomizedtesting.rules.NoShadowingOrOverridesOnMethodsRule$1.evaluate(NoShadowingOrOverridesOnMethodsRule.java:40)
	at com.carrotsearch.randomizedtesting.rules.StatementAdapter.evaluate(StatementAdapter.java:36)
	at com.carrotsearch.randomizedtesting.rules.StatementAdapter.evaluate(StatementAdapter.java:36)
	at com.carrotsearch.randomizedtesting.rules.StatementAdapter.evaluate(StatementAdapter.java:36)
	at org.apache.lucene.util.TestRuleAssertionsRequired$1.evaluate(TestRuleAssertionsRequired.java:53)
	at org.apache.lucene.util.TestRuleMarkFailure$1.evaluate(TestRuleMarkFailure.java:47)
	at org.apache.lucene.util.TestRuleIgnoreAfterMaxFailures$1.evaluate(TestRuleIgnoreAfterMaxFailures.java:64)
	at org.apache.lucene.util.TestRuleIgnoreTestSuites$1.evaluate(TestRuleIgnoreTestSuites.java:54)
	at com.carrotsearch.randomizedtesting.rules.StatementAdapter.evaluate(StatementAdapter.java:36)
	at com.carrotsearch.randomizedtesting.ThreadLeakControl$StatementRunner.run(ThreadLeakControl.java:367)
	at java.lang.Thread.run(Thread.java:745)
Caused by: org.apache.solr.client.solrj.SolrServerException: No live SolrServers available to handle this request:[http://127.0.0.1:38677/la_/ld/forceleader_test_collection_shard1_replica2]
	at org.apache.solr.client.solrj.impl.LBHttpSolrClient.request(LBHttpSolrClient.java:383)
	at org.apache.solr.client.solrj.impl.CloudSolrClient.directUpdate(CloudSolrClient.java:768)
	... 49 more
Caused by: org.apache.solr.client.solrj.SolrServerException: Server refused connection at: http://127.0.0.1:38677/la_/ld/forceleader_test_collection_shard1_replica2
	at org.apache.solr.client.solrj.impl.HttpSolrClient.executeMethod(HttpSolrClient.java:597)
	at org.apache.solr.client.solrj.impl.HttpSolrClient.request(HttpSolrClient.java:259)
	at org.apache.solr.client.solrj.impl.HttpSolrClient.request(HttpSolrClient.java:248)
	at org.apache.solr.client.solrj.impl.LBHttpSolrClient.doRequest(LBHttpSolrClient.java:403)
	at org.apache.solr.client.solrj.impl.LBHttpSolrClient.request(LBHttpSolrClient.java:372)
	... 50 more
Caused by: java.net.ConnectException: Connection refused
	at java.net.PlainSocketImpl.socketConnect(Native Method)
	at java.net.AbstractPlainSocketImpl.doConnect(AbstractPlainSocketImpl.java:350)
	at java.net.AbstractPlainSocketImpl.connectToAddress(AbstractPlainSocketImpl.java:206)
	at java.net.AbstractPlainSocketImpl.connect(AbstractPlainSocketImpl.java:188)
	at java.net.SocksSocketImpl.connect(SocksSocketImpl.java:392)
	at java.net.Socket.connect(Socket.java:589)
	at org.apache.http.conn.scheme.PlainSocketFactory.connectSocket(PlainSocketFactory.java:117)
	at org.apache.http.impl.conn.DefaultClientConnectionOperator.openConnection(DefaultClientConnectionOperator.java:177)
	at org.apache.http.impl.conn.ManagedClientConnectionImpl.open(ManagedClientConnectionImpl.java:304)
	at org.apache.http.impl.client.DefaultRequestDirector.tryConnect(DefaultRequestDirector.java:611)
	at org.apache.http.impl.client.DefaultRequestDirector.execute(DefaultRequestDirector.java:446)
	at org.apache.http.impl.client.AbstractHttpClient.doExecute(AbstractHttpClient.java:882)
	at org.apache.http.impl.client.CloseableHttpClient.execute(CloseableHttpClient.java:82)
	at org.apache.http.impl.client.CloseableHttpClient.execute(CloseableHttpClient.java:107)
	at org.apache.http.impl.client.CloseableHttpClient.execute(CloseableHttpClient.java:55)
	at org.apache.solr.client.solrj.impl.HttpSolrClient.executeMethod(HttpSolrClient.java:495)
	... 54 more




Build Log:
Started by upstream project "Lucene-Solr-master-Linux" build number 17423

originally caused by:

 Started by upstream project "Lucene-Solr-6.x-Linux" build number 1329

 originally caused by:

  Started by upstream project "Lucene-Solr-master-Linux" build number 17422

  originally caused by:

   Started by upstream project "Lucene-Solr-6.x-Linux" build number 1328

   originally caused by:

    Started by upstream project "Lucene-Solr-master-Linux" build number 17421

    originally caused by:

     Started by upstream project "Lucene-Solr-6.x-Linux" build number 1327

     originally caused by:

      Started by upstream project "Lucene-Solr-master-Linux" build number 17420

      originally caused by:

       Started by upstream project "Lucene-Solr-6.x-Linux" build number 1326

       originally caused by:

        Started by upstream project "Lucene-Solr-master-Linux" build number 17419

        originally caused by:

         Started by upstream project "Lucene-Solr-6.x-Linux" build number 1325

         originally caused by:

          Started by upstream project "Lucene-Solr-master-Linux" build number 17418

          originally caused by:

           Started by upstream project "Lucene-Solr-6.x-Linux" build number 1324

           originally caused by:

            (deeply nested causes)

[EnvInject] - Loading node environment variables.

[EnvInject] - Preparing an environment for the build.

[EnvInject] - Keeping Jenkins system variables.

[EnvInject] - Keeping Jenkins build variables.

[EnvInject] - Evaluation the following Groovy script content: 

return evaluate(new java.io.File(JENKINS_HOME, "scripts/linux-random-java8.groovy"))


Using Java: 32bit/jdk1.8.0_102 -client -XX:+UseConcMarkSweepGC

[EnvInject] - Injecting contributions.

Building on master in workspace /var/lib/jenkins/workspace/Lucene-Solr-6.x-Linux

Fetching changes from the remote Git repository

Cleaning workspace

Checking out Revision e3de51be2edd086c29be8fdcfca7f8a5990a640c (refs/remotes/origin/branch_6x)

No emails were triggered.

[description-setter] Description set: Java: 32bit/jdk1.8.0_102 -client -XX:+UseConcMarkSweepGC

[Lucene-Solr-6.x-Linux] $ /var/lib/jenkins/tools/hudson.tasks.Ant_AntInstallation/ANT_1.8.2/bin/ant "-Dargs=-client -XX:+UseConcMarkSweepGC" jenkins-hourly

Buildfile: /home/jenkins/workspace/Lucene-Solr-6.x-Linux/build.xml


jenkins-hourly:


-print-java-info:

[java-info] java version "1.8.0_102"

[java-info] Java(TM) SE Runtime Environment (1.8.0_102-b14, Oracle Corporation)

[java-info] Java HotSpot(TM) Server VM (25.102-b14, Oracle Corporation)

[java-info] Test args: [-client -XX:+UseConcMarkSweepGC]


clean:


clean:


clean:


ivy-availability-check:


ivy-fail:


ivy-configure:

[ivy:configure] :: Apache Ivy 2.3.0 - 20130110142753 :: http://ant.apache.org/ivy/ ::

[ivy:configure] :: loading settings :: file = /home/jenkins/workspace/Lucene-Solr-6.x-Linux/lucene/top-level-ivy-settings.xml


resolve-groovy:

[ivy:cachepath] :: resolving dependencies :: org.codehaus.groovy#groovy-all-caller;working

[ivy:cachepath] 	confs: [default]

[ivy:cachepath] 	found org.codehaus.groovy#groovy-all;2.4.6 in public

[ivy:cachepath] :: resolution report :: resolve 98ms :: artifacts dl 2ms

	---------------------------------------------------------------------

	|                  |            modules            ||   artifacts   |

	|       conf       | number| search|dwnlded|evicted|| number|dwnlded|

	---------------------------------------------------------------------

	|      default     |   1   |   0   |   0   |   0   ||   1   |   0   |

	---------------------------------------------------------------------


-test-with-heapdumps-enabled:

     [echo] Java HotSpot(TM) Server VM: Enabling heap dumps on OutOfMemoryError to dir '/home/jenkins/workspace/Lucene-Solr-6.x-Linux/heapdumps'.

    [mkdir] Created dir: /home/jenkins/workspace/Lucene-Solr-6.x-Linux/heapdumps


ivy-availability-check:


ivy-fail:


ivy-configure:

[ivy:configure] :: loading settings :: file = /home/jenkins/workspace/Lucene-Solr-6.x-Linux/lucene/top-level-ivy-settings.xml


resolve-groovy:


test:


ivy-availability-check:


ivy-fail:


ivy-configure:

[ivy:configure] :: loading settings :: file = /home/jenkins/workspace/Lucene-Solr-6.x-Linux/lucene/top-level-ivy-settings.xml


-clover.load:


resolve-groovy:


-init-totals:


test-core:


-clover.disable:


ivy-availability-check:


ivy-fail:


ivy-configure:

[ivy:configure] :: loading settings :: file = /home/jenkins/workspace/Lucene-Solr-6.x-Linux/lucene/top-level-ivy-settings.xml


-clover.load:


-clover.classpath:


-clover.setup:


clover:


-check-git-state:


-git-cleanroot:


-copy-git-state:

     [copy] Copying 1 file to /home/jenkins/workspace/Lucene-Solr-6.x-Linux/lucene/build


git-autoclean:


resolve:


init:


compile-core:

    [mkdir] Created dir: /home/jenkins/workspace/Lucene-Solr-6.x-Linux/lucene/build/core/classes/java

    [javac] Compiling 782 source files to /home/jenkins/workspace/Lucene-Solr-6.x-Linux/lucene/build/core/classes/java

    [javac] Note: Some input files use or override a deprecated API.

    [javac] Note: Recompile with -Xlint:deprecation for details.

    [javac] Creating empty /home/jenkins/workspace/Lucene-Solr-6.x-Linux/lucene/build/core/classes/java/org/apache/lucene/document/package-info.class

    [javac] Creating empty /home/jenkins/workspace/Lucene-Solr-6.x-Linux/lucene/build/core/classes/java/org/apache/lucene/package-info.class

    [javac] Creating empty /home/jenkins/workspace/Lucene-Solr-6.x-Linux/lucene/build/core/classes/java/org/apache/lucene/util/bkd/package-info.class

    [javac] Creating empty /home/jenkins/workspace/Lucene-Solr-6.x-Linux/lucene/build/core/classes/java/org/apache/lucene/codecs/compressing/package-info.class

    [javac] Creating empty /home/jenkins/workspace/Lucene-Solr-6.x-Linux/lucene/build/core/classes/java/org/apache/lucene/codecs/lucene60/package-info.class

    [javac] Creating empty /home/jenkins/workspace/Lucene-Solr-6.x-Linux/lucene/build/core/classes/java/org/apache/lucene/codecs/package-info.class

    [javac] Creating empty /home/jenkins/workspace/Lucene-Solr-6.x-Linux/lucene/build/core/classes/java/org/apache/lucene/util/package-info.class

    [javac] Creating empty /home/jenkins/workspace/Lucene-Solr-6.x-Linux/lucene/build/core/classes/java/org/apache/lucene/index/package-info.class

    [javac] Creating empty /home/jenkins/workspace/Lucene-Solr-6.x-Linux/lucene/build/core/classes/java/org/apache/lucene/util/fst/package-info.class

    [javac] Creating empty /home/jenkins/workspace/Lucene-Solr-6.x-Linux/lucene/build/core/classes/java/org/apache/lucene/analysis/tokenattributes/package-info.class

    [javac] Creating empty /home/jenkins/workspace/Lucene-Solr-6.x-Linux/lucene/build/core/classes/java/org/apache/lucene/search/package-info.class

    [javac] Creating empty /home/jenkins/workspace/Lucene-Solr-6.x-Linux/lucene/build/core/classes/java/org/apache/lucene/codecs/lucene62/package-info.class

    [javac] Creating empty /home/jenkins/workspace/Lucene-Solr-6.x-Linux/lucene/build/core/classes/java/org/apache/lucene/util/packed/package-info.class

    [javac] Creating empty /home/jenkins/workspace/Lucene-Solr-6.x-Linux/lucene/build/core/classes/java/org/apache/lucene/util/mutable/package-info.class

    [javac] Creating empty /home/jenkins/workspace/Lucene-Solr-6.x-Linux/lucene/build/core/classes/java/org/apache/lucene/codecs/perfield/package-info.class

    [javac] Creating empty /home/jenkins/workspace/Lucene-Solr-6.x-Linux/lucene/build/core/classes/java/org/apache/lucene/analysis/package-info.class

    [javac] Creating empty /home/jenkins/workspace/Lucene-Solr-6.x-Linux/lucene/build/core/classes/java/org/apache/lucene/analysis/standard/package-info.class

    [javac] Creating empty /home/jenkins/workspace/Lucene-Solr-6.x-Linux/lucene/build/core/classes/java/org/apache/lucene/store/package-info.class

    [javac] Creating empty /home/jenkins/workspace/Lucene-Solr-6.x-Linux/lucene/build/core/classes/java/org/apache/lucene/codecs/blocktree/package-info.class

    [javac] Creating empty /home/jenkins/workspace/Lucene-Solr-6.x-Linux/lucene/build/core/classes/java/org/apache/lucene/search/spans/package-info.class

    [javac] Creating empty /home/jenkins/workspace/Lucene-Solr-6.x-Linux/lucene/build/core/classes/java/org/apache/lucene/codecs/lucene54/package-info.class

    [javac] Creating empty /home/jenkins/workspace/Lucene-Solr-6.x-Linux/lucene/build/core/classes/java/org/apache/lucene/search/similarities/package-info.class

    [javac] Creating empty /home/jenkins/workspace/Lucene-Solr-6.x-Linux/lucene/build/core/classes/java/org/apache/lucene/util/automaton/package-info.class

    [javac] Creating empty /home/jenkins/workspace/Lucene-Solr-6.x-Linux/lucene/build/core/classes/java/org/apache/lucene/codecs/lucene53/package-info.class

    [javac] Creating empty /home/jenkins/workspace/Lucene-Solr-6.x-Linux/lucene/build/core/classes/java/org/apache/lucene/codecs/lucene50/package-info.class

    [javac] Creating empty /home/jenkins/workspace/Lucene-Solr-6.x-Linux/lucene/build/core/classes/java/org/apache/lucene/geo/package-info.class

     [copy] Copying 3 files to /home/jenkins/workspace/Lucene-Solr-6.x-Linux/lucene/build/core/classes/java


compile-test-framework:


-check-git-state:


-git-cleanroot:


-copy-git-state:


git-autoclean:


ivy-availability-check:


ivy-fail:


ivy-configure:

[ivy:configure] :: loading settings :: file = /home/jenkins/workspace/Lucene-Solr-6.x-Linux/lucene/top-level-ivy-settings.xml


resolve:


init:


compile-lucene-core:


-check-git-state:


-git-cleanroot:


-copy-git-state:


git-autoclean:


ivy-availability-check:


ivy-fail:


ivy-configure:

[ivy:configure] :: loading settings :: file = /home/jenkins/workspace/Lucene-Solr-6.x-Linux/lucene/top-level-ivy-settings.xml


resolve:


init:


-clover.disable:


-clover.load:


-clover.classpath:


-clover.setup:


clover:


compile-core:


compile-codecs:


-check-git-state:


-git-cleanroot:


-copy-git-state:


git-autoclean:


ivy-availability-check:


ivy-fail:


ivy-configure:

[ivy:configure] :: loading settings :: file = /home/jenkins/workspace/Lucene-Solr-6.x-Linux/lucene/top-level-ivy-settings.xml


resolve:


common.init:


compile-lucene-core:


init:


-clover.disable:


-clover.load:


-clover.classpath:


-clover.setup:


clover:


compile-core:

    [mkdir] Created dir: /home/jenkins/workspace/Lucene-Solr-6.x-Linux/lucene/build/codecs/classes/java

    [javac] Compiling 66 source files to /home/jenkins/workspace/Lucene-Solr-6.x-Linux/lucene/build/codecs/classes/java

    [javac] Creating empty /home/jenkins/workspace/Lucene-Solr-6.x-Linux/lucene/build/codecs/classes/java/org/apache/lucene/codecs/bloom/package-info.class

    [javac] Creating empty /home/jenkins/workspace/Lucene-Solr-6.x-Linux/lucene/build/codecs/classes/java/org/apache/lucene/codecs/memory/package-info.class

    [javac] Creating empty /home/jenkins/workspace/Lucene-Solr-6.x-Linux/lucene/build/codecs/classes/java/org/apache/lucene/codecs/simpletext/package-info.class

    [javac] Creating empty /home/jenkins/workspace/Lucene-Solr-6.x-Linux/lucene/build/codecs/classes/java/org/apache/lucene/codecs/blockterms/package-info.class

    [javac] Creating empty /home/jenkins/workspace/Lucene-Solr-6.x-Linux/lucene/build/codecs/classes/java/org/apache/lucene/codecs/blocktreeords/package-info.class

     [copy] Copying 3 files to /home/jenkins/workspace/Lucene-Solr-6.x-Linux/lucene/build/codecs/classes/java


-clover.disable:


-clover.load:


-clover.classpath:


-clover.setup:


clover:


common.compile-core:

    [mkdir] Created dir: /home/jenkins/workspace/Lucene-Solr-6.x-Linux/lucene/build/test-framework/classes/java

    [javac] Compiling 185 source files to /home/jenkins/workspace/Lucene-Solr-6.x-Linux/lucene/build/test-framework/classes/java

    [javac] Note: Some input files use or override a deprecated API.

    [javac] Note: Recompile with -Xlint:deprecation for details.

    [javac] Creating empty /home/jenkins/workspace/Lucene-Solr-6.x-Linux/lucene/build/test-framework/classes/java/org/apache/lucene/codecs/asserting/package-info.class

    [javac] Creating empty /home/jenkins/workspace/Lucene-Solr-6.x-Linux/lucene/build/test-framework/classes/java/org/apache/lucene/codecs/ramonly/package-info.class

    [javac] Creating empty /home/jenkins/workspace/Lucene-Solr-6.x-Linux/lucene/build/test-framework/classes/java/org/apache/lucene/mockfile/package-info.class

    [javac] Creating empty /home/jenkins/workspace/Lucene-Solr-6.x-Linux/lucene/build/test-framework/classes/java/org/apache/lucene/codecs/cheapbastard/package-info.class

    [javac] Creating empty /home/jenkins/workspace/Lucene-Solr-6.x-Linux/lucene/build/test-framework/classes/java/org/apache/lucene/codecs/mockrandom/package-info.class

    [javac] Creating empty /home/jenkins/workspace/Lucene-Solr-6.x-Linux/lucene/build/test-framework/classes/java/org/apache/lucene/codecs/cranky/package-info.class

    [javac] Creating empty /home/jenkins/workspace/Lucene-Solr-6.x-Linux/lucene/build/test-framework/classes/java/org/apache/lucene/codecs/compressing/dummy/package-info.class

     [copy] Copying 4 files to /home/jenkins/workspace/Lucene-Solr-6.x-Linux/lucene/build/test-framework/classes/java


compile-core:


compile-test:

    [mkdir] Created dir: /home/jenkins/workspace/Lucene-Solr-6.x-Linux/lucene/build/core/classes/test

    [javac] Compiling 445 source files to /home/jenkins/workspace/Lucene-Solr-6.x-Linux/lucene/build/core/classes/test

    [javac] Note: Some input files use or override a deprecated API.

    [javac] Note: Recompile with -Xlint:deprecation for details.

     [copy] Copying 3 files to /home/jenkins/workspace/Lucene-Solr-6.x-Linux/lucene/build/core/classes/test


install-junit4-taskdef:


validate:


resolve-groovy:


-init-totals:


-test:

    [mkdir] Created dir: /home/jenkins/workspace/Lucene-Solr-6.x-Linux/lucene/build/core/test

[loadresource] Do not set property tests.explicitclass as its length is 0.

    [mkdir] Created dir: /home/jenkins/workspace/Lucene-Solr-6.x-Linux/lucene/build/core/test/temp

    [mkdir] Created dir: /home/jenkins/workspace/Lucene-Solr-6.x-Linux/.caches/test-stats/core

   [junit4] <JUnit4> says ciao! Master seed: 12C0BB62F9CA1A9A

   [junit4] Executing 438 suites with 3 JVMs.

   [junit4] 

   [junit4] Started J1 PID(5426@localhost).

   [junit4] Started J0 PID(5425@localhost).

   [junit4] Started J2 PID(5427@localhost).

   [junit4] Suite: org.apache.lucene.search.TestPhrasePrefixQuery

   [junit4] Completed [1/438] on J2 in 0.85s, 1 test

   [junit4] 

   [junit4] Suite: org.apache.lucene.search.TestSortedSetSortField

   [junit4] Completed [2/438] on J1 in 0.94s, 7 tests

   [junit4] 

   [junit4] Suite: org.apache.lucene.index.TestMaxPosition

   [junit4] Completed [3/438] on J1 in 0.08s, 2 tests

   [junit4] 

   [junit4] Suite: org.apache.lucene.index.TestIndexCommit

   [junit4] Completed [4/438] on J1 in 0.06s, 1 test

   [junit4] 

   [junit4] Suite: org.apache.lucene.search.TestSortedSetSelector

   [junit4] Completed [5/438] on J0 in 1.12s, 15 tests

   [junit4] 

   [junit4] Suite: org.apache.lucene.index.TestIndexWriterConfig

   [junit4] Completed [6/438] on J1 in 0.10s, 8 tests

   [junit4] 

   [junit4] Suite: org.apache.lucene.util.TestSetOnce

   [junit4] Completed [7/438] on J1 in 0.03s, 4 tests

   [junit4] 

   [junit4] Suite: org.apache.lucene.index.TestIndexWriterMaxDocs

   [junit4] IGNOR/A 0.00s J2 | TestIndexWriterMaxDocs.testExactlyAtTrueLimit

   [junit4]    > Assumption #1: 'monster' test group is disabled (@Monster(value=takes over two hours))

   [junit4] Completed [8/438] on J2 in 2.81s, 21 tests, 1 skipped

   [junit4] 

   [junit4] Suite: org.apache.lucene.index.TestExceedMaxTermLength

   [junit4] Completed [9/438] on J2 in 0.09s, 1 test

   [junit4] 

   [junit4] Suite: org.apache.lucene.index.TestFlex

   [junit4] Completed [10/438] on J2 in 0.28s, 2 tests

   [junit4] 

   [junit4] Suite: org.apache.lucene.util.TestMergedIterator

   [junit4] Completed [11/438] on J2 in 0.25s, 25 tests

   [junit4] 

   [junit4] Suite: org.apache.lucene.codecs.lucene62.TestLucene62SegmentInfoFormat

   [junit4] Completed [12/438] on J2 in 0.66s, 16 tests

   [junit4] 

   [junit4] Suite: org.apache.lucene.search.TestWildcardRandom

   [junit4] Completed [13/438] on J2 in 0.34s, 1 test

   [junit4] 

   [junit4] Suite: org.apache.lucene.analysis.TestCharacterUtils

   [junit4] Completed [14/438] on J2 in 0.02s, 4 tests

   [junit4] 

   [junit4] Suite: org.apache.lucene.index.TestUpgradeIndexMergePolicy

   [junit4] Completed [15/438] on J2 in 0.04s, 1 test

   [junit4] 

   [junit4] Suite: org.apache.lucene.search.TestReqExclBulkScorer

   [junit4] Completed [16/438] on J2 in 0.05s, 1 test

   [junit4] 

   [junit4] Suite: org.apache.lucene.util.TestIntroSelector

   [junit4] Completed [17/438] on J2 in 0.82s, 2 tests

   [junit4] 

   [junit4] Suite: org.apache.lucene.search.TestSimilarityProvider

   [junit4] Completed [18/438] on J2 in 0.04s, 1 test

   [junit4] 

   [junit4] Suite: org.apache.lucene.index.TestManyFields

   [junit4] Completed [19/438] on J0 in 8.11s, 3 tests

   [junit4] 

   [junit4] Suite: org.apache.lucene.index.TestIndexWriter

   [junit4] Completed [20/438] on J0 in 8.99s, 71 tests

   [junit4] 

   [junit4] Suite: org.apache.lucene.index.TestIndexWriterMergePolicy

   [junit4] Completed [21/438] on J0 in 4.68s, 7 tests

   [junit4] 

   [junit4] Suite: org.apache.lucene.util.TestNotDocIdSet

   [junit4] Completed [22/438] on J0 in 2.03s, 6 tests

   [junit4] 

   [junit4] Suite: org.apache.lucene.document.TestDateTools

   [junit4] Completed [23/438] on J0 in 0.05s, 5 tests

   [junit4] 

   [junit4] Suite: org.apache.lucene.search.spans.TestSpanNotQuery

   [junit4] Completed [24/438] on J0 in 0.05s, 3 tests

   [junit4] 

   [junit4] Suite: org.apache.lucene.util.TestOfflineSorter

   [junit4] IGNOR/A 0.00s J2 | TestOfflineSorter.testLargerRandom

   [junit4]    > Assumption #1: 'nightly' test group is disabled (@Nightly())

   [junit4] Completed [25/438] on J2 in 19.31s, 14 tests, 1 skipped

   [junit4] 

   [junit4] Suite: org.apache.lucene.index.TestTermsEnum2

   [junit4] Completed [26/438] on J2 in 2.28s, 4 tests

   [junit4] 

   [junit4] Suite: org.apache.lucene.index.TestBinaryDocValuesUpdates

   [junit4] IGNOR/A 0.00s J2 | TestBinaryDocValuesUpdates.testTonsOfUpdates

   [junit4]    > Assumption #1: 'nightly' test group is disabled (@Nightly())

   [junit4] Completed [27/438] on J2 in 5.41s, 28 tests, 1 skipped

   [junit4] 

   [junit4] Suite: org.apache.lucene.store.TestTrackingDirectoryWrapper

   [junit4] IGNOR/A 0.00s J2 | TestTrackingDirectoryWrapper.testFsyncDoesntCreateNewFiles

   [junit4]    > Assumption #1: test only works for FSDirectory subclasses

   [junit4] IGNOR/A 0.00s J2 | TestTrackingDirectoryWrapper.testPendingDeletions

   [junit4]    > Assumption #1: we can only install VirusCheckingFS on an FSDirectory

   [junit4] Completed [28/438] on J2 in 1.46s, 49 tests, 2 skipped

   [junit4] 

   [junit4] Suite: org.apache.lucene.util.TestUnicodeUtil

   [junit4] Completed [29/438] on J2 in 1.01s, 5 tests

   [junit4] 

   [junit4] Suite: org.apache.lucene.search.spans.TestSpanBoostQuery

   [junit4] Completed [30/438] on J2 in 0.02s, 2 tests

   [junit4] 

   [junit4] Suite: org.apache.lucene.index.TestBagOfPositions

   [junit4] Completed [31/438] on J2 in 4.97s, 1 test

   [junit4] 

   [junit4] Suite: org.apache.lucene.index.TestLongPostings

   [junit4] Completed [32/438] on J2 in 3.25s, 2 tests

   [junit4] 

   [junit4] Suite: org.apache.lucene.index.Test2BBinaryDocValues

   [junit4] IGNOR/A 0.00s J2 | Test2BBinaryDocValues.testVariableBinary

   [junit4]    > Assumption #1: 'monster' test group is disabled (@Monster(value=takes ~ 6 hours if the heap is 5gb))

   [junit4] IGNOR/A 0.00s J2 | Test2BBinaryDocValues.testFixedBinary

   [junit4]    > Assumption #1: 'monster' test group is disabled (@Monster(value=takes ~ 6 hours if the heap is 5gb))

   [junit4] Completed [33/438] on J2 in 0.00s, 2 tests, 2 skipped

   [junit4] 

   [junit4] Suite: org.apache.lucene.codecs.lucene50.TestLucene50StoredFieldsFormat

   [junit4] IGNOR/A 0.00s J2 | TestLucene50StoredFieldsFormat.testBigDocuments

   [junit4]    > Assumption #1: 'nightly' test group is disabled (@Nightly())

   [junit4] Completed [34/438] on J2 in 2.92s, 17 tests, 1 skipped

   [junit4] 

   [junit4] Suite: org.apache.lucene.util.TestRecyclingByteBlockAllocator

   [junit4] Completed [35/438] on J2 in 0.08s, 3 tests

   [junit4] 

   [junit4] Suite: org.apache.lucene.index.TestMultiFields

   [junit4] Completed [36/438] on J2 in 0.96s, 3 tests

   [junit4] 

   [junit4] Suite: org.apache.lucene.search.TestBooleanMinShouldMatch

   [junit4] Completed [37/438] on J2 in 2.72s, 17 tests

   [junit4] 

   [junit4] Suite: org.apache.lucene.search.TestSimilarity

   [junit4] Completed [38/438] on J2 in 0.05s, 1 test

   [junit4] 

   [junit4] Suite: org.apache.lucene.analysis.standard.TestStandardAnalyzer

   [junit4] Completed [39/438] on J0 in 26.05s, 34 tests

   [junit4] 

   [junit4] Suite: org.apache.lucene.search.TestTimeLimitingCollector

   [junit4] Completed [40/438] on J2 in 2.33s, 7 tests

   [junit4] 

   [junit4] Suite: org.apache.lucene.TestExternalCodecs

   [junit4] Completed [41/438] on J2 in 0.29s, 1 test

   [junit4] 

   [junit4] Suite: org.apache.lucene.search.TestFieldCacheRewriteMethod

   [junit4] Completed [42/438] on J0 in 3.54s, 2 tests

   [junit4] 

   [junit4] Suite: org.apache.lucene.search.TestTermQuery

   [junit4] Completed [43/438] on J0 in 0.05s, 2 tests

   [junit4] 

   [junit4] Suite: org.apache.lucene.util.automaton.FiniteStringsIteratorTest

   [junit4] Completed [44/438] on J2 in 2.63s, 7 tests

   [junit4] 

   [junit4] Suite: org.apache.lucene.util.TestLegacyNumericUtils

   [junit4] Completed [45/438] on J0 in 6.13s, 12 tests

   [junit4] 

   [junit4] Suite: org.apache.lucene.search.TestTermScorer

   [junit4] Completed [46/438] on J0 in 0.06s, 4 tests

   [junit4] 

   [junit4] Suite: org.apache.lucene.util.TestQueryBuilder

   [junit4] Completed [47/438] on J0 in 0.05s, 21 tests

   [junit4] 

   [junit4] Suite: org.apache.lucene.codecs.perfield.TestPerFieldDocValuesFormat

   [junit4] Completed [48/438] on J1 in 64.00s, 96 tests

   [junit4] 

   [junit4] Suite: org.apache.lucene.store.TestBufferedChecksum

   [junit4] Completed [49/438] on J1 in 0.09s, 2 tests

   [junit4] 

   [junit4] Suite: org.apache.lucene.analysis.TestStopFilter

   [junit4] Completed [50/438] on J1 in 0.03s, 4 tests

   [junit4] 

   [junit4] Suite: org.apache.lucene.search.TestIndexSearcher

   [junit4] Completed [51/438] on J1 in 0.28s, 5 tests

   [junit4] 

   [junit4] Suite: org.apache.lucene.search.TestTopDocsCollector

   [junit4] Completed [52/438] on J1 in 0.05s, 8 tests

   [junit4] 

   [junit4] Suite: org.apache.lucene.util.TestRadixSelector

   [junit4] Completed [53/438] on J1 in 0.46s, 1 test

   [junit4] 

   [junit4] Suite: org.apache.lucene.search.TestUsageTrackingFilterCachingPolicy

   [junit4] Completed [54/438] on J1 in 0.03s, 2 tests

   [junit4] 

   [junit4] Suite: org.apache.lucene.util.TestSloppyMath

   [junit4] Completed [55/438] on J1 in 2.09s, 8 tests

   [junit4] 

   [junit4] Suite: org.apache.lucene.search.TestConjunctionDISI

   [junit4] Completed [56/438] on J0 in 11.60s, 5 tests

   [junit4] 

   [junit4] Suite: org.apache.lucene.search.TestControlledRealTimeReopenThread

   [junit4] IGNOR/A 0.00s J1 | TestControlledRealTimeReopenThread.testCRTReopen

   [junit4]    > Assumption #1: 'awaitsfix' test group is disabled (@AwaitsFix(bugUrl=https://issues.apache.org/jira/browse/LUCENE-5737))

   [junit4] Completed [57/438] on J1 in 5.57s, 6 tests, 1 skipped

   [junit4] 

   [junit4] Suite: org.apache.lucene.index.TestAllFilesHaveCodecHeader

   [junit4] Completed [58/438] on J1 in 0.45s, 1 test

   [junit4] 

   [junit4] Suite: org.apache.lucene.util.TestIntArrayDocIdSet

   [junit4] Completed [59/438] on J1 in 0.54s, 5 tests

   [junit4] 

   [junit4] Suite: org.apache.lucene.index.TestDeletionPolicy

   [junit4] Completed [60/438] on J0 in 4.14s, 6 tests

   [junit4] 

   [junit4] Suite: org.apache.lucene.util.TestBytesRefHash

   [junit4] Completed [61/438] on J0 in 3.49s, 8 tests

   [junit4] 

   [junit4] Suite: org.apache.lucene.util.TestTimSorter

   [junit4] Completed [62/438] on J0 in 0.11s, 9 tests

   [junit4] 

   [junit4] Suite: org.apache.lucene.search.spans.TestSpansEnum

   [junit4] Completed [63/438] on J0 in 0.14s, 7 tests

   [junit4] 

   [junit4] Suite: org.apache.lucene.index.TestCrashCausesCorruptIndex

   [junit4] Completed [64/438] on J0 in 0.10s, 1 test

   [junit4] 

   [junit4] Suite: org.apache.lucene.index.TestParallelCompositeReader

   [junit4] Completed [65/438] on J0 in 0.30s, 15 tests

   [junit4] 

   [junit4] Suite: org.apache.lucene.index.Test2BPositions

   [junit4] IGNOR/A 0.01s J0 | Test2BPositions.test

   [junit4]    > Assumption #1: 'monster' test group is disabled (@Monster(value=uses lots of space and takes a few minutes))

   [junit4] Completed [66/438] on J0 in 0.01s, 1 test, 1 skipped

   [junit4] 

   [junit4] Suite: org.apache.lucene.util.automaton.TestAutomaton

   [junit4] Completed [67/438] on J1 in 7.77s, 56 tests

   [junit4] 

   [junit4] Suite: org.apache.lucene.store.TestLockFactory

   [junit4] Completed [68/438] on J1 in 0.06s, 2 tests

   [junit4] 

   [junit4] Suite: org.apache.lucene.index.TestAddIndexes

   [junit4] Completed [69/438] on J1 in 2.78s, 25 tests

   [junit4] 

   [junit4] Suite: org.apache.lucene.index.TestPostingsOffsets

   [junit4] Completed [70/438] on J1 in 2.35s, 13 tests

   [junit4] 

   [junit4] Suite: org.apache.lucene.document.TestBinaryDocument

   [junit4] Completed [71/438] on J1 in 0.03s, 2 tests

   [junit4] 

   [junit4] Suite: org.apache.lucene.codecs.lucene50.TestLucene50StoredFieldsFormatHighCompression

   [junit4] IGNOR/A 0.00s J0 | TestLucene50StoredFieldsFormatHighCompression.testBigDocuments

   [junit4]    > Assumption #1: 'nightly' test group is disabled (@Nightly())

   [junit4] Completed [72/438] on J0 in 7.60s, 19 tests, 1 skipped

   [junit4] 

   [junit4] Suite: org.apache.lucene.util.TestSPIClassIterator

   [junit4] Completed [73/438] on J0 in 0.01s, 1 test

   [junit4] 

   [junit4] Suite: org.apache.lucene.index.TestPrefixCodedTerms

   [junit4] Completed [74/438] on J0 in 0.21s, 5 tests

   [junit4] 

   [junit4] Suite: org.apache.lucene.search.TestMatchAllDocsQuery

   [junit4] Completed [75/438] on J0 in 0.03s, 2 tests

   [junit4] 

   [junit4] Suite: org.apache.lucene.search.TestTermRangeQuery

   [junit4] Completed [76/438] on J0 in 0.15s, 7 tests

   [junit4] 

   [junit4] Suite: org.apache.lucene.search.spans.TestSpanExplanationsOfNonMatches

   [junit4] Completed [77/438] on J0 in 0.07s, 30 tests

   [junit4] 

   [junit4] Suite: org.apache.lucene.analysis.TestCharArrayMap

   [junit4] Completed [78/438] on J0 in 0.12s, 4 tests

   [junit4] 

   [junit4] Suite: org.apache.lucene.util.automaton.LimitedFiniteStringsIteratorTest

   [junit4] Completed [79/438] on J0 in 0.17s, 6 tests

   [junit4] 

   [junit4] Suite: org.apache.lucene.geo.TestPolygon

   [junit4] Completed [80/438] on J0 in 0.03s, 15 tests

   [junit4] 

   [junit4] Suite: org.apache.lucene.index.TestStressIndexing

   [junit4] Completed [81/438] on J0 in 3.47s, 1 test

   [junit4] 

   [junit4] Suite: org.apache.lucene.store.TestRAMDirectory

   [junit4] IGNOR/A 0.00s J0 | TestRAMDirectory.testFsyncDoesntCreateNewFiles

   [junit4]    > Assumption #1: test only works for FSDirectory subclasses

   [junit4] IGNOR/A 0.00s J0 | TestRAMDirectory.testPendingDeletions

   [junit4]    > Assumption #1: we can only install VirusCheckingFS on an FSDirectory

   [junit4] Completed [82/438] on J0 in 1.64s, 48 tests, 2 skipped

   [junit4] 

   [junit4] Suite: org.apache.lucene.search.TestFilterWeight

   [junit4] Completed [83/438] on J0 in 0.02s, 1 test

   [junit4] 

   [junit4] Suite: org.apache.lucene.index.TestDocValues

   [junit4] Completed [84/438] on J0 in 0.08s, 7 tests

   [junit4] 

   [junit4] Suite: org.apache.lucene.index.TestIsCurrent

   [junit4] Completed [85/438] on J0 in 0.03s, 2 tests

   [junit4] 

   [junit4] Suite: org.apache.lucene.index.Test2BTerms

   [junit4] IGNOR/A 0.00s J0 | Test2BTerms.test2BTerms

   [junit4]    > Assumption #1: 'monster' test group is disabled (@Monster(value=very slow, use 5g minimum heap))

   [junit4] Completed [86/438] on J0 in 0.00s, 1 test, 1 skipped

   [junit4] 

   [junit4] Suite: org.apache.lucene.util.automaton.TestLevenshteinAutomata

   [junit4] Completed [87/438] on J0 in 1.67s, 4 tests

   [junit4] 

   [junit4] Suite: org.apache.lucene.search.TestComplexExplanations

   [junit4] Completed [88/438] on J0 in 1.22s, 21 tests

   [junit4] 

   [junit4] Suite: org.apache.lucene.search.TestPrefixInBooleanQuery

   [junit4] Completed [89/438] on J0 in 0.78s, 4 tests

   [junit4] 

   [junit4] Suite: org.apache.lucene.index.TestSwappedIndexFiles

   [junit4] Completed [90/438] on J0 in 0.11s, 1 test

   [junit4] 

   [junit4] Suite: org.apache.lucene.index.TestNoDeletionPolicy

   [junit4] Completed [91/438] on J0 in 0.06s, 4 tests

   [junit4] 

   [junit4] Suite: org.apache.lucene.analysis.tokenattributes.TestCharTermAttributeImpl

   [junit4] Completed [92/438] on J0 in 0.76s, 12 tests

   [junit4] 

   [junit4] Suite: org.apache.lucene.search.spans.TestSpanMultiTermQueryWrapper

   [junit4] Completed [93/438] on J0 in 0.13s, 9 tests

   [junit4] 

   [junit4] Suite: org.apache.lucene.search.TestTotalHitCountCollector

   [junit4] Completed [94/438] on J0 in 0.02s, 1 test

   [junit4] 

   [junit4] Suite: org.apache.lucene.index.TestCustomNorms

   [junit4] Completed [95/438] on J0 in 0.64s, 1 test

   [junit4] 

   [junit4] Suite: org.apache.lucene.search.spans.TestSpanSearchEquivalence

   [junit4] Completed [96/438] on J0 in 2.30s, 33 tests

   [junit4] 

   [junit4] Suite: org.apache.lucene.document.TestFieldType

   [junit4] Completed [97/438] on J0 in 0.02s, 3 tests

   [junit4] 

   [junit4] Suite: org.apache.lucene.geo.TestGeoUtils

   [junit4] Completed [98/438] on J2 in 47.53s, 6 tests

   [junit4] 

   [junit4] Suite: org.apache.lucene.index.TestOmitTf

   [junit4] Completed [99/438] on J2 in 0.32s, 6 tests

   [junit4] 

   [junit4] Suite: org.apache.lucene.search.TestSimpleExplanations

   [junit4] Completed [100/438] on J0 in 1.50s, 70 tests

   [junit4] 

   [junit4] Suite: org.apache.lucene.util.TestInPlaceMergeSorter

   [junit4] Completed [101/438] on J0 in 0.12s, 9 tests

   [junit4] 

   [junit4] Suite: org.apache.lucene.search.TestComplexExplanationsOfNonMatches

   [junit4] Completed [102/438] on J0 in 0.08s, 21 tests

   [junit4] 

   [junit4] Suite: org.apache.lucene.store.TestBufferedIndexInput

   [junit4] Completed [103/438] on J2 in 0.60s, 4 tests

   [junit4] 

   [junit4] Suite: org.apache.lucene.search.TestAutomatonQueryUnicode

   [junit4] Completed [104/438] on J2 in 0.05s, 1 test

   [junit4] 

   [junit4] Suite: org.apache.lucene.index.TestConcurrentMergeScheduler

   [junit4] Completed [105/438] on J2 in 2.59s, 16 tests

   [junit4] 

   [junit4] Suite: org.apache.lucene.index.TestIndexWriterForceMerge

   [junit4] Completed [106/438] on J2 in 0.80s, 4 tests

   [junit4] 

   [junit4] Suite: org.apache.lucene.index.Test4GBStoredFields

   [junit4] IGNOR/A 0.00s J2 | Test4GBStoredFields.test

   [junit4]    > Assumption #1: 'nightly' test group is disabled (@Nightly())

   [junit4] Completed [107/438] on J2 in 0.00s, 1 test, 1 skipped

   [junit4] 

   [junit4] Suite: org.apache.lucene.util.packed.TestDirectMonotonic

   [junit4] Completed [108/438] on J0 in 3.81s, 4 tests

   [junit4] 

   [junit4] Suite: org.apache.lucene.analysis.TestCachingTokenFilter

   [junit4] Completed [109/438] on J0 in 0.03s, 2 tests

   [junit4] 

   [junit4] Suite: org.apache.lucene.index.TestTermVectorsReader

   [junit4] Completed [110/438] on J0 in 0.31s, 13 tests

   [junit4] 

   [junit4] Suite: org.apache.lucene.util.automaton.TestCompiledAutomaton

   [junit4] Completed [111/438] on J2 in 0.29s, 6 tests

   [junit4] 

   [junit4] Suite: org.apache.lucene.index.TestTerm

   [junit4] Completed [112/438] on J2 in 0.01s, 1 test

   [junit4] 

   [junit4] Suite: org.apache.lucene.index.TestIndexWriterWithThreads

   [junit4] IGNOR/A 0.01s J0 | TestIndexWriterWithThreads.testOpenTwoIndexWritersOnDifferentThreads

   [junit4]    > Assumption #1: aborting test: timeout obtaining lock

   [junit4] Completed [113/438] on J0 in 2.27s, 12 tests, 1 skipped

   [junit4] 

   [junit4] Suite: org.apache.lucene.index.TestIndexWriterOnJRECrash

   [junit4] IGNOR/A 0.00s J0 | TestIndexWriterOnJRECrash.testNRTThreads

   [junit4]    > Assumption #1: 'nightly' test group is disabled (@Nightly())

   [junit4] Completed [114/438] on J0 in 0.00s, 1 test, 1 skipped

   [junit4] 

   [junit4] Suite: org.apache.lucene.search.spans.TestSpanCollection

   [junit4] Completed [115/438] on J0 in 0.09s, 3 tests

   [junit4] 

   [junit4] Suite: org.apache.lucene.index.TestDirectoryReaderReopen

   [junit4] Completed [116/438] on J0 in 1.77s, 14 tests

   [junit4] 

   [junit4] Suite: org.apache.lucene.search.TestLRUQueryCache

   [junit4] Completed [117/438] on J2 in 5.08s, 18 tests

   [junit4] 

   [junit4] Suite: org.apache.lucene.index.TestParallelReaderEmptyIndex

   [junit4] Completed [118/438] on J2 in 0.05s, 2 tests

   [junit4] 

   [junit4] Suite: org.apache.lucene.index.TestLazyProxSkipping

   [junit4] Completed [119/438] on J2 in 0.23s, 2 tests

   [junit4] 

   [junit4] Suite: org.apache.lucene.analysis.TestWordlistLoader

   [junit4] Completed [120/438] on J2 in 0.02s, 3 tests

   [junit4] 

   [junit4] Suite: org.apache.lucene.search.TestWildcard

   [junit4] Completed [121/438] on J2 in 0.11s, 8 tests

   [junit4] 

   [junit4] Suite: org.apache.lucene.search.TestSloppyPhraseQuery

   [junit4] Completed [122/438] on J2 in 0.89s, 9 tests

   [junit4] 

   [junit4] Suite: org.apache.lucene.codecs.lucene50.TestLucene50TermVectorsFormat

   [junit4] Completed [123/438] on J1 in 31.15s, 17 tests

   [junit4] 

   [junit4] Suite: org.apache.lucene.index.TestBagOfPostings

   [junit4] Completed [124/438] on J2 in 9.76s, 1 test

   [junit4] 

   [junit4] Suite: org.apache.lucene.search.similarities.TestBM25Similarity

   [junit4] Completed [125/438] on J2 in 0.02s, 3 tests

   [junit4] 

   [junit4] Suite: org.apache.lucene.document.TestField

   [junit4] Completed [126/438] on J2 in 0.06s, 27 tests

   [junit4] 

   [junit4] Suite: org.apache.lucene.search.TestNot

   [junit4] Completed [127/438] on J2 in 0.02s, 1 test

   [junit4] 

   [junit4] Suite: org.apache.lucene.util.TestFrequencyTrackingRingBuffer

   [junit4] Completed [128/438] on J2 in 0.31s, 2 tests

   [junit4] 

   [junit4] Suite: org.apache.lucene.index.TestTerms

   [junit4] Completed [129/438] on J2 in 0.33s, 8 tests

   [junit4] 

   [junit4] Suite: org.apache.lucene.util.mutable.TestMutableValues

   [junit4] Completed [130/438] on J2 in 0.02s, 6 tests

   [junit4] 

   [junit4] Suite: org.apache.lucene.TestDemo

   [junit4] Completed [131/438] on J2 in 0.01s, 1 test

   [junit4] 

   [junit4] Suite: org.apache.lucene.index.TestPayloads

   [junit4] Completed [132/438] on J2 in 0.10s, 7 tests

   [junit4] 

   [junit4] Suite: org.apache.lucene.index.TestIndexFileDeleter

   [junit4] Completed [133/438] on J2 in 0.75s, 10 tests

   [junit4] 

   [junit4] Suite: org.apache.lucene.index.TestForTooMuchCloning

   [junit4] Completed [134/438] on J2 in 0.06s, 1 test

   [junit4] 

   [junit4] Suite: org.apache.lucene.search.TestSynonymQuery

   [junit4] Completed [135/438] on J2 in 0.02s, 4 tests

   [junit4] 

   [junit4] Suite: org.apache.lucene.index.TestCodecHoldsOpenFiles

   [junit4] Completed [136/438] on J2 in 0.06s, 1 test

   [junit4] 

   [junit4] Suite: org.apache.lucene.codecs.lucene53.TestLucene53NormsFormat

   [junit4] IGNOR/A 0.00s J2 | TestLucene53NormsFormat.testMergeStability

   [junit4]    > Assumption #1: The MockRandom PF randomizes content on the fly, so we can't check it

   [junit4] IGNOR/A 0.00s J2 | TestLucene53NormsFormat.testNCommonBig

   [junit4]    > Assumption #1: 'nightly' test group is disabled (@Nightly())

   [junit4] Completed [137/438] on J2 in 7.51s, 17 tests, 2 skipped

   [junit4] 

   [junit4] Suite: org.apache.lucene.store.TestMultiMMap

   [junit4] Completed [138/438] on J2 in 2.24s, 56 tests

   [junit4] 

   [junit4] Suite: org.apache.lucene.index.TestMergePolicyWrapper

   [junit4] Completed [139/438] on J2 in 0.01s, 1 test

   [junit4] 

   [junit4] Suite: org.apache.lucene.index.TestIndexWriterNRTIsCurrent

   [junit4] Completed [140/438] on J2 in 2.46s, 1 test

   [junit4] 

   [junit4] Suite: org.apache.lucene.index.TestIndexWriterReader

   [junit4] IGNOR/A 0.00s J2 | TestIndexWriterReader.testDuringAddIndexes

   [junit4]    > Assumption #1: 'nightly' test group is disabled (@Nightly())

   [junit4] Completed [141/438] on J2 in 4.07s, 23 tests, 1 skipped

   [junit4] 

   [junit4] Suite: org.apache.lucene.search.TestBlendedTermQuery

   [junit4] Completed [142/438] on J2 in 0.02s, 3 tests

   [junit4] 

   [junit4] Suite: org.apache.lucene.index.TestRollingUpdates

   [junit4] Completed [143/438] on J2 in 0.92s, 2 tests

   [junit4] 

   [junit4] Suite: org.apache.lucene.search.TestSubScorerFreqs

   [junit4] Completed [144/438] on J2 in 0.04s, 3 tests

   [junit4] 

   [junit4] Suite: org.apache.lucene.index.TestTieredMergePolicy

   [junit4] Completed [145/438] on J2 in 2.90s, 6 tests

   [junit4] 

   [junit4] Suite: org.apache.lucene.index.TestIndexWriterThreadsToSegments

   [junit4] Completed [146/438] on J2 in 1.58s, 4 tests

   [junit4] 

   [junit4] Suite: org.apache.lucene.codecs.compressing.TestFastDecompressionMode

   [junit4] Completed [147/438] on J2 in 3.35s, 11 tests

   [junit4] 

   [junit4] Suite: org.apache.lucene.util.TestDocIdSetBuilder

   [junit4] Completed [148/438] on J2 in 1.67s, 7 tests

   [junit4] 

   [junit4] Suite: org.apache.lucene.util.TestSparseFixedBitDocIdSet

   [junit4] Completed [149/438] on J2 in 1.08s, 5 tests

   [junit4] 

   [junit4] Suite: org.apache.lucene.search.TestMultiThreadTermVectors

   [junit4] Completed [150/438] on J2 in 1.61s, 1 test

   [junit4] 

   [junit4] Suite: org.apache.lucene.util.TestIOUtils

   [junit4] Completed [151/438] on J2 in 0.11s, 18 tests

   [junit4] 

   [junit4] Suite: org.apache.lucene.search.TestSort

   [junit4] Completed [152/438] on J2 in 0.17s, 25 tests

   [junit4] 

   [junit4] Suite: org.apache.lucene.index.TestIndexWriterMerging

   [junit4] Completed [153/438] on J2 in 1.81s, 6 tests

   [junit4] 

   [junit4] Suite: org.apache.lucene.util.fst.TestFSTs

   [junit4] IGNOR/A 0.00s J2 | TestFSTs.testBigSet

   [junit4]    > Assumption #1: 'nightly' test group is disabled (@Nightly())

   [junit4] Completed [154/438] on J2 in 7.81s, 20 tests, 1 skipped

   [junit4] 

   [junit4] Suite: org.apache.lucene.util.TestTimSorterWorstCase

   [junit4] Completed [155/438] on J1 in 63.45s, 1 test

   [junit4] 

   [junit4] Suite: org.apache.lucene.index.TestSegmentMerger

   [junit4] Completed [156/438] on J1 in 0.75s, 3 tests

   [junit4] 

   [junit4] Suite: org.apache.lucene.search.TestMultiset

   [junit4] Completed [157/438] on J1 in 0.02s, 2 tests

   [junit4] 

   [junit4] Suite: org.apache.lucene.search.TestTopDocsMerge

   [junit4] Completed [158/438] on J1 in 1.35s, 2 tests

   [junit4] 

   [junit4] Suite: org.apache.lucene.search.spans.TestSpanOrQuery

   [junit4] Completed [159/438] on J1 in 0.02s, 3 tests

   [junit4] 

   [junit4] Suite: org.apache.lucene.TestMergeSchedulerExternal

   [junit4] Completed [160/438] on J1 in 0.69s, 2 tests

   [junit4] 

   [junit4] Suite: org.apache.lucene.util.automaton.TestDeterminism

   [junit4] Completed [161/438] on J1 in 0.74s, 2 tests

   [junit4] 

   [junit4] Suite: org.apache.lucene.search.TestNumericRangeQuery64

   [junit4] Completed [162/438] on J2 in 20.31s, 29 tests

   [junit4] 

   [junit4] Suite: org.apache.lucene.codecs.perfield.TestPerFieldPostingsFormat2

   [junit4] Completed [163/438] on J1 in 0.63s, 5 tests

   [junit4] 

   [junit4] Suite: org.apache.lucene.index.TestTermVectorsWriter

   [junit4] Completed [164/438] on J1 in 0.14s, 15 tests

   [junit4] 

   [junit4] Suite: org.apache.lucene.util.TestAttributeSource

   [junit4] Completed [165/438] on J1 in 0.02s, 7 tests

   [junit4] 

   [junit4] Suite: org.apache.lucene.util.fst.TestBytesStore

   [junit4] Completed [166/438] on J2 in 1.70s, 1 test

   [junit4] 

   [junit4] Suite: org.apache.lucene.search.TestNumericRangeQuery32

   [junit4] Completed [167/438] on J2 in 3.38s, 23 tests

   [junit4] 

   [junit4] Suite: org.apache.lucene.search.TestMinShouldMatch2

   [junit4] Completed [168/438] on J1 in 9.95s, 6 tests

   [junit4] 

   [junit4] Suite: org.apache.lucene.index.TestDocIDMerger

   [junit4] Completed [169/438] on J1 in 0.02s, 2 tests

   [junit4] 

   [junit4] Suite: org.apache.lucene.index.TestInfoStream

   [junit4] Completed [170/438] on J1 in 0.02s, 2 tests

   [junit4] 

   [junit4] Suite: org.apache.lucene.search.TestShardSearching

   [junit4] Completed [171/438] on J2 in 14.14s, 1 test

   [junit4] 

   [junit4] Suite: org.apache.lucene.search.TestSearcherManager

   [junit4] Completed [172/438] on J2 in 3.93s, 10 tests

   [junit4] 

   [junit4] Suite: org.apache.lucene.search.TestBooleanOr

   [junit4] Completed [173/438] on J2 in 4.25s, 7 tests

   [junit4] 

   [junit4] Suite: org.apache.lucene.index.TestFlushByRamOrCountsPolicy

   [junit4] Completed [174/438] on J2 in 4.92s, 5 tests

   [junit4] 

   [junit4] Suite: org.apache.lucene.index.TestIndexWriterDelete

   [junit4] IGNOR/A 0.00s J2 | TestIndexWriterDelete.testApplyDeletesOnFlush

   [junit4]    > Assumption #1: 'nightly' test group is disabled (@Nightly())

   [junit4] Completed [175/438] on J2 in 4.07s, 27 tests, 1 skipped

   [junit4] 

   [junit4] Suite: org.apache.lucene.index.TestNRTThreads

   [junit4] Completed [176/438] on J2 in 7.26s, 1 test

   [junit4] 

   [junit4] Suite: org.apache.lucene.index.TestDuelingCodecs

   [junit4] Completed [177/438] on J2 in 15.76s, 2 tests

   [junit4] 

   [junit4] Suite: org.apache.lucene.geo.TestPolygon2D

   [junit4] Completed [178/438] on J1 in 52.79s, 10 tests

   [junit4] 

   [junit4] Suite: org.apache.lucene.search.TestBoolean2

   [junit4] Completed [179/438] on J2 in 2.95s, 11 tests

   [junit4] 

   [junit4] Suite: org.apache.lucene.util.automaton.TestDeterminizeLexicon

   [junit4] Completed [180/438] on J1 in 2.49s, 1 test

   [junit4] 

   [junit4] Suite: org.apache.lucene.search.TestBooleanRewrites

   [junit4] Completed [181/438] on J1 in 0.36s, 7 tests

   [junit4] 

   [junit4] Suite: org.apache.lucene.search.TestScoreCachingWrappingScorer

   [junit4] Completed [182/438] on J1 in 0.01s, 1 test

   [junit4] 

   [junit4] Suite: org.apache.lucene.index.TestPersistentSnapshotDeletionPolicy

   [junit4] Completed [183/438] on J2 in 1.38s, 13 tests

   [junit4] 

   [junit4] Suite: org.apache.lucene.index.TestThreadedForceMerge

   [junit4] Completed [184/438] on J1 in 0.49s, 1 test

   [junit4] 

   [junit4] Suite: org.apache.lucene.index.TestParallelTermEnum

   [junit4] Completed [185/438] on J1 in 0.03s, 1 test

   [junit4] 

   [junit4] Suite: org.apache.lucene.codecs.compressing.TestFastCompressionMode

   [junit4] Completed [186/438] on J1 in 2.05s, 11 tests

   [junit4] 

   [junit4] Suite: org.apache.lucene.search.spans.TestSpans

   [junit4] Completed [187/438] on J1 in 0.44s, 26 tests

   [junit4] 

   [junit4] Suite: org.apache.lucene.index.TestAtomicUpdate

   [junit4] Completed [188/438] on J2 in 4.06s, 1 test

   [junit4] 

   [junit4] Suite: org.apache.lucene.search.spans.TestBasics

   [junit4] Completed [189/438] on J1 in 2.40s, 25 tests

   [junit4] 

   [junit4] Suite: org.apache.lucene.index.TestAllFilesHaveChecksumFooter

   [junit4] Completed [190/438] on J1 in 0.44s, 1 test

   [junit4] 

   [junit4] Suite: org.apache.lucene.store.TestFileSwitchDirectory

   [junit4] IGNOR/A 0.00s J1 | TestFileSwitchDirectory.testPendingDeletions

   [junit4]    > Assumption #1: we can only install VirusCheckingFS on an FSDirectory

   [junit4] IGNOR/A 0.00s J1 | TestFileSwitchDirectory.testFsyncDoesntCreateNewFiles

   [junit4]    > Assumption #1: test only works for FSDirectory subclasses

   [junit4] Completed [191/438] on J1 in 1.13s, 45 tests, 2 skipped

   [junit4] 

   [junit4] Suite: org.apache.lucene.index.TestStressAdvance

   [junit4] Completed [192/438] on J2 in 4.71s, 1 test

   [junit4] 

   [junit4] Suite: org.apache.lucene.index.TestNorms

   [junit4] Completed [193/438] on J2 in 0.90s, 2 tests

   [junit4] 

   [junit4] Suite: org.apache.lucene.index.TestIndexWriterCommit

   [junit4] Completed [194/438] on J2 in 1.68s, 14 tests

   [junit4] 

   [junit4] Suite: org.apache.lucene.codecs.lucene54.TestLucene54DocValuesFormat

   [junit4] IGNOR/A 0.00s J0 | TestLucene54DocValuesFormat.testSortedVariableLengthManyVsStoredFields

   [junit4]    > Assumption #1: 'nightly' test group is disabled (@Nightly())

   [junit4] IGNOR/A 0.00s J0 | TestLucene54DocValuesFormat.testSortedSetVariableLengthManyVsStoredFields

   [junit4]    > Assumption #1: 'nightly' test group is disabled (@Nightly())

   [junit4] IGNOR/A 0.00s J0 | TestLucene54DocValuesFormat.testTermsEnumRandomMany

   [junit4]    > Assumption #1: 'nightly' test group is disabled (@Nightly())

   [junit4] Completed [195/438] on J0 in 155.65s, 109 tests, 3 skipped

   [junit4] 

   [junit4] Suite: org.apache.lucene.util.Test2BPagedBytes

   [junit4] IGNOR/A 0.00s J0 | Test2BPagedBytes.test

   [junit4]    > Assumption #1: 'monster' test group is disabled (@Monster(value=You must increase heap to > 2 G to run this))

   [junit4] Completed [196/438] on J0 in 0.00s, 1 test, 1 skipped

   [junit4] 

   [junit4] Suite: org.apache.lucene.codecs.perfield.TestPerFieldPostingsFormat

   [junit4] IGNOR/A 0.00s J1 | TestPerFieldPostingsFormat.testPostingsEnumReuse

   [junit4]    > Assumption #1: The MockRandom PF randomizes content on the fly, so we can't check it

   [junit4] IGNOR/A 0.00s J1 | TestPerFieldPostingsFormat.testMergeStability

   [junit4]    > Assumption #1: The MockRandom PF randomizes content on the fly, so we can't check it

   [junit4] Completed [197/438] on J1 in 8.83s, 24 tests, 2 skipped

   [junit4] 

   [junit4] Suite: org.apache.lucene.search.TestSortRandom

   [junit4] Completed [198/438] on J1 in 1.02s, 2 tests

   [junit4] 

   [junit4] Suite: org.apache.lucene.index.TestPointValues

   [junit4] Completed [199/438] on J0 in 3.91s, 32 tests

   [junit4] 

   [junit4] Suite: org.apache.lucene.index.TestMixedCodecs

   [junit4] Completed [200/438] on J0 in 1.59s, 1 test

   [junit4] 

   [junit4] Suite: org.apache.lucene.index.TestNRTReaderCleanup

   [junit4] Completed [201/438] on J0 in 0.03s, 1 test

   [junit4] 

   [junit4] Suite: org.apache.lucene.util.TestNumericUtils

   [junit4] Completed [202/438] on J1 in 4.89s, 24 tests

   [junit4] 

   [junit4] Suite: org.apache.lucene.search.TestConstantScoreQuery

   [junit4] Completed [203/438] on J1 in 0.05s, 5 tests

   [junit4] 

   [junit4] Suite: org.apache.lucene.search.TestLiveFieldValues

   [junit4] Completed [204/438] on J0 in 3.05s, 1 test

   [junit4] 

   [junit4] Suite: org.apache.lucene.search.FuzzyTermOnShortTermsTest

   [junit4] Completed [205/438] on J0 in 0.09s, 1 test

   [junit4] 

   [junit4] Suite: org.apache.lucene.search.spans.TestNearSpansOrdered

   [junit4] Completed [206/438] on J0 in 0.27s, 19 tests

   [junit4] 

   [junit4] Suite: org.apache.lucene.search.TestDateSort

   [junit4] Completed [207/438] on J0 in 0.04s, 1 test

   [junit4] 

   [junit4] Suite: org.apache.lucene.index.TestNRTReaderWithThreads

   [junit4] Completed [208/438] on J0 in 1.32s, 1 test

   [junit4] 

   [junit4] Suite: org.apache.lucene.codecs.TestCodecUtil

   [junit4] Completed [209/438] on J0 in 0.03s, 15 tests

   [junit4] 

   [junit4] Suite: org.apache.lucene.util.TestFixedBitDocIdSet

   [junit4] Completed [210/438] on J0 in 0.64s, 5 tests

   [junit4] 

   [junit4] Suite: org.apache.lucene.util.TestSmallFloat

   [junit4] Completed [211/438] on J0 in 0.18s, 2 tests

   [junit4] 

   [junit4] Suite: org.apache.lucene.index.TestDocumentsWriterStallControl

   [junit4] Completed [212/438] on J2 in 15.16s, 3 tests

   [junit4] 

   [junit4] Suite: org.apache.lucene.search.TestSearchAfter

   [junit4] Completed [213/438] on J0 in 0.62s, 1 test

   [junit4] 

   [junit4] Suite: org.apache.lucene.util.TestIntroSorter

   [junit4] Completed [214/438] on J0 in 0.09s, 9 tests

   [junit4] 

   [junit4] Suite: org.apache.lucene.search.similarities.TestClassicSimilarity

   [junit4] Completed [215/438] on J0 in 0.07s, 11 tests

   [junit4] 

   [junit4] Suite: org.apache.lucene.util.automaton.TestMinimize

   [junit4] Completed [216/438] on J0 in 1.81s, 3 tests

   [junit4] 

   [junit4] Suite: org.apache.lucene.index.TestNeverDelete

   [junit4] Completed [217/438] on J2 in 3.31s, 1 test

   [junit4] 

   [junit4] Suite: org.apache.lucene.index.TestSnapshotDeletionPolicy

   [junit4] Completed [218/438] on J0 in 1.21s, 7 tests

   [junit4] 

   [junit4] Suite: org.apache.lucene.util.TestArrayUtil

   [junit4] Completed [219/438] on J0 in 3.94s, 14 tests

   [junit4] 

   [junit4] Suite: org.apache.lucene.index.TestIndexWriterUnicode

   [junit4] Completed [220/438] on J2 in 4.65s, 5 tests

   [junit4] 

   [junit4] Suite: org.apache.lucene.util.packed.TestPackedInts

   [junit4] IGNOR/A 0.00s J1 | TestPackedInts.testBlockReaderOverflow

   [junit4]    > Assumption #1: 'nightly' test group is disabled (@Nightly())

   [junit4] Completed [221/438] on J1 in 15.51s, 28 tests, 3 skipped

   [junit4] 

   [junit4] Suite: org.apache.lucene.TestAssertions

   [junit4] Completed [222/438] on J1 in 0.02s, 1 test

   [junit4] 

   [junit4] Suite: org.apache.lucene.index.TestTransactions

   [junit4] Completed [223/438] on J1 in 1.71s, 1 test

   [junit4] 

   [junit4] Suite: org.apache.lucene.index.TestIndexWriterLockRelease

   [junit4] Completed [224/438] on J1 in 0.02s, 1 test

   [junit4] 

   [junit4] Suite: org.apache.lucene.index.TestConsistentFieldNumbers

   [junit4] Completed [225/438] on J2 in 3.74s, 4 tests

   [junit4] 

   [junit4] Suite: org.apache.lucene.util.TestWeakIdentityMap

   [junit4] Completed [226/438] on J2 in 8.92s, 2 tests

   [junit4] 

   [junit4] Suite: org.apache.lucene.index.TestDirectoryReader

   [junit4] Completed [227/438] on J2 in 0.72s, 24 tests

   [junit4] 

   [junit4] Suite: org.apache.lucene.search.TestPhraseQuery

   [junit4] Completed [228/438] on J2 in 1.07s, 21 tests

   [junit4] 

   [junit4] Suite: org.apache.lucene.index.TestIndexWriterExceptions

   [junit4] IGNOR/A 0.00s J1 | TestIndexWriterExceptions.testTooManyTokens

   [junit4]    > Assumption #1: 'nightly' test group is disabled (@Nightly())

   [junit4] Completed [229/438] on J1 in 15.08s, 36 tests, 1 skipped

   [junit4] 

   [junit4] Suite: org.apache.lucene.search.spans.TestSpanExplanations

   [junit4] Completed [230/438] on J1 in 0.48s, 30 tests

   [junit4] 

   [junit4] Suite: org.apache.lucene.index.TestByteSlices

   [junit4] Completed [231/438] on J1 in 6.13s, 1 test

   [junit4] 

   [junit4] Suite: org.apache.lucene.util.TestCollectionUtil

   [junit4] Completed [232/438] on J2 in 10.56s, 4 tests

   [junit4] 

   [junit4] Suite: org.apache.lucene.index.TestOmitNorms

   [junit4] Completed [233/438] on J2 in 0.60s, 5 tests

   [junit4] 

   [junit4] Suite: org.apache.lucene.codecs.lucene60.TestLucene60PointsFormat

   [junit4] IGNOR/A 0.00s J1 | TestLucene60PointsFormat.testRandomBinaryBig

   [junit4]    > Assumption #1: 'nightly' test group is disabled (@Nightly())

   [junit4] IGNOR/A 0.00s J1 | TestLucene60PointsFormat.testMergeStability

   [junit4]    > Assumption #1: TODO: mess with the parameters and test gets angry!

   [junit4] Completed [234/438] on J1 in 4.16s, 17 tests, 2 skipped

   [junit4] 

   [junit4] Suite: org.apache.lucene.util.TestCharsRefBuilder

   [junit4] Completed [235/438] on J1 in 0.01s, 2 tests

   [junit4] 

   [junit4] Suite: org.apache.lucene.index.TestSameTokenSamePosition

   [junit4] Completed [236/438] on J1 in 0.03s, 2 tests

   [junit4] 

   [junit4] Suite: org.apache.lucene.index.TestMultiDocValues

   [junit4] Completed [237/438] on J1 in 0.25s, 8 tests

   [junit4] 

   [junit4] Suite: org.apache.lucene.index.TestNoMergePolicy

   [junit4] Completed [238/438] on J1 in 0.03s, 4 tests

   [junit4] 

   [junit4] Suite: org.apache.lucene.search.TestMultiTermConstantScore

   [junit4] Completed [239/438] on J1 in 0.82s, 8 tests

   [junit4] 

   [junit4] Suite: org.apache.lucene.search.MultiCollectorTest

   [junit4] Completed [240/438] on J1 in 0.02s, 4 tests

   [junit4] 

   [junit4] Suite: org.apache.lucene.search.spans.TestSpanContainQuery

   [junit4] Completed [241/438] on J1 in 0.05s, 4 tests

   [junit4] 

   [junit4] Suite: org.apache.lucene.search.TestDocValuesScoring

   [junit4] Completed [242/438] on J1 in 0.03s, 1 test

   [junit4] 

   [junit4] Suite: org.apache.lucene.util.TestFixedBitSet

   [junit4] Completed [243/438] on J2 in 5.04s, 19 tests

   [junit4] 

   [junit4] Suite: org.apache.lucene.search.TestRegexpRandom2

   [junit4] Completed [244/438] on J2 in 1.87s, 1 test

   [junit4] 

   [junit4] Suite: org.apache.lucene.index.TestNumericDocValuesUpdates

   [junit4] IGNOR/A 0.00s J1 | TestNumericDocValuesUpdates.testTonsOfUpdates

   [junit4]    > Assumption #1: 'nightly' test group is disabled (@Nightly())

   [junit4] Completed [245/438] on J1 in 3.50s, 31 tests, 1 skipped

   [junit4] 

   [junit4] Suite: org.apache.lucene.store.TestNRTCachingDirectory

   [junit4] IGNOR/A 0.00s J2 | TestNRTCachingDirectory.testPendingDeletions

   [junit4]    > Assumption #1: we can only install VirusCheckingFS on an FSDirectory

   [junit4] IGNOR/A 0.00s J2 | TestNRTCachingDirectory.testFsyncDoesntCreateNewFiles

   [junit4]    > Assumption #1: test only works for FSDirectory subclasses

   [junit4] Completed [246/438] on J2 in 1.28s, 46 tests, 2 skipped

   [junit4] 

   [junit4] Suite: org.apache.lucene.index.TestSegmentReader

   [junit4] Completed [247/438] on J2 in 0.70s, 7 tests

   [junit4] 

   [junit4] Suite: org.apache.lucene.codecs.compressing.TestHighCompressionMode

   [junit4] Completed [248/438] on J1 in 2.04s, 7 tests

   [junit4] 

   [junit4] Suite: org.apache.lucene.util.TestMathUtil

   [junit4] Completed [249/438] on J1 in 0.03s, 5 tests

   [junit4] 

   [junit4] Suite: org.apache.lucene.util.TestVirtualMethod

   [junit4] Completed [250/438] on J1 in 0.02s, 2 tests

   [junit4] 

   [junit4] Suite: org.apache.lucene.index.TestCrash

   [junit4] Completed [251/438] on J2 in 0.35s, 5 tests

   [junit4] 

   [junit4] Suite: org.apache.lucene.index.TestSegmentTermDocs

   [junit4] Completed [252/438] on J2 in 0.40s, 4 tests

   [junit4] 

   [junit4] Suite: org.apache.lucene.analysis.TestToken

   [junit4] Completed [253/438] on J2 in 0.02s, 5 tests

   [junit4] 

   [junit4] Suite: org.apache.lucene.index.TestFieldsReader

   [junit4] Completed [254/438] on J2 in 2.83s, 2 tests

   [junit4] 

   [junit4] Suite: org.apache.lucene.search.TestSimpleSearchEquivalence

   [junit4] Completed [255/438] on J2 in 0.86s, 17 tests

   [junit4] 

   [junit4] Suite: org.apache.lucene.search.TestCustomSearcherSort

   [junit4] Completed [256/438] on J2 in 1.50s, 2 tests

   [junit4] 

   [junit4] Suite: org.apache.lucene.search.TestSearchWithThreads

   [junit4] Completed [257/438] on J1 in 6.57s, 1 test

   [junit4] 

   [junit4] Suite: org.apache.lucene.index.TestDocValuesIndexing

   [junit4] Completed [258/438] on J2 in 0.23s, 34 tests

   [junit4] 

   [junit4] Suite: org.apache.lucene.search.similarities.TestSimilarityBase

   [junit4] Completed [259/438] on J2 in 1.15s, 32 tests

   [junit4] 

   [junit4] Suite: org.apache.lucene.store.TestHugeRamFile

   [junit4] Completed [260/438] on J2 in 1.78s, 1 test

   [junit4] 

   [junit4] Suite: org.apache.lucene.index.TestIndexWriterOnDiskFull

   [junit4] Completed [261/438] on J2 in 0.34s, 4 tests

   [junit4] 

   [junit4] Suite: org.apache.lucene.index.TestTransactionRollback

   [junit4] Completed [262/438] on J2 in 0.09s, 2 tests

   [junit4] 

   [junit4] Suite: org.apache.lucene.util.TestPagedBytes

   [junit4] Completed [263/438] on J1 in 8.39s, 4 tests, 1 skipped

   [junit4] 

   [junit4] Suite: org.apache.lucene.search.spans.TestFieldMaskingSpanQuery

   [junit4] IGNOR/A 0.00s J1 | TestFieldMaskingSpanQuery.testSimple2

   [junit4]    > Assumption #1: Broken scoring: LUCENE-3723

   [junit4] IGNOR/A 0.00s J1 | TestFieldMaskingSpanQuery.testSpans2

   [junit4]    > Assumption #1: Broken scoring: LUCENE-3723

   [junit4] Completed [264/438] on J1 in 0.16s, 11 tests, 2 skipped

   [junit4] 

   [junit4] Suite: org.apache.lucene.index.TestStressIndexing2

   [junit4] Completed [265/438] on J1 in 0.36s, 3 tests

   [junit4] 

   [junit4] Suite: org.apache.lucene.search.TestMultiPhraseQuery

   [junit4] Completed [266/438] on J1 in 0.10s, 17 tests, 1 skipped

   [junit4] 

   [junit4] Suite: org.apache.lucene.index.TestDocsAndPositions

   [junit4] Completed [267/438] on J1 in 0.40s, 6 tests

   [junit4] 

   [junit4] Suite: org.apache.lucene.index.TestCodecs

   [junit4] Completed [268/438] on J1 in 0.31s, 3 tests

   [junit4] 

   [junit4] Suite: org.apache.lucene.index.TestOmitPositions

   [junit4] Completed [269/438] on J1 in 0.15s, 4 tests

   [junit4] 

   [junit4] Suite: org.apache.lucene.index.TestParallelLeafReader

   [junit4] Completed [270/438] on J1 in 0.10s, 9 tests

   [junit4] 

   [junit4] Suite: org.apache.lucene.index.TestStressNRT

   [junit4] Completed [271/438] on J1 in 2.58s, 1 test

   [junit4] 

   [junit4] Suite: org.apache.lucene.index.TestIndexInput

   [junit4] Completed [272/438] on J1 in 1.16s, 2 tests

   [junit4] 

   [junit4] Suite: org.apache.lucene.util.automaton.TestUTF32ToUTF8

   [junit4] Completed [273/438] on J2 in 11.55s, 6 tests

   [junit4] 

   [junit4] Suite: org.apache.lucene.search.TestSloppyPhraseQuery2

   [junit4] Completed [274/438] on J1 in 1.02s, 9 tests

   [junit4] 

   [junit4] Suite: org.apache.lucene.search.TestDisjunctionMaxQuery

   [junit4] Completed [275/438] on J2 in 0.30s, 11 tests

   [junit4] 

   [junit4] Suite: org.apache.lucene.index.TestForceMergeForever

   [junit4] Completed [276/438] on J1 in 0.38s, 1 test

   [junit4] 

   [junit4] Suite: org.apache.lucene.index.TestDocumentsWriterDeleteQueue

   [junit4] Completed [277/438] on J1 in 0.10s, 5 tests

   [junit4] 

   [junit4] Suite: org.apache.lucene.index.TestDocumentWriter

   [junit4] Completed [278/438] on J1 in 0.14s, 6 tests

   [junit4] 

   [junit4] Suite: org.apache.lucene.search.TestSameScoresWithThreads

   [junit4] Completed [279/438] on J2 in 0.68s, 1 test

   [junit4] 

   [junit4] Suite: org.apache.lucene.search.TestFuzzyQuery

   [junit4] Completed [280/438] on J2 in 0.09s, 10 tests

   [junit4] 

   [junit4] Suite: org.apache.lucene.index.TestDoc

   [junit4] Completed [281/438] on J2 in 0.11s, 1 test

   [junit4] 

   [junit4] Suite: org.apache.lucene.search.similarities.TestSimilarity2

   [junit4] Completed [282/438] on J2 in 0.13s, 8 tests

   [junit4] 

   [junit4] Suite: org.apache.lucene.search.TestSimpleExplanationsOfNonMatches

   [junit4] Completed [283/438] on J2 in 0.09s, 70 tests

   [junit4] 

   [junit4] Suite: org.apache.lucene.search.TestRegexpQuery

   [junit4] Completed [284/438] on J2 in 0.07s, 7 tests

   [junit4] 

   [junit4] Suite: org.apache.lucene.index.TestPerSegmentDeletes

   [junit4] Completed [285/438] on J2 in 0.03s, 1 test

   [junit4] 

   [junit4] Suite: org.apache.lucene.search.TestMultiValuedNumericRangeQuery

   [junit4] Completed [286/438] on J2 in 0.56s, 1 test

   [junit4] 

   [junit4] Suite: org.apache.lucene.index.TestIntBlockPool

   [junit4] Completed [287/438] on J2 in 0.59s, 2 tests

   [junit4] 

   [junit4] Suite: org.apache.lucene.index.TestSegmentTermEnum

   [junit4] Completed [288/438] on J2 in 0.03s, 2 tests

   [junit4] 

   [junit4] Suite: org.apache.lucene.index.TestUniqueTermCount

   [junit4] Completed [289/438] on J2 in 0.05s, 1 test

   [junit4] 

   [junit4] Suite: org.apache.lucene.search.TestBooleanQuery

   [junit4] Completed [290/438] on J2 in 0.26s, 22 tests

   [junit4] 

   [junit4] Suite: org.apache.lucene.index.TestTermsEnum

   [junit4] Completed [291/438] on J0 in 65.23s, 11 tests

   [junit4] 

   [junit4] Suite: org.apache.lucene.document.TestDocument

   [junit4] Completed [292/438] on J0 in 0.05s, 12 tests

   [junit4] 

   [junit4] Suite: org.apache.lucene.index.TestMaxTermFrequency

   [junit4] Completed [293/438] on J0 in 0.13s, 1 test

   [junit4] 

   [junit4] Suite: org.apache.lucene.search.TestTopFieldCollector

   [junit4] Completed [294/438] on J0 in 0.15s, 7 tests

   [junit4] 

   [junit4] Suite: org.apache.lucene.index.TestSumDocFreq

   [junit4] Completed [295/438] on J0 in 0.24s, 1 test

   [junit4] 

   [junit4] Suite: org.apache.lucene.search.TestAutomatonQuery

   [junit4] Completed [296/438] on J2 in 1.36s, 8 tests

   [junit4] 

   [junit4] Suite: org.apache.lucene.util.TestSentinelIntSet

   [junit4] Completed [297/438] on J2 in 0.09s, 2 tests

   [junit4] 

   [junit4] Suite: org.apache.lucene.index.TestIndexableField

   [junit4] Completed [298/438] on J0 in 0.39s, 2 tests

   [junit4] 

   [junit4] Suite: org.apache.lucene.store.TestDirectory

   [junit4] Completed [299/438] on J0 in 0.48s, 3 tests

   [junit4] 

   [junit4] Suite: org.apache.lucene.search.TestPrefixRandom

   [junit4] Completed [300/438] on J2 in 0.53s, 1 test

   [junit4] 

   [junit4] Suite: org.apache.lucene.search.TestRegexpRandom

   [junit4] Completed [301/438] on J0 in 0.13s, 1 test

   [junit4] 

   [junit4] Suite: org.apache.lucene.index.TestMultiLevelSkipList

   [junit4] Completed [302/438] on J2 in 0.09s, 1 test

   [junit4] 

   [junit4] Suite: org.apache.lucene.index.TestPayloadsOnVectors

   [junit4] Completed [303/438] on J2 in 0.03s, 3 tests

   [junit4] 

   [junit4] Suite: org.apache.lucene.search.TestBooleanQueryVisitSubscorers

   [junit4] Completed [304/438] on J2 in 0.05s, 5 tests

   [junit4] 

   [junit4] Suite: org.apache.lucene.TestSearchForDuplicates

   [junit4] Completed [305/438] on J2 in 0.14s, 1 test

   [junit4] 

   [junit4] Suite: org.apache.lucene.index.TestSizeBoundedForceMerge

   [junit4] Completed [306/438] on J2 in 0.07s, 11 tests

   [junit4] 

   [junit4] Suite: org.apache.lucene.index.TestCheckIndex

   [junit4] Completed [307/438] on J0 in 1.15s, 5 tests

   [junit4] 

   [junit4] Suite: org.apache.lucene.search.TestElevationComparator

   [junit4] Completed [308/438] on J0 in 0.03s, 1 test

   [junit4] 

   [junit4] Suite: org.apache.lucene.index.TestBinaryTerms

   [junit4] Completed [309/438] on J0 in 0.06s, 2 tests

   [junit4] 

   [junit4] Suite: org.apache.lucene.search.TestScorerPerf

   [junit4] Completed [310/438] on J1 in 8.52s, 1 test

   [junit4] 

   [junit4] Suite: org.apache.lucene.util.TestRecyclingIntBlockAllocator

   [junit4] Completed [311/438] on J0 in 0.19s, 3 tests

   [junit4] 

   [junit4] Suite: org.apache.lucene.search.TestConjunctions

   [junit4] Completed [312/438] on J1 in 0.03s, 1 test

   [junit4] 

   [junit4] Suite: org.apache.lucene.search.TestMultiTermQueryRewrites

   [junit4] Completed [313/438] on J0 in 0.03s, 3 tests

   [junit4] 

   [junit4] Suite: org.apache.lucene.search.TestPositionIncrement

   [junit4] Completed [314/438] on J1 in 0.03s, 2 tests

   [junit4] 

   [junit4] Suite: org.apache.lucene.analysis.TestNumericTokenStream

   [junit4] Completed [315/438] on J1 in 0.04s, 6 tests

   [junit4] 

   [junit4] Suite: org.apache.lucene.index.TestFilterLeafReader

   [junit4] Completed [316/438] on J1 in 0.03s, 3 tests

   [junit4] 

   [junit4] Suite: org.apache.lucene.util.TestRollingBuffer

   [junit4] Completed [317/438] on J0 in 0.66s, 1 test

   [junit4] 

   [junit4] Suite: org.apache.lucene.TestSearch

   [junit4] Completed [318/438] on J1 in 0.04s, 2 tests

   [junit4] 

   [junit4] Suite: org.apache.lucene.util.TestFilterIterator

   [junit4] Completed [319/438] on J0 in 0.02s, 8 tests

   [junit4] 

   [junit4] Suite: org.apache.lucene.util.TestCharsRef

   [junit4] Completed [320/438] on J1 in 0.04s, 5 tests

   [junit4] 

   [junit4] Suite: org.apache.lucene.index.Test2BPostings

   [junit4] IGNOR/A 0.00s J1 | Test2BPostings.test

   [junit4]    > Assumption #1: 'nightly' test group is disabled (@Nightly())

   [junit4] Completed [321/438] on J1 in 0.00s, 1 test, 1 skipped

   [junit4] 

   [junit4] Suite: org.apache.lucene.search.TestPrefixQuery

   [junit4] Completed [322/438] on J2 in 2.60s, 3 tests

   [junit4] 

   [junit4] Suite: org.apache.lucene.index.TestDocCount

   [junit4] Completed [323/438] on J1 in 0.12s, 1 test

   [junit4] 

   [junit4] Suite: org.apache.lucene.util.TestPriorityQueue

   [junit4] Completed [324/438] on J0 in 0.74s, 9 tests

   [junit4] 

   [junit4] Suite: org.apache.lucene.search.TestCachingCollector

   [junit4] Completed [325/438] on J2 in 0.03s, 4 tests

   [junit4] 

   [junit4] Suite: org.apache.lucene.util.TestRamUsageEstimator

   [junit4] IGNOR/A 0.00s J0 | TestRamUsageEstimator.testPrintValues

   [junit4]    > Assumption #1: Specify -Dtests.verbose=true to print constants of RamUsageEstimator.

   [junit4] IGNOR/A 0.00s J0 | TestRamUsageEstimator.testHotspotBean

   [junit4]    > Assumption #1: testHotspotBean only works on 64bit JVMs.

   [junit4] Completed [326/438] on J0 in 0.02s, 5 tests, 2 skipped

   [junit4] 

   [junit4] Suite: org.apache.lucene.search.spans.TestSpanFirstQuery

   [junit4] Completed [327/438] on J2 in 0.03s, 1 test

   [junit4] 

   [junit4] Suite: org.apache.lucene.index.TestNoMergeScheduler

   [junit4] Completed [328/438] on J0 in 0.01s, 3 tests

   [junit4] 

   [junit4] Suite: org.apache.lucene.util.TestNamedSPILoader

   [junit4] Completed [329/438] on J2 in 0.01s, 3 tests

   [junit4] 

   [junit4] Suite: org.apache.lucene.util.TestByteBlockPool

   [junit4] Completed [330/438] on J0 in 0.07s, 1 test

   [junit4] 

   [junit4] Suite: org.apache.lucene.util.TestBytesRef

   [junit4] Completed [331/438] on J2 in 0.01s, 3 tests

   [junit4] 

   [junit4] Suite: org.apache.lucene.analysis.TestCharFilter

   [junit4] Completed [332/438] on J0 in 0.01s, 4 tests

   [junit4] 

   [junit4] Suite: org.apache.lucene.index.TestRollback

   [junit4] Completed [333/438] on J2 in 0.02s, 1 test

   [junit4] 

   [junit4] Suite: org.apache.lucene.index.TestTwoPhaseCommitTool

   [junit4] Completed [334/438] on J0 in 0.02s, 3 tests

   [junit4] 

   [junit4] Suite: org.apache.lucene.util.TestCloseableThreadLocal

   [junit4] Completed [335/438] on J2 in 0.02s, 3 tests

   [junit4] 

   [junit4] Suite: org.apache.lucene.util.TestVersion

   [junit4] Completed [336/438] on J0 in 0.03s, 11 tests

   [junit4] 

   [junit4] Suite: org.apache.lucene.index.TestReaderClosed

   [junit4] Completed [337/438] on J2 in 0.03s, 2 tests

   [junit4] 

   [junit4] Suite: org.apache.lucene.search.TestDocBoost

   [junit4] Completed [338/438] on J0 in 0.02s, 1 test

   [junit4] 

   [junit4] Suite: org.apache.lucene.search.TestNGramPhraseQuery

   [junit4] Completed [339/438] on J2 in 0.01s, 1 test

   [junit4] 

   [junit4] Suite: org.apache.lucene.util.TestIntsRef

   [junit4] Completed [340/438] on J0 in 0.02s, 2 tests

   [junit4] 

   [junit4] Suite: org.apache.lucene.analysis.tokenattributes.TestSimpleAttributeImpl

   [junit4] Completed [341/438] on J2 in 0.01s, 1 test

   [junit4] 

   [junit4] Suite: org.apache.lucene.index.TestTermdocPerf

   [junit4] Completed [342/438] on J0 in 0.01s, 1 test

   [junit4] 

   [junit4] Suite: org.apache.lucene.index.Test2BPostingsBytes

   [junit4] IGNOR/A 0.00s J2 | Test2BPostingsBytes.test

   [junit4]    > Assumption #1: 'monster' test group is disabled (@Monster(value=takes ~20GB-30GB of space and 10 minutes))

   [junit4] Completed [343/438] on J2 in 0.00s, 1 test, 1 skipped

   [junit4] 

   [junit4] Suite: org.apache.lucene.search.TestPositiveScoresOnlyCollector

   [junit4] Completed [344/438] on J0 in 0.02s, 1 test

   [junit4] 

   [junit4] Suite: org.apache.lucene.index.TestNewestSegment

   [junit4] Completed [345/438] on J2 in 0.01s, 1 test

   [junit4] 

   [junit4] Suite: org.apache.lucene.store.TestByteArrayDataInput

   [junit4] Completed [346/438] on J0 in 0.01s, 1 test

   [junit4] 

   [junit4] Suite: org.apache.lucene.index.Test2BNumericDocValues

   [junit4] IGNOR/A 0.00s J2 | Test2BNumericDocValues.testNumerics

   [junit4]    > Assumption #1: 'monster' test group is disabled (@Monster(value=takes ~ 2 hours if the heap is 5gb))

   [junit4] Completed [347/438] on J2 in 0.00s, 1 test, 1 skipped

   [junit4] 

   [junit4] Suite: org.apache.lucene.analysis.TestCharArraySet

   [junit4] Completed [349/438] on J2 in 0.03s, 15 tests

   [junit4] 

   [junit4] Suite: org.apache.lucene.analysis.TestReusableStringReader

   [junit4] Completed [350/438] on J0 in 0.01s, 1 test

   [junit4] 

   [junit4] Suite: org.apache.lucene.analysis.tokenattributes.TestBytesRefAttImpl

   [junit4] Completed [351/438] on J2 in 0.01s, 1 test

   [junit4] 

   [junit4] Suite: org.apache.lucene.analysis.tokenattributes.TestPackedTokenAttributeImpl

   [junit4] Completed [352/438] on J0 in 0.02s, 4 tests

   [junit4] 

   [junit4] Suite: org.apache.lucene.codecs.TestCodecLoadingDeadlock

   [junit4] Completed [353/438] on J2 in 0.28s, 1 test

   [junit4] 

   [junit4] Suite: org.apache.lucene.search.TestBooleanScorer

   [junit4] Completed [354/438] on J1 in 5.41s, 5 tests

   [junit4] 

   [junit4] Suite: org.apache.lucene.codecs.lucene50.TestBlockPostingsFormat2

   [junit4] Completed [355/438] on J1 in 2.06s, 4 tests

   [junit4] 

   [junit4] Suite: org.apache.lucene.codecs.lucene50.TestBlockPostingsFormat3

   [junit4] Completed [356/438] on J1 in 0.80s, 1 test

   [junit4] 

   [junit4] Suite: org.apache.lucene.codecs.lucene50.TestForUtil

   [junit4] Completed [357/438] on J1 in 0.06s, 1 test

   [junit4] 

   [junit4] Suite: org.apache.lucene.codecs.lucene50.TestBlockPostingsFormat

   [junit4] Completed [358/438] on J2 in 5.59s, 26 tests

   [junit4] 

   [junit4] Suite: org.apache.lucene.codecs.lucene50.TestLucene50FieldInfoFormat

   [junit4] Completed [359/438] on J2 in 0.40s, 11 tests

   [junit4] 

   [junit4] Suite: org.apache.lucene.geo.TestGeoEncodingUtils

   [junit4] Completed [360/438] on J2 in 0.68s, 3 tests

   [junit4] 

   [junit4] Suite: org.apache.lucene.index.Test2BPoints

   [junit4] IGNOR/A 0.00s J2 | Test2BPoints.test2D

   [junit4]    > Assumption #1: 'monster' test group is disabled (@Monster(value=takes at least 4 hours and consumes many GB of temp disk space))

   [junit4] IGNOR/A 0.00s J2 | Test2BPoints.test1D

   [junit4]    > Assumption #1: 'monster' test group is disabled (@Monster(value=takes at least 4 hours and consumes many GB of temp disk space))

   [junit4] Completed [361/438] on J2 in 0.00s, 2 tests, 2 skipped

   [junit4] 

   [junit4] Suite: org.apache.lucene.index.Test2BSortedDocValuesFixedSorted

   [junit4] IGNOR/A 0.00s J2 | Test2BSortedDocValuesFixedSorted.testFixedSorted

   [junit4]    > Assumption #1: 'monster' test group is disabled (@Monster(value=Takes ~ 6 hours if the heap is 5gb))

   [junit4] Completed [362/438] on J2 in 0.00s, 1 test, 1 skipped

   [junit4] 

   [junit4] Suite: org.apache.lucene.index.Test2BSortedDocValuesOrds

   [junit4] IGNOR/A 0.00s J2 | Test2BSortedDocValuesOrds.test2BOrds

   [junit4]    > Assumption #1: 'monster' test group is disabled (@Monster(value=Takes ~ 6 hours if the heap is 5gb))

   [junit4] Completed [363/438] on J2 in 0.00s, 1 test, 1 skipped

   [junit4] 

   [junit4] Suite: org.apache.lucene.index.TestAllFilesCheckIndexHeader

   [junit4] Completed [364/438] on J2 in 0.36s, 1 test

   [junit4] 

   [junit4] Suite: org.apache.lucene.index.TestAllFilesDetectTruncation

   [junit4] Completed [365/438] on J2 in 0.33s, 1 test

   [junit4] 

   [junit4] Suite: org.apache.lucene.codecs.lucene50.TestLucene50CompoundFormat

   [junit4] Completed [366/438] on J1 in 4.51s, 26 tests

   [junit4] 

   [junit4] Suite: org.apache.lucene.index.TestDocInverterPerFieldErrorInfo

   [junit4] Completed [367/438] on J1 in 0.03s, 2 tests

   [junit4] 

   [junit4] Suite: org.apache.lucene.index.TestDuelingCodecsAtNight

   [junit4] IGNOR/A 0.00s J1 | TestDuelingCodecsAtNight.testEquals

   [junit4]    > Assumption #1: 'nightly' test group is disabled (@Nightly())

   [junit4] IGNOR/A 0.00s J1 | TestDuelingCodecsAtNight.testBigEquals

   [junit4]    > Assumption #1: 'nightly' test group is disabled (@Nightly())

   [junit4] IGNOR/A 0.00s J1 | TestDuelingCodecsAtNight.testCrazyReaderEquals

   [junit4]    > Assumption #1: 'nightly' test group is disabled (@Nightly())

   [junit4] Completed [368/438] on J1 in 0.00s, 3 tests, 3 skipped

   [junit4] 

   [junit4] Suite: org.apache.lucene.index.TestExitableDirectoryReader

   [junit4] Completed [369/438] on J1 in 0.43s, 1 test

   [junit4] 

   [junit4] Suite: org.apache.lucene.index.TestFieldReuse

   [junit4] Completed [370/438] on J1 in 0.03s, 3 tests

   [junit4] 

   [junit4] Suite: org.apache.lucene.index.TestFilterDirectoryReader

   [junit4] Completed [371/438] on J1 in 0.02s, 1 test

   [junit4] 

   [junit4] Suite: org.apache.lucene.index.TestIndexReaderClose

   [junit4] Completed [372/438] on J1 in 0.24s, 2 tests

   [junit4] 

   [junit4] Suite: org.apache.lucene.index.TestDemoParallelLeafReader

   [junit4] Completed [373/438] on J2 in 4.82s, 5 tests

   [junit4] 

   [junit4] Suite: org.apache.lucene.index.TestIndexWriterDeleteByQuery

   [junit4] Completed [374/438] on J2 in 0.02s, 1 test

   [junit4] 

   [junit4] Suite: org.apache.lucene.index.TestIndexWriterExceptions2

   [junit4] Completed [375/438] on J2 in 6.67s, 1 test

   [junit4] 

   [junit4] Suite: org.apache.lucene.index.TestIndexWriterFromReader

   [junit4] Completed [376/438] on J2 in 0.16s, 12 tests

   [junit4] 

   [junit4] Suite: org.apache.lucene.index.TestIndexWriterOnVMError

   [junit4] IGNOR/A 0.00s J2 | TestIndexWriterOnVMError.testCheckpoint

   [junit4]    > Assumption #1: 'nightly' test group is disabled (@Nightly())

   [junit4] Completed [377/438] on J2 in 0.30s, 3 tests, 1 skipped

   [junit4] 

   [junit4] Suite: org.apache.lucene.index.TestIndexWriterOutOfFileDescriptors

   [junit4] Completed [378/438] on J2 in 1.89s, 1 test

   [junit4] 

   [junit4] Suite: org.apache.lucene.index.TestIndexSorting

   [junit4] Completed [379/438] on J1 in 24.08s, 27 tests

   [junit4] 

   [junit4] Suite: org.apache.lucene.index.TestLogMergePolicy

   [junit4] Completed [380/438] on J1 in 0.03s, 2 tests

   [junit4] 

   [junit4] Suite: org.apache.lucene.index.TestMergeRateLimiter

   [junit4] Completed [381/438] on J1 in 0.02s, 1 test

   [junit4] 

   [junit4] Suite: org.apache.lucene.index.TestMixedDocValuesUpdates

   [junit4] IGNOR/A 0.00s J1 | TestMixedDocValuesUpdates.testTonsOfUpdates

   [junit4]    > Assumption #1: 'nightly' test group is disabled (@Nightly())

   [junit4] Completed [382/438] on J1 in 4.72s, 4 tests, 1 skipped

   [junit4] 

   [junit4] Suite: org.apache.lucene.index.TestMultiTermsEnum

   [junit4] Completed [383/438] on J1 in 0.03s, 1 test

   [junit4] 

   [junit4] Suite: org.apache.lucene.index.TestOrdinalMap

   [junit4] Completed [384/438] on J1 in 0.24s, 1 test

   [junit4] 

   [junit4] Suite: org.apache.lucene.index.TestReadOnlyIndex

   [junit4] Completed [385/438] on J1 in 0.11s, 1 test

   [junit4] 

   [junit4] Suite: org.apache.lucene.index.TestReaderWrapperDVTypeCheck

   [junit4] Completed [386/438] on J1 in 0.03s, 1 test

   [junit4] 

   [junit4] Suite: org.apache.lucene.index.TestSegmentInfos

   [junit4] Completed [387/438] on J1 in 0.01s, 3 tests

   [junit4] 

   [junit4] Suite: org.apache.lucene.index.TestSortedSetDocValues

   [junit4] Completed [388/438] on J1 in 0.02s, 1 test

   [junit4] 

   [junit4] Suite: org.apache.lucene.index.TestStressDeletes

   [junit4] Completed [389/438] on J1 in 0.66s, 1 test

   [junit4] 

   [junit4] Suite: org.apache.lucene.index.TestTermVectors

   [junit4] Completed [390/438] on J1 in 0.29s, 3 tests

   [junit4] 

   [junit4] Suite: org.apache.lucene.index.TestTragicIndexWriterDeadlock

   [junit4] Completed [391/438] on J1 in 0.02s, 1 test

   [junit4] 

   [junit4] Suite: org.apache.lucene.index.TestTryDelete

   [junit4] Completed [392/438] on J1 in 0.02s, 3 tests

   [junit4] 

   [junit4] Suite: org.apache.lucene.search.TestApproximationSearchEquivalence

   [junit4] Completed [393/438] on J1 in 0.58s, 10 tests

   [junit4] 

   [junit4] Suite: org.apache.lucene.search.TestBooleanCoord

   [junit4] Completed [394/438] on J1 in 0.09s, 76 tests

   [junit4] 

   [junit4] Suite: org.apache.lucene.search.TestBoostQuery

   [junit4] Completed [395/438] on J1 in 0.02s, 3 tests

   [junit4] 

   [junit4] Suite: org.apache.lucene.search.TestDocValuesRewriteMethod

   [junit4] Completed [396/438] on J1 in 2.27s, 2 tests

   [junit4] 

   [junit4] Suite: org.apache.lucene.search.TestEarlyTerminatingSortingCollector

   [junit4] Completed [397/438] on J1 in 13.70s, 4 tests

   [junit4] 

   [junit4] Suite: org.apache.lucene.search.TestEarlyTermination

   [junit4] Completed [398/438] on J1 in 0.07s, 1 test

   [junit4] 

   [junit4] Suite: org.apache.lucene.index.TestIndexingSequenceNumbers

   [junit4] Completed [399/438] on J2 in 38.51s, 8 tests

   [junit4] 

   [junit4] Suite: org.apache.lucene.search.TestMatchNoDocsQuery

   [junit4] Completed [400/438] on J2 in 0.02s, 3 tests

   [junit4] 

   [junit4] Suite: org.apache.lucene.search.TestMultiCollector

   [junit4] Completed [401/438] on J2 in 0.15s, 2 tests

   [junit4] 

   [junit4] Suite: org.apache.lucene.search.TestMultiPhraseEnum

   [junit4] Completed [402/438] on J2 in 0.02s, 2 tests

   [junit4] 

   [junit4] Suite: org.apache.lucene.search.TestNeedsScores

   [junit4] Completed [403/438] on J2 in 0.04s, 4 tests

   [junit4] 

   [junit4] Suite: org.apache.lucene.search.TestFieldValueQuery

   [junit4] Completed [404/438] on J1 in 3.05s, 6 tests

   [junit4] 

   [junit4] Suite: org.apache.lucene.search.TestQueryRescorer

   [junit4] Completed [405/438] on J1 in 0.31s, 6 tests

   [junit4] 

   [junit4] HEARTBEAT J0 PID(5425@localhost): 2016-07-31T21:07:02, stalled for 60.1s at: TestGrowableByteArrayDataOutput.testWriteLargeStrings

   [junit4] Suite: org.apache.lucene.search.TestPointQueries

   [junit4] IGNOR/A 0.00s J2 | TestPointQueries.testRandomBinaryBig

   [junit4]    > Assumption #1: 'nightly' test group is disabled (@Nightly())

   [junit4] IGNOR/A 0.00s J2 | TestPointQueries.testRandomLongsBig

   [junit4]    > Assumption #1: 'nightly' test group is disabled (@Nightly())

   [junit4] Completed [406/438] on J2 in 9.81s, 46 tests, 2 skipped

   [junit4] 

   [junit4] Suite: org.apache.lucene.search.TestSimpleExplanationsWithFillerDocs

   [junit4] IGNOR/A 0.01s J1 | TestSimpleExplanationsWithFillerDocs.testMA2

   [junit4]    > Assumption #1: got: <[test is not viable with empty filler docs, null]>, expected: each not null

   [junit4] IGNOR/A 0.00s J1 | TestSimpleExplanationsWithFillerDocs.testMA1

   [junit4]    > Assumption #1: got: <[test is not viable with empty filler docs, null]>, expected: each not null

   [junit4] Completed [407/438] on J1 in 7.29s, 70 tests, 2 skipped

   [junit4] 

   [junit4] Suite: org.apache.lucene.search.TestSortedNumericSortField

   [junit4] Completed [408/438] on J1 in 0.09s, 9 tests

   [junit4] 

   [junit4] Suite: org.apache.lucene.search.TestSortRescorer

   [junit4] Completed [409/438] on J2 in 0.47s, 2 tests

   [junit4] 

   [junit4] Suite: org.apache.lucene.search.spans.TestFilterSpans

   [junit4] Completed [410/438] on J1 in 0.01s, 1 test

   [junit4] 

   [junit4] Suite: org.apache.lucene.search.spans.TestSpanNearQuery

   [junit4] Completed [411/438] on J2 in 0.02s, 4 tests

   [junit4] 

   [junit4] Suite: org.apache.lucene.search.spans.TestSpanTermQuery

   [junit4] Completed [412/438] on J1 in 0.03s, 2 tests

   [junit4] 

   [junit4] Suite: org.apache.lucene.store.TestMmapDirectory

   [junit4] Completed [413/438] on J1 in 0.83s, 44 tests

   [junit4] 

   [junit4] Suite: org.apache.lucene.store.TestFilterDirectory

   [junit4] IGNOR/A 0.00s J2 | TestFilterDirectory.testPendingDeletions

   [junit4]    > Assumption #1: we can only install VirusCheckingFS on an FSDirectory

   [junit4] IGNOR/A 0.00s J2 | TestFilterDirectory.testFsyncDoesntCreateNewFiles

   [junit4]    > Assumption #1: test only works for FSDirectory subclasses

   [junit4] Completed [414/438] on J2 in 1.17s, 46 tests, 2 skipped

   [junit4] 

   [junit4] Suite: org.apache.lucene.store.TestNIOFSDirectory

   [junit4] Completed [415/438] on J1 in 0.82s, 44 tests

   [junit4] 

   [junit4] Suite: org.apache.lucene.store.TestRateLimiter

   [junit4] Completed [416/438] on J1 in 0.80s, 2 tests

   [junit4] 

   [junit4] Suite: org.apache.lucene.store.TestSimpleFSDirectory

   [junit4] C

[...truncated too long message...]

ttings.xml


resolve:


ivy-availability-check:


ivy-fail:


ivy-configure:

[ivy:configure] :: loading settings :: file = /home/jenkins/workspace/Lucene-Solr-6.x-Linux/lucene/top-level-ivy-settings.xml


resolve:


ivy-availability-check:


ivy-fail:


ivy-configure:

[ivy:configure] :: loading settings :: file = /home/jenkins/workspace/Lucene-Solr-6.x-Linux/lucene/top-level-ivy-settings.xml


resolve:


ivy-availability-check:


ivy-fail:


ivy-configure:

[ivy:configure] :: loading settings :: file = /home/jenkins/workspace/Lucene-Solr-6.x-Linux/lucene/top-level-ivy-settings.xml


resolve:


ivy-availability-check:


ivy-fail:


ivy-configure:

[ivy:configure] :: loading settings :: file = /home/jenkins/workspace/Lucene-Solr-6.x-Linux/lucene/top-level-ivy-settings.xml


resolve:


ivy-availability-check:


ivy-fail:


ivy-configure:

[ivy:configure] :: loading settings :: file = /home/jenkins/workspace/Lucene-Solr-6.x-Linux/lucene/top-level-ivy-settings.xml


resolve:


ivy-availability-check:


ivy-fail:


ivy-configure:

[ivy:configure] :: loading settings :: file = /home/jenkins/workspace/Lucene-Solr-6.x-Linux/lucene/top-level-ivy-settings.xml


resolve:


ivy-availability-check:


ivy-fail:


ivy-configure:

[ivy:configure] :: loading settings :: file = /home/jenkins/workspace/Lucene-Solr-6.x-Linux/lucene/top-level-ivy-settings.xml


resolve:


ivy-availability-check:


ivy-fail:


ivy-configure:

[ivy:configure] :: loading settings :: file = /home/jenkins/workspace/Lucene-Solr-6.x-Linux/lucene/top-level-ivy-settings.xml


resolve:


ivy-availability-check:


ivy-fail:


ivy-configure:

[ivy:configure] :: loading settings :: file = /home/jenkins/workspace/Lucene-Solr-6.x-Linux/lucene/top-level-ivy-settings.xml


resolve:


ivy-availability-check:


ivy-fail:


ivy-configure:

[ivy:configure] :: loading settings :: file = /home/jenkins/workspace/Lucene-Solr-6.x-Linux/lucene/top-level-ivy-settings.xml


resolve:


ivy-availability-check:


ivy-fail:


ivy-configure:

[ivy:configure] :: loading settings :: file = /home/jenkins/workspace/Lucene-Solr-6.x-Linux/lucene/top-level-ivy-settings.xml


resolve:


ivy-availability-check:


ivy-fail:


ivy-configure:

[ivy:configure] :: loading settings :: file = /home/jenkins/workspace/Lucene-Solr-6.x-Linux/lucene/top-level-ivy-settings.xml


resolve:


ivy-availability-check:


ivy-fail:


ivy-configure:

[ivy:configure] :: loading settings :: file = /home/jenkins/workspace/Lucene-Solr-6.x-Linux/lucene/top-level-ivy-settings.xml


resolve:


ivy-availability-check:


ivy-fail:


ivy-configure:

[ivy:configure] :: loading settings :: file = /home/jenkins/workspace/Lucene-Solr-6.x-Linux/lucene/top-level-ivy-settings.xml


common.resolve:


resolve:


ivy-availability-check:


ivy-fail:


ivy-configure:

[ivy:configure] :: loading settings :: file = /home/jenkins/workspace/Lucene-Solr-6.x-Linux/lucene/top-level-ivy-settings.xml


resolve:


ivy-availability-check:


ivy-fail:


ivy-configure:

[ivy:configure] :: loading settings :: file = /home/jenkins/workspace/Lucene-Solr-6.x-Linux/lucene/top-level-ivy-settings.xml


resolve:


ivy-availability-check:


ivy-fail:


ivy-configure:

[ivy:configure] :: loading settings :: file = /home/jenkins/workspace/Lucene-Solr-6.x-Linux/lucene/top-level-ivy-settings.xml


resolve:


ivy-availability-check:


ivy-fail:


ivy-configure:

[ivy:configure] :: loading settings :: file = /home/jenkins/workspace/Lucene-Solr-6.x-Linux/lucene/top-level-ivy-settings.xml


resolve:


ivy-availability-check:


ivy-fail:


ivy-configure:

[ivy:configure] :: loading settings :: file = /home/jenkins/workspace/Lucene-Solr-6.x-Linux/lucene/top-level-ivy-settings.xml


resolve:


jar-checksums:

    [mkdir] Created dir: /home/jenkins/workspace/Lucene-Solr-6.x-Linux/lucene/null1292463708

     [copy] Copying 34 files to /home/jenkins/workspace/Lucene-Solr-6.x-Linux/lucene/null1292463708

   [delete] Deleting directory /home/jenkins/workspace/Lucene-Solr-6.x-Linux/lucene/null1292463708


resolve-example:


ivy-availability-check:


ivy-fail:


ivy-configure:

[ivy:configure] :: loading settings :: file = /home/jenkins/workspace/Lucene-Solr-6.x-Linux/lucene/top-level-ivy-settings.xml


resolve:


resolve-server:


ivy-availability-check:


ivy-fail:


ivy-fail:


ivy-configure:

[ivy:configure] :: loading settings :: file = /home/jenkins/workspace/Lucene-Solr-6.x-Linux/lucene/top-level-ivy-settings.xml


resolve:


resolve:


ivy-availability-check:


ivy-fail:


ivy-fail:


ivy-configure:

[ivy:configure] :: loading settings :: file = /home/jenkins/workspace/Lucene-Solr-6.x-Linux/lucene/top-level-ivy-settings.xml


resolve:


ivy-availability-check:


ivy-fail:


ivy-fail:


ivy-configure:

[ivy:configure] :: loading settings :: file = /home/jenkins/workspace/Lucene-Solr-6.x-Linux/lucene/top-level-ivy-settings.xml


resolve:


ivy-availability-check:


ivy-fail:


ivy-configure:

[ivy:configure] :: loading settings :: file = /home/jenkins/workspace/Lucene-Solr-6.x-Linux/lucene/top-level-ivy-settings.xml


resolve:


ivy-availability-check:


ivy-fail:


ivy-fail:


ivy-configure:

[ivy:configure] :: loading settings :: file = /home/jenkins/workspace/Lucene-Solr-6.x-Linux/lucene/top-level-ivy-settings.xml


resolve:


ivy-availability-check:


ivy-fail:


ivy-fail:


ivy-configure:

[ivy:configure] :: loading settings :: file = /home/jenkins/workspace/Lucene-Solr-6.x-Linux/lucene/top-level-ivy-settings.xml


resolve:


ivy-availability-check:


ivy-fail:


ivy-fail:


ivy-configure:

[ivy:configure] :: loading settings :: file = /home/jenkins/workspace/Lucene-Solr-6.x-Linux/lucene/top-level-ivy-settings.xml


resolve:


ivy-availability-check:


ivy-fail:


ivy-fail:


ivy-configure:

[ivy:configure] :: loading settings :: file = /home/jenkins/workspace/Lucene-Solr-6.x-Linux/lucene/top-level-ivy-settings.xml


resolve:


ivy-availability-check:


ivy-fail:


ivy-fail:


ivy-configure:

[ivy:configure] :: loading settings :: file = /home/jenkins/workspace/Lucene-Solr-6.x-Linux/lucene/top-level-ivy-settings.xml


resolve:


ivy-availability-check:


ivy-fail:


ivy-fail:


ivy-configure:

[ivy:configure] :: loading settings :: file = /home/jenkins/workspace/Lucene-Solr-6.x-Linux/lucene/top-level-ivy-settings.xml


resolve:


ivy-availability-check:


ivy-fail:


ivy-fail:


ivy-configure:

[ivy:configure] :: loading settings :: file = /home/jenkins/workspace/Lucene-Solr-6.x-Linux/lucene/top-level-ivy-settings.xml


resolve:


ivy-availability-check:


ivy-fail:


ivy-fail:


ivy-configure:

[ivy:configure] :: loading settings :: file = /home/jenkins/workspace/Lucene-Solr-6.x-Linux/lucene/top-level-ivy-settings.xml


resolve:


ivy-availability-check:


ivy-fail:


ivy-fail:


ivy-configure:

[ivy:configure] :: loading settings :: file = /home/jenkins/workspace/Lucene-Solr-6.x-Linux/lucene/top-level-ivy-settings.xml


resolve:


ivy-availability-check:


ivy-fail:


ivy-fail:


ivy-configure:

[ivy:configure] :: loading settings :: file = /home/jenkins/workspace/Lucene-Solr-6.x-Linux/lucene/top-level-ivy-settings.xml


resolve:


ivy-availability-check:


ivy-fail:


ivy-fail:


ivy-configure:

[ivy:configure] :: loading settings :: file = /home/jenkins/workspace/Lucene-Solr-6.x-Linux/lucene/top-level-ivy-settings.xml


resolve:


ivy-availability-check:


ivy-fail:


ivy-fail:


ivy-configure:

[ivy:configure] :: loading settings :: file = /home/jenkins/workspace/Lucene-Solr-6.x-Linux/lucene/top-level-ivy-settings.xml


resolve:


jar-checksums:

    [mkdir] Created dir: /home/jenkins/workspace/Lucene-Solr-6.x-Linux/solr/null479526226

     [copy] Copying 259 files to /home/jenkins/workspace/Lucene-Solr-6.x-Linux/solr/null479526226

   [delete] Deleting directory /home/jenkins/workspace/Lucene-Solr-6.x-Linux/solr/null479526226


check-working-copy:

[ivy:cachepath] :: resolving dependencies :: org.eclipse.jgit#org.eclipse.jgit-caller;working

[ivy:cachepath] 	confs: [default]

[ivy:cachepath] 	found org.eclipse.jgit#org.eclipse.jgit;4.4.1.201607150455-r in public

[ivy:cachepath] 	found com.jcraft#jsch;0.1.53 in public

[ivy:cachepath] 	found com.googlecode.javaewah#JavaEWAH;0.7.9 in public

[ivy:cachepath] 	found org.apache.httpcomponents#httpclient;4.3.6 in public

[ivy:cachepath] 	found org.apache.httpcomponents#httpcore;4.3.3 in public

[ivy:cachepath] 	found commons-logging#commons-logging;1.1.3 in public

[ivy:cachepath] 	found commons-codec#commons-codec;1.6 in public

[ivy:cachepath] 	found org.slf4j#slf4j-api;1.7.2 in public

[ivy:cachepath] :: resolution report :: resolve 21ms :: artifacts dl 1ms

	---------------------------------------------------------------------

	|                  |            modules            ||   artifacts   |

	|       conf       | number| search|dwnlded|evicted|| number|dwnlded|

	---------------------------------------------------------------------

	|      default     |   8   |   0   |   0   |   0   ||   8   |   0   |

	---------------------------------------------------------------------

[wc-checker] Initializing working copy...

[wc-checker] SLF4J: Failed to load class "org.slf4j.impl.StaticLoggerBinder".

[wc-checker] SLF4J: Defaulting to no-operation (NOP) logger implementation

[wc-checker] SLF4J: See http://www.slf4j.org/codes.html#StaticLoggerBinder for further details.

[wc-checker] Checking working copy status...


-jenkins-base:


BUILD SUCCESSFUL

Total time: 89 minutes 1 second

Archiving artifacts

WARN: No artifacts found that match the file pattern "**/*.events,heapdumps/**,**/*_pid*.log". Configuration error?

WARN: no matches found within 10000

[WARNINGS] Parsing warnings in console log with parser Java Compiler (javac)

[WARNINGS] Computing warning deltas based on reference build #1329

Recording test results

Build step 'Publish JUnit test result report' changed build result to UNSTABLE

Email was triggered for: Unstable (Test Failures)

Sending email for trigger: Unstable (Test Failures)




[JENKINS] Lucene-Solr-6.x-Linux (64bit/jdk1.8.0_102) - Build # 1331 - Failure!

Posted by Policeman Jenkins Server <je...@thetaphi.de>.
Build: http://jenkins.thetaphi.de/job/Lucene-Solr-6.x-Linux/1331/
Java: 64bit/jdk1.8.0_102 -XX:-UseCompressedOops -XX:+UseG1GC

1 tests failed.
FAILED:  org.apache.solr.TestDistributedSearch.test

Error Message:
Expected to find shardAddress in the up shard info

Stack Trace:
java.lang.AssertionError: Expected to find shardAddress in the up shard info
	at __randomizedtesting.SeedInfo.seed([B4026D2BD96C3A26:3C5652F1779057DE]:0)
	at org.junit.Assert.fail(Assert.java:93)
	at org.junit.Assert.assertTrue(Assert.java:43)
	at org.apache.solr.TestDistributedSearch.comparePartialResponses(TestDistributedSearch.java:1162)
	at org.apache.solr.TestDistributedSearch.queryPartialResults(TestDistributedSearch.java:1103)
	at org.apache.solr.TestDistributedSearch.test(TestDistributedSearch.java:963)
	at sun.reflect.NativeMethodAccessorImpl.invoke0(Native Method)
	at sun.reflect.NativeMethodAccessorImpl.invoke(NativeMethodAccessorImpl.java:62)
	at sun.reflect.DelegatingMethodAccessorImpl.invoke(DelegatingMethodAccessorImpl.java:43)
	at java.lang.reflect.Method.invoke(Method.java:498)
	at com.carrotsearch.randomizedtesting.RandomizedRunner.invoke(RandomizedRunner.java:1764)
	at com.carrotsearch.randomizedtesting.RandomizedRunner$8.evaluate(RandomizedRunner.java:871)
	at com.carrotsearch.randomizedtesting.RandomizedRunner$9.evaluate(RandomizedRunner.java:907)
	at com.carrotsearch.randomizedtesting.RandomizedRunner$10.evaluate(RandomizedRunner.java:921)
	at org.apache.solr.BaseDistributedSearchTestCase$ShardsRepeatRule$ShardsRepeatStatement.callStatement(BaseDistributedSearchTestCase.java:1018)
	at org.apache.solr.BaseDistributedSearchTestCase$ShardsRepeatRule$ShardsStatement.evaluate(BaseDistributedSearchTestCase.java:967)
	at com.carrotsearch.randomizedtesting.rules.SystemPropertiesRestoreRule$1.evaluate(SystemPropertiesRestoreRule.java:57)
	at org.apache.lucene.util.TestRuleSetupTeardownChained$1.evaluate(TestRuleSetupTeardownChained.java:49)
	at org.apache.lucene.util.AbstractBeforeAfterRule$1.evaluate(AbstractBeforeAfterRule.java:45)
	at org.apache.lucene.util.TestRuleThreadAndTestName$1.evaluate(TestRuleThreadAndTestName.java:48)
	at org.apache.lucene.util.TestRuleIgnoreAfterMaxFailures$1.evaluate(TestRuleIgnoreAfterMaxFailures.java:64)
	at org.apache.lucene.util.TestRuleMarkFailure$1.evaluate(TestRuleMarkFailure.java:47)
	at com.carrotsearch.randomizedtesting.rules.StatementAdapter.evaluate(StatementAdapter.java:36)
	at com.carrotsearch.randomizedtesting.ThreadLeakControl$StatementRunner.run(ThreadLeakControl.java:367)
	at com.carrotsearch.randomizedtesting.ThreadLeakControl.forkTimeoutingTask(ThreadLeakControl.java:809)
	at com.carrotsearch.randomizedtesting.ThreadLeakControl$3.evaluate(ThreadLeakControl.java:460)
	at com.carrotsearch.randomizedtesting.RandomizedRunner.runSingleTest(RandomizedRunner.java:880)
	at com.carrotsearch.randomizedtesting.RandomizedRunner$5.evaluate(RandomizedRunner.java:781)
	at com.carrotsearch.randomizedtesting.RandomizedRunner$6.evaluate(RandomizedRunner.java:816)
	at com.carrotsearch.randomizedtesting.RandomizedRunner$7.evaluate(RandomizedRunner.java:827)
	at com.carrotsearch.randomizedtesting.rules.StatementAdapter.evaluate(StatementAdapter.java:36)
	at com.carrotsearch.randomizedtesting.rules.SystemPropertiesRestoreRule$1.evaluate(SystemPropertiesRestoreRule.java:57)
	at org.apache.lucene.util.AbstractBeforeAfterRule$1.evaluate(AbstractBeforeAfterRule.java:45)
	at com.carrotsearch.randomizedtesting.rules.StatementAdapter.evaluate(StatementAdapter.java:36)
	at org.apache.lucene.util.TestRuleStoreClassName$1.evaluate(TestRuleStoreClassName.java:41)
	at com.carrotsearch.randomizedtesting.rules.NoShadowingOrOverridesOnMethodsRule$1.evaluate(NoShadowingOrOverridesOnMethodsRule.java:40)
	at com.carrotsearch.randomizedtesting.rules.NoShadowingOrOverridesOnMethodsRule$1.evaluate(NoShadowingOrOverridesOnMethodsRule.java:40)
	at com.carrotsearch.randomizedtesting.rules.StatementAdapter.evaluate(StatementAdapter.java:36)
	at com.carrotsearch.randomizedtesting.rules.StatementAdapter.evaluate(StatementAdapter.java:36)
	at com.carrotsearch.randomizedtesting.rules.StatementAdapter.evaluate(StatementAdapter.java:36)
	at org.apache.lucene.util.TestRuleAssertionsRequired$1.evaluate(TestRuleAssertionsRequired.java:53)
	at org.apache.lucene.util.TestRuleMarkFailure$1.evaluate(TestRuleMarkFailure.java:47)
	at org.apache.lucene.util.TestRuleIgnoreAfterMaxFailures$1.evaluate(TestRuleIgnoreAfterMaxFailures.java:64)
	at org.apache.lucene.util.TestRuleIgnoreTestSuites$1.evaluate(TestRuleIgnoreTestSuites.java:54)
	at com.carrotsearch.randomizedtesting.rules.StatementAdapter.evaluate(StatementAdapter.java:36)
	at com.carrotsearch.randomizedtesting.ThreadLeakControl$StatementRunner.run(ThreadLeakControl.java:367)
	at java.lang.Thread.run(Thread.java:745)




Build Log:
Started by upstream project "Lucene-Solr-master-Linux" build number 17424

originally caused by:

 Started by upstream project "Lucene-Solr-6.x-Linux" build number 1330

 originally caused by:

  Started by upstream project "Lucene-Solr-master-Linux" build number 17423

  originally caused by:

   Started by upstream project "Lucene-Solr-6.x-Linux" build number 1329

   originally caused by:

    Started by upstream project "Lucene-Solr-master-Linux" build number 17422

    originally caused by:

     Started by upstream project "Lucene-Solr-6.x-Linux" build number 1328

     originally caused by:

      Started by upstream project "Lucene-Solr-master-Linux" build number 17421

      originally caused by:

       Started by upstream project "Lucene-Solr-6.x-Linux" build number 1327

       originally caused by:

        Started by upstream project "Lucene-Solr-master-Linux" build number 17420

        originally caused by:

         Started by upstream project "Lucene-Solr-6.x-Linux" build number 1326

         originally caused by:

          Started by upstream project "Lucene-Solr-master-Linux" build number 17419

          originally caused by:

           Started by upstream project "Lucene-Solr-6.x-Linux" build number 1325

           originally caused by:

            (deeply nested causes)

[EnvInject] - Loading node environment variables.

[EnvInject] - Preparing an environment for the build.

[EnvInject] - Keeping Jenkins system variables.

[EnvInject] - Keeping Jenkins build variables.

[EnvInject] - Evaluation the following Groovy script content: 

return evaluate(new java.io.File(JENKINS_HOME, "scripts/linux-random-java8.groovy"))


Using Java: 64bit/jdk1.8.0_102 -XX:-UseCompressedOops -XX:+UseG1GC

[EnvInject] - Injecting contributions.

Building on master in workspace /var/lib/jenkins/workspace/Lucene-Solr-6.x-Linux

Fetching changes from the remote Git repository

Cleaning workspace

Checking out Revision 0dc1cf5ddda83240ed05df86d414a1f7a0e8d44e (refs/remotes/origin/branch_6x)

No emails were triggered.

[description-setter] Description set: Java: 64bit/jdk1.8.0_102 -XX:-UseCompressedOops -XX:+UseG1GC

[Lucene-Solr-6.x-Linux] $ /var/lib/jenkins/tools/hudson.tasks.Ant_AntInstallation/ANT_1.8.2/bin/ant "-Dargs=-XX:-UseCompressedOops -XX:+UseG1GC" jenkins-hourly

Buildfile: /home/jenkins/workspace/Lucene-Solr-6.x-Linux/build.xml


jenkins-hourly:


-print-java-info:

[java-info] java version "1.8.0_102"

[java-info] Java(TM) SE Runtime Environment (1.8.0_102-b14, Oracle Corporation)

[java-info] Java HotSpot(TM) 64-Bit Server VM (25.102-b14, Oracle Corporation)

[java-info] Test args: [-XX:-UseCompressedOops -XX:+UseG1GC]


clean:


clean:


clean:


ivy-availability-check:


ivy-fail:


ivy-configure:

[ivy:configure] :: Apache Ivy 2.3.0 - 20130110142753 :: http://ant.apache.org/ivy/ ::

[ivy:configure] :: loading settings :: file = /home/jenkins/workspace/Lucene-Solr-6.x-Linux/lucene/top-level-ivy-settings.xml


resolve-groovy:

[ivy:cachepath] :: resolving dependencies :: org.codehaus.groovy#groovy-all-caller;working

[ivy:cachepath] 	confs: [default]

[ivy:cachepath] 	found org.codehaus.groovy#groovy-all;2.4.6 in public

[ivy:cachepath] :: resolution report :: resolve 130ms :: artifacts dl 2ms

	---------------------------------------------------------------------

	|                  |            modules            ||   artifacts   |

	|       conf       | number| search|dwnlded|evicted|| number|dwnlded|

	---------------------------------------------------------------------

	|      default     |   1   |   0   |   0   |   0   ||   1   |   0   |

	---------------------------------------------------------------------


-test-with-heapdumps-enabled:

     [echo] Java HotSpot(TM) 64-Bit Server VM: Enabling heap dumps on OutOfMemoryError to dir '/home/jenkins/workspace/Lucene-Solr-6.x-Linux/heapdumps'.

    [mkdir] Created dir: /home/jenkins/workspace/Lucene-Solr-6.x-Linux/heapdumps


ivy-availability-check:


ivy-fail:


ivy-configure:

[ivy:configure] :: loading settings :: file = /home/jenkins/workspace/Lucene-Solr-6.x-Linux/lucene/top-level-ivy-settings.xml


resolve-groovy:


test:


ivy-availability-check:


ivy-fail:


ivy-configure:

[ivy:configure] :: loading settings :: file = /home/jenkins/workspace/Lucene-Solr-6.x-Linux/lucene/top-level-ivy-settings.xml


-clover.load:


resolve-groovy:


-init-totals:


test-core:


-clover.disable:


ivy-availability-check:


ivy-fail:


ivy-configure:

[ivy:configure] :: loading settings :: file = /home/jenkins/workspace/Lucene-Solr-6.x-Linux/lucene/top-level-ivy-settings.xml


-clover.load:


-clover.classpath:


-clover.setup:


clover:


-check-git-state:


-git-cleanroot:


-copy-git-state:

     [copy] Copying 1 file to /home/jenkins/workspace/Lucene-Solr-6.x-Linux/lucene/build


git-autoclean:


resolve:


init:


compile-core:

    [mkdir] Created dir: /home/jenkins/workspace/Lucene-Solr-6.x-Linux/lucene/build/core/classes/java

    [javac] Compiling 782 source files to /home/jenkins/workspace/Lucene-Solr-6.x-Linux/lucene/build/core/classes/java

    [javac] Note: Some input files use or override a deprecated API.

    [javac] Note: Recompile with -Xlint:deprecation for details.

    [javac] Creating empty /home/jenkins/workspace/Lucene-Solr-6.x-Linux/lucene/build/core/classes/java/org/apache/lucene/document/package-info.class

    [javac] Creating empty /home/jenkins/workspace/Lucene-Solr-6.x-Linux/lucene/build/core/classes/java/org/apache/lucene/package-info.class

    [javac] Creating empty /home/jenkins/workspace/Lucene-Solr-6.x-Linux/lucene/build/core/classes/java/org/apache/lucene/util/bkd/package-info.class

    [javac] Creating empty /home/jenkins/workspace/Lucene-Solr-6.x-Linux/lucene/build/core/classes/java/org/apache/lucene/codecs/compressing/package-info.class

    [javac] Creating empty /home/jenkins/workspace/Lucene-Solr-6.x-Linux/lucene/build/core/classes/java/org/apache/lucene/codecs/lucene60/package-info.class

    [javac] Creating empty /home/jenkins/workspace/Lucene-Solr-6.x-Linux/lucene/build/core/classes/java/org/apache/lucene/codecs/package-info.class

    [javac] Creating empty /home/jenkins/workspace/Lucene-Solr-6.x-Linux/lucene/build/core/classes/java/org/apache/lucene/util/package-info.class

    [javac] Creating empty /home/jenkins/workspace/Lucene-Solr-6.x-Linux/lucene/build/core/classes/java/org/apache/lucene/index/package-info.class

    [javac] Creating empty /home/jenkins/workspace/Lucene-Solr-6.x-Linux/lucene/build/core/classes/java/org/apache/lucene/util/fst/package-info.class

    [javac] Creating empty /home/jenkins/workspace/Lucene-Solr-6.x-Linux/lucene/build/core/classes/java/org/apache/lucene/analysis/tokenattributes/package-info.class

    [javac] Creating empty /home/jenkins/workspace/Lucene-Solr-6.x-Linux/lucene/build/core/classes/java/org/apache/lucene/search/package-info.class

    [javac] Creating empty /home/jenkins/workspace/Lucene-Solr-6.x-Linux/lucene/build/core/classes/java/org/apache/lucene/codecs/lucene62/package-info.class

    [javac] Creating empty /home/jenkins/workspace/Lucene-Solr-6.x-Linux/lucene/build/core/classes/java/org/apache/lucene/util/packed/package-info.class

    [javac] Creating empty /home/jenkins/workspace/Lucene-Solr-6.x-Linux/lucene/build/core/classes/java/org/apache/lucene/util/mutable/package-info.class

    [javac] Creating empty /home/jenkins/workspace/Lucene-Solr-6.x-Linux/lucene/build/core/classes/java/org/apache/lucene/codecs/perfield/package-info.class

    [javac] Creating empty /home/jenkins/workspace/Lucene-Solr-6.x-Linux/lucene/build/core/classes/java/org/apache/lucene/analysis/package-info.class

    [javac] Creating empty /home/jenkins/workspace/Lucene-Solr-6.x-Linux/lucene/build/core/classes/java/org/apache/lucene/analysis/standard/package-info.class

    [javac] Creating empty /home/jenkins/workspace/Lucene-Solr-6.x-Linux/lucene/build/core/classes/java/org/apache/lucene/store/package-info.class

    [javac] Creating empty /home/jenkins/workspace/Lucene-Solr-6.x-Linux/lucene/build/core/classes/java/org/apache/lucene/codecs/blocktree/package-info.class

    [javac] Creating empty /home/jenkins/workspace/Lucene-Solr-6.x-Linux/lucene/build/core/classes/java/org/apache/lucene/search/spans/package-info.class

    [javac] Creating empty /home/jenkins/workspace/Lucene-Solr-6.x-Linux/lucene/build/core/classes/java/org/apache/lucene/codecs/lucene54/package-info.class

    [javac] Creating empty /home/jenkins/workspace/Lucene-Solr-6.x-Linux/lucene/build/core/classes/java/org/apache/lucene/search/similarities/package-info.class

    [javac] Creating empty /home/jenkins/workspace/Lucene-Solr-6.x-Linux/lucene/build/core/classes/java/org/apache/lucene/util/automaton/package-info.class

    [javac] Creating empty /home/jenkins/workspace/Lucene-Solr-6.x-Linux/lucene/build/core/classes/java/org/apache/lucene/codecs/lucene53/package-info.class

    [javac] Creating empty /home/jenkins/workspace/Lucene-Solr-6.x-Linux/lucene/build/core/classes/java/org/apache/lucene/codecs/lucene50/package-info.class

    [javac] Creating empty /home/jenkins/workspace/Lucene-Solr-6.x-Linux/lucene/build/core/classes/java/org/apache/lucene/geo/package-info.class

     [copy] Copying 3 files to /home/jenkins/workspace/Lucene-Solr-6.x-Linux/lucene/build/core/classes/java


compile-test-framework:


-check-git-state:


-git-cleanroot:


-copy-git-state:


git-autoclean:


ivy-availability-check:


ivy-fail:


ivy-configure:

[ivy:configure] :: loading settings :: file = /home/jenkins/workspace/Lucene-Solr-6.x-Linux/lucene/top-level-ivy-settings.xml


resolve:


init:


compile-lucene-core:


-check-git-state:


-git-cleanroot:


-copy-git-state:


git-autoclean:


ivy-availability-check:


ivy-fail:


ivy-configure:

[ivy:configure] :: loading settings :: file = /home/jenkins/workspace/Lucene-Solr-6.x-Linux/lucene/top-level-ivy-settings.xml


resolve:


init:


-clover.disable:


-clover.load:


-clover.classpath:


-clover.setup:


clover:


compile-core:


compile-codecs:


-check-git-state:


-git-cleanroot:


-copy-git-state:


git-autoclean:


ivy-availability-check:


ivy-fail:


ivy-configure:

[ivy:configure] :: loading settings :: file = /home/jenkins/workspace/Lucene-Solr-6.x-Linux/lucene/top-level-ivy-settings.xml


resolve:


common.init:


compile-lucene-core:


init:


-clover.disable:


-clover.load:


-clover.classpath:


-clover.setup:


clover:


compile-core:

    [mkdir] Created dir: /home/jenkins/workspace/Lucene-Solr-6.x-Linux/lucene/build/codecs/classes/java

    [javac] Compiling 66 source files to /home/jenkins/workspace/Lucene-Solr-6.x-Linux/lucene/build/codecs/classes/java

    [javac] Creating empty /home/jenkins/workspace/Lucene-Solr-6.x-Linux/lucene/build/codecs/classes/java/org/apache/lucene/codecs/bloom/package-info.class

    [javac] Creating empty /home/jenkins/workspace/Lucene-Solr-6.x-Linux/lucene/build/codecs/classes/java/org/apache/lucene/codecs/memory/package-info.class

    [javac] Creating empty /home/jenkins/workspace/Lucene-Solr-6.x-Linux/lucene/build/codecs/classes/java/org/apache/lucene/codecs/simpletext/package-info.class

    [javac] Creating empty /home/jenkins/workspace/Lucene-Solr-6.x-Linux/lucene/build/codecs/classes/java/org/apache/lucene/codecs/blockterms/package-info.class

    [javac] Creating empty /home/jenkins/workspace/Lucene-Solr-6.x-Linux/lucene/build/codecs/classes/java/org/apache/lucene/codecs/blocktreeords/package-info.class

     [copy] Copying 3 files to /home/jenkins/workspace/Lucene-Solr-6.x-Linux/lucene/build/codecs/classes/java


-clover.disable:


-clover.load:


-clover.classpath:


-clover.setup:


clover:


common.compile-core:

    [mkdir] Created dir: /home/jenkins/workspace/Lucene-Solr-6.x-Linux/lucene/build/test-framework/classes/java

    [javac] Compiling 185 source files to /home/jenkins/workspace/Lucene-Solr-6.x-Linux/lucene/build/test-framework/classes/java

    [javac] Note: Some input files use or override a deprecated API.

    [javac] Note: Recompile with -Xlint:deprecation for details.

    [javac] Creating empty /home/jenkins/workspace/Lucene-Solr-6.x-Linux/lucene/build/test-framework/classes/java/org/apache/lucene/codecs/asserting/package-info.class

    [javac] Creating empty /home/jenkins/workspace/Lucene-Solr-6.x-Linux/lucene/build/test-framework/classes/java/org/apache/lucene/codecs/ramonly/package-info.class

    [javac] Creating empty /home/jenkins/workspace/Lucene-Solr-6.x-Linux/lucene/build/test-framework/classes/java/org/apache/lucene/mockfile/package-info.class

    [javac] Creating empty /home/jenkins/workspace/Lucene-Solr-6.x-Linux/lucene/build/test-framework/classes/java/org/apache/lucene/codecs/cheapbastard/package-info.class

    [javac] Creating empty /home/jenkins/workspace/Lucene-Solr-6.x-Linux/lucene/build/test-framework/classes/java/org/apache/lucene/codecs/mockrandom/package-info.class

    [javac] Creating empty /home/jenkins/workspace/Lucene-Solr-6.x-Linux/lucene/build/test-framework/classes/java/org/apache/lucene/codecs/cranky/package-info.class

    [javac] Creating empty /home/jenkins/workspace/Lucene-Solr-6.x-Linux/lucene/build/test-framework/classes/java/org/apache/lucene/codecs/compressing/dummy/package-info.class

     [copy] Copying 4 files to /home/jenkins/workspace/Lucene-Solr-6.x-Linux/lucene/build/test-framework/classes/java


compile-core:


compile-test:

    [mkdir] Created dir: /home/jenkins/workspace/Lucene-Solr-6.x-Linux/lucene/build/core/classes/test

    [javac] Compiling 445 source files to /home/jenkins/workspace/Lucene-Solr-6.x-Linux/lucene/build/core/classes/test

    [javac] Note: Some input files use or override a deprecated API.

    [javac] Note: Recompile with -Xlint:deprecation for details.

     [copy] Copying 3 files to /home/jenkins/workspace/Lucene-Solr-6.x-Linux/lucene/build/core/classes/test


install-junit4-taskdef:


validate:


resolve-groovy:


-init-totals:


-test:

    [mkdir] Created dir: /home/jenkins/workspace/Lucene-Solr-6.x-Linux/lucene/build/core/test

[loadresource] Do not set property tests.explicitclass as its length is 0.

    [mkdir] Created dir: /home/jenkins/workspace/Lucene-Solr-6.x-Linux/lucene/build/core/test/temp

    [mkdir] Created dir: /home/jenkins/workspace/Lucene-Solr-6.x-Linux/.caches/test-stats/core

   [junit4] <JUnit4> says 你好! Master seed: D9423653254E09B0

   [junit4] Executing 438 suites with 3 JVMs.

   [junit4] 

   [junit4] Started J2 PID(23868@localhost).

   [junit4] Started J1 PID(23862@localhost).

   [junit4] Started J0 PID(23867@localhost).

   [junit4] Suite: org.apache.lucene.geo.TestPolygon

   [junit4] Completed [1/438] on J0 in 0.50s, 15 tests

   [junit4] 

   [junit4] Suite: org.apache.lucene.util.TestQueryBuilder

   [junit4] Completed [2/438] on J0 in 0.15s, 21 tests

   [junit4] 

   [junit4] Suite: org.apache.lucene.codecs.lucene50.TestBlockPostingsFormat2

   [junit4] Completed [3/438] on J0 in 3.83s, 4 tests

   [junit4] 

   [junit4] Suite: org.apache.lucene.analysis.tokenattributes.TestCharTermAttributeImpl

   [junit4] Completed [4/438] on J0 in 0.50s, 12 tests

   [junit4] 

   [junit4] Suite: org.apache.lucene.search.TestSearchAfter

   [junit4] Completed [5/438] on J0 in 1.40s, 1 test

   [junit4] 

   [junit4] Suite: org.apache.lucene.codecs.perfield.TestPerFieldPostingsFormat2

   [junit4] Completed [6/438] on J1 in 6.80s, 5 tests

   [junit4] 

   [junit4] Suite: org.apache.lucene.index.TestCustomNorms

   [junit4] Completed [7/438] on J0 in 0.81s, 1 test

   [junit4] 

   [junit4] Suite: org.apache.lucene.util.TestNotDocIdSet

   [junit4] Completed [8/438] on J0 in 1.11s, 6 tests

   [junit4] 

   [junit4] Suite: org.apache.lucene.util.TestSloppyMath

   [junit4] Completed [9/438] on J1 in 1.96s, 8 tests

   [junit4] 

   [junit4] Suite: org.apache.lucene.index.TestDirectoryReaderReopen

   [junit4] Completed [10/438] on J0 in 1.99s, 14 tests

   [junit4] 

   [junit4] Suite: org.apache.lucene.codecs.lucene50.TestBlockPostingsFormat3

   [junit4] Completed [11/438] on J1 in 2.33s, 1 test

   [junit4] 

   [junit4] Suite: org.apache.lucene.codecs.compressing.TestFastCompressionMode

   [junit4] Completed [12/438] on J1 in 1.67s, 11 tests

   [junit4] 

   [junit4] Suite: org.apache.lucene.util.TestArrayUtil

   [junit4] Completed [13/438] on J0 in 5.33s, 14 tests

   [junit4] 

   [junit4] Suite: org.apache.lucene.search.TestTermQuery

   [junit4] Completed [14/438] on J0 in 0.07s, 2 tests

   [junit4] 

   [junit4] Suite: org.apache.lucene.store.TestRAMDirectory

   [junit4] IGNOR/A 0.01s J0 | TestRAMDirectory.testFsyncDoesntCreateNewFiles

   [junit4]    > Assumption #1: test only works for FSDirectory subclasses

   [junit4] IGNOR/A 0.00s J0 | TestRAMDirectory.testPendingDeletions

   [junit4]    > Assumption #1: we can only install VirusCheckingFS on an FSDirectory

   [junit4] Completed [15/438] on J0 in 1.03s, 48 tests, 2 skipped

   [junit4] 

   [junit4] Suite: org.apache.lucene.index.TestCrashCausesCorruptIndex

   [junit4] Completed [16/438] on J0 in 0.12s, 1 test

   [junit4] 

   [junit4] Suite: org.apache.lucene.util.TestNamedSPILoader

   [junit4] Completed [17/438] on J0 in 0.03s, 3 tests

   [junit4] 

   [junit4] Suite: org.apache.lucene.store.TestMmapDirectory

   [junit4] Completed [18/438] on J0 in 1.03s, 44 tests

   [junit4] 

   [junit4] Suite: org.apache.lucene.util.TestIntroSorter

   [junit4] Completed [19/438] on J0 in 0.13s, 9 tests

   [junit4] 

   [junit4] Suite: org.apache.lucene.search.TestSearchWithThreads

   [junit4] Completed [20/438] on J1 in 6.41s, 1 test

   [junit4] 

   [junit4] Suite: org.apache.lucene.search.TestPrefixInBooleanQuery

   [junit4] Completed [21/438] on J0 in 0.86s, 4 tests

   [junit4] 

   [junit4] Suite: org.apache.lucene.index.TestIndexWriterOnVMError

   [junit4] IGNOR/A 0.00s J0 | TestIndexWriterOnVMError.testCheckpoint

   [junit4]    > Assumption #1: 'nightly' test group is disabled (@Nightly())

   [junit4] Completed [22/438] on J0 in 0.90s, 3 tests, 1 skipped

   [junit4] 

   [junit4] Suite: org.apache.lucene.index.TestAllFilesHaveChecksumFooter

   [junit4] Completed [23/438] on J1 in 0.86s, 1 test

   [junit4] 

   [junit4] Suite: org.apache.lucene.util.TestSetOnce

   [junit4] Completed [24/438] on J1 in 0.06s, 4 tests

   [junit4] 

   [junit4] Suite: org.apache.lucene.index.TestPersistentSnapshotDeletionPolicy

   [junit4] Completed [25/438] on J0 in 1.37s, 13 tests

   [junit4] 

   [junit4] Suite: org.apache.lucene.index.TestByteSlices

   [junit4] Completed [26/438] on J1 in 5.60s, 1 test

   [junit4] 

   [junit4] Suite: org.apache.lucene.util.TestFilterIterator

   [junit4] Completed [27/438] on J1 in 0.06s, 8 tests

   [junit4] 

   [junit4] Suite: org.apache.lucene.search.TestTopDocsCollector

   [junit4] Completed [28/438] on J1 in 0.11s, 8 tests

   [junit4] 

   [junit4] Suite: org.apache.lucene.util.TestAttributeSource

   [junit4] Completed [29/438] on J1 in 0.03s, 7 tests

   [junit4] 

   [junit4] Suite: org.apache.lucene.index.TestAddIndexes

   [junit4] Completed [30/438] on J1 in 3.37s, 25 tests

   [junit4] 

   [junit4] Suite: org.apache.lucene.util.TestRollingBuffer

   [junit4] Completed [31/438] on J1 in 0.79s, 1 test

   [junit4] 

   [junit4] Suite: org.apache.lucene.geo.TestGeoUtils

   [junit4] Completed [32/438] on J2 in 30.40s, 6 tests

   [junit4] 

   [junit4] Suite: org.apache.lucene.search.TestShardSearching

   [junit4] Completed [33/438] on J0 in 12.42s, 1 test

   [junit4] 

   [junit4] Suite: org.apache.lucene.index.TestNoDeletionPolicy

   [junit4] Completed [34/438] on J0 in 0.09s, 4 tests

   [junit4] 

   [junit4] Suite: org.apache.lucene.search.spans.TestSpanSearchEquivalence

   [junit4] Completed [35/438] on J0 in 4.01s, 33 tests

   [junit4] 

   [junit4] Suite: org.apache.lucene.store.TestSleepingLockWrapper

   [junit4] Completed [36/438] on J1 in 9.25s, 6 tests

   [junit4] 

   [junit4] Suite: org.apache.lucene.util.TestPagedBytes

   [junit4] Completed [37/438] on J1 in 5.82s, 4 tests, 1 skipped

   [junit4] 

   [junit4] Suite: org.apache.lucene.search.TestScoreCachingWrappingScorer

   [junit4] Completed [38/438] on J1 in 0.02s, 1 test

   [junit4] 

   [junit4] Suite: org.apache.lucene.index.TestIndexWriterFromReader

   [junit4] Completed [39/438] on J1 in 0.50s, 12 tests

   [junit4] 

   [junit4] Suite: org.apache.lucene.index.TestReadOnlyIndex

   [junit4] Completed [40/438] on J1 in 0.32s, 1 test

   [junit4] 

   [junit4] Suite: org.apache.lucene.util.TestOfflineSorter

   [junit4] IGNOR/A 0.02s J2 | TestOfflineSorter.testLargerRandom

   [junit4]    > Assumption #1: 'nightly' test group is disabled (@Nightly())

   [junit4] Completed [41/438] on J2 in 16.37s, 14 tests, 1 skipped

   [junit4] 

   [junit4] Suite: org.apache.lucene.search.TestSloppyPhraseQuery2

   [junit4] Completed [42/438] on J1 in 3.51s, 9 tests

   [junit4] 

   [junit4] Suite: org.apache.lucene.index.TestParallelTermEnum

   [junit4] Completed [43/438] on J1 in 0.06s, 1 test

   [junit4] 

   [junit4] Suite: org.apache.lucene.store.TestFileSwitchDirectory

   [junit4] IGNOR/A 0.01s J1 | TestFileSwitchDirectory.testFsyncDoesntCreateNewFiles

   [junit4]    > Assumption #1: test only works for FSDirectory subclasses

   [junit4] IGNOR/A 0.01s J1 | TestFileSwitchDirectory.testPendingDeletions

   [junit4]    > Assumption #1: we can only install VirusCheckingFS on an FSDirectory

   [junit4] Completed [44/438] on J1 in 1.48s, 45 tests, 2 skipped

   [junit4] 

   [junit4] Suite: org.apache.lucene.codecs.lucene50.TestBlockPostingsFormat

   [junit4] Completed [45/438] on J2 in 11.76s, 26 tests

   [junit4] 

   [junit4] Suite: org.apache.lucene.index.TestIndexWriterOutOfFileDescriptors

   [junit4] Completed [46/438] on J1 in 7.25s, 1 test

   [junit4] 

   [junit4] Suite: org.apache.lucene.analysis.TestWordlistLoader

   [junit4] Completed [47/438] on J2 in 0.05s, 3 tests

   [junit4] 

   [junit4] Suite: org.apache.lucene.search.TestMultiThreadTermVectors

   [junit4] Completed [48/438] on J2 in 2.44s, 1 test

   [junit4] 

   [junit4] Suite: org.apache.lucene.index.TestBagOfPostings

   [junit4] Completed [49/438] on J2 in 3.73s, 1 test

   [junit4] 

   [junit4] Suite: org.apache.lucene.util.TestMergedIterator

   [junit4] Completed [50/438] on J2 in 0.35s, 25 tests

   [junit4] 

   [junit4] Suite: org.apache.lucene.index.TestCodecHoldsOpenFiles

   [junit4] Completed [51/438] on J2 in 0.15s, 1 test

   [junit4] 

   [junit4] Suite: org.apache.lucene.store.TestNRTCachingDirectory

   [junit4] IGNOR/A 0.00s J2 | TestNRTCachingDirectory.testPendingDeletions

   [junit4]    > Assumption #1: we can only install VirusCheckingFS on an FSDirectory

   [junit4] IGNOR/A 0.00s J2 | TestNRTCachingDirectory.testFsyncDoesntCreateNewFiles

   [junit4]    > Assumption #1: test only works for FSDirectory subclasses

   [junit4] Completed [52/438] on J2 in 2.31s, 46 tests, 2 skipped

   [junit4] 

   [junit4] Suite: org.apache.lucene.search.TestReqExclBulkScorer

   [junit4] Completed [53/438] on J2 in 0.06s, 1 test

   [junit4] 

   [junit4] Suite: org.apache.lucene.store.TestBufferedIndexInput

   [junit4] Completed [54/438] on J2 in 0.47s, 4 tests

   [junit4] 

   [junit4] Suite: org.apache.lucene.index.TestIndexingSequenceNumbers

   [junit4] Completed [55/438] on J0 in 45.02s, 8 tests

   [junit4] 

   [junit4] Suite: org.apache.lucene.document.TestDateTools

   [junit4] Completed [56/438] on J0 in 0.09s, 5 tests

   [junit4] 

   [junit4] Suite: org.apache.lucene.search.TestBooleanScorer

   [junit4] Completed [57/438] on J0 in 3.17s, 5 tests

   [junit4] 

   [junit4] Suite: org.apache.lucene.index.TestPointValues

   [junit4] Completed [58/438] on J0 in 5.02s, 32 tests

   [junit4] 

   [junit4] Suite: org.apache.lucene.index.TestIsCurrent

   [junit4] Completed [59/438] on J0 in 0.02s, 2 tests

   [junit4] 

   [junit4] Suite: org.apache.lucene.index.TestStressNRT

   [junit4] Completed [60/438] on J0 in 2.25s, 1 test

   [junit4] 

   [junit4] Suite: org.apache.lucene.codecs.perfield.TestPerFieldDocValuesFormat

   [junit4] Completed [61/438] on J1 in 38.80s, 96 tests

   [junit4] 

   [junit4] Suite: org.apache.lucene.search.TestBooleanQuery

   [junit4] Completed [62/438] on J1 in 0.42s, 22 tests

   [junit4] 

   [junit4] Suite: org.apache.lucene.index.TestSameTokenSamePosition

   [junit4] Completed [63/438] on J1 in 0.10s, 2 tests

   [junit4] 

   [junit4] Suite: org.apache.lucene.index.TestInfoStream

   [junit4] Completed [64/438] on J1 in 0.02s, 2 tests

   [junit4] 

   [junit4] Suite: org.apache.lucene.index.TestTermdocPerf

   [junit4] Completed [65/438] on J1 in 0.02s, 1 test

   [junit4] 

   [junit4] Suite: org.apache.lucene.analysis.TestStopFilter

   [junit4] Completed [66/438] on J1 in 0.05s, 4 tests

   [junit4] 

   [junit4] Suite: org.apache.lucene.util.TestCharsRef

   [junit4] Completed [67/438] on J1 in 0.05s, 5 tests

   [junit4] 

   [junit4] Suite: org.apache.lucene.index.TestPostingsOffsets

   [junit4] Completed [68/438] on J1 in 1.99s, 13 tests

   [junit4] 

   [junit4] Suite: org.apache.lucene.search.TestUsageTrackingFilterCachingPolicy

   [junit4] Completed [69/438] on J1 in 0.05s, 2 tests

   [junit4] 

   [junit4] Suite: org.apache.lucene.store.TestSimpleFSDirectory

   [junit4] Completed [70/438] on J1 in 1.68s, 44 tests

   [junit4] 

   [junit4] Suite: org.apache.lucene.index.TestTermVectors

   [junit4] Completed [71/438] on J1 in 0.51s, 3 tests

   [junit4] 

   [junit4] Suite: org.apache.lucene.util.bkd.Test2BBKDPoints

   [junit4] IGNOR/A 0.00s J1 | Test2BBKDPoints.test2D

   [junit4]    > Assumption #1: 'monster' test group is disabled (@Monster(value=takes at least 4 hours and consumes many GB of temp disk space))

   [junit4] IGNOR/A 0.00s J1 | Test2BBKDPoints.test1D

   [junit4]    > Assumption #1: 'monster' test group is disabled (@Monster(value=takes at least 4 hours and consumes many GB of temp disk space))

   [junit4] Completed [72/438] on J1 in 0.03s, 2 tests, 2 skipped

   [junit4] 

   [junit4] Suite: org.apache.lucene.util.TestLSBRadixSorter

   [junit4] Completed [73/438] on J1 in 0.16s, 6 tests

   [junit4] 

   [junit4] Suite: org.apache.lucene.index.TestDocIDMerger

   [junit4] Completed [74/438] on J1 in 0.03s, 2 tests

   [junit4] 

   [junit4] Suite: org.apache.lucene.document.TestBinaryDocument

   [junit4] Completed [75/438] on J1 in 0.03s, 2 tests

   [junit4] 

   [junit4] Suite: org.apache.lucene.index.TestBagOfPositions

   [junit4] Completed [76/438] on J2 in 38.39s, 1 test

   [junit4] 

   [junit4] Suite: org.apache.lucene.util.TestLongBitSet

   [junit4] IGNOR/A 0.00s J2 | TestLongBitSet.testHugeCapacity

   [junit4]    > Assumption #1: 'nightly' test group is disabled (@Nightly())

   [junit4] Completed [77/438] on J2 in 0.38s, 9 tests, 1 skipped

   [junit4] 

   [junit4] Suite: org.apache.lucene.search.spans.TestSpanTermQuery

   [junit4] Completed [78/438] on J2 in 0.04s, 2 tests

   [junit4] 

   [junit4] Suite: org.apache.lucene.analysis.standard.TestStandardAnalyzer

   [junit4] Completed [79/438] on J0 in 13.61s, 34 tests

   [junit4] 

   [junit4] Suite: org.apache.lucene.util.TestIOUtils

   [junit4] Completed [80/438] on J2 in 0.18s, 18 tests

   [junit4] 

   [junit4] Suite: org.apache.lucene.util.automaton.TestAutomaton

   [junit4] Completed [81/438] on J1 in 5.39s, 56 tests

   [junit4] 

   [junit4] Suite: org.apache.lucene.search.spans.TestFilterSpans

   [junit4] Completed [82/438] on J1 in 0.05s, 1 test

   [junit4] 

   [junit4] Suite: org.apache.lucene.store.TestSingleInstanceLockFactory

   [junit4] Completed [83/438] on J0 in 1.22s, 7 tests

   [junit4] 

   [junit4] Suite: org.apache.lucene.index.TestParallelCompositeReader

   [junit4] Completed [84/438] on J0 in 0.34s, 15 tests

   [junit4] 

   [junit4] Suite: org.apache.lucene.search.TestTermScorer

   [junit4] Completed [85/438] on J0 in 0.10s, 4 tests

   [junit4] 

   [junit4] Suite: org.apache.lucene.store.TestHugeRamFile

   [junit4] Completed [86/438] on J0 in 2.62s, 1 test

   [junit4] 

   [junit4] Suite: org.apache.lucene.index.TestSizeBoundedForceMerge

   [junit4] Completed [87/438] on J0 in 0.11s, 11 tests

   [junit4] 

   [junit4] Suite: org.apache.lucene.search.TestLRUQueryCache

   [junit4] Completed [88/438] on J2 in 7.90s, 18 tests

   [junit4] 

   [junit4] Suite: org.apache.lucene.index.TestForceMergeForever

   [junit4] Completed [89/438] on J2 in 0.67s, 1 test

   [junit4] 

   [junit4] Suite: org.apache.lucene.index.TestMaxTermFrequency

   [junit4] Completed [90/438] on J2 in 0.26s, 1 test

   [junit4] 

   [junit4] Suite: org.apache.lucene.search.TestNeedsScores

   [junit4] Completed [91/438] on J2 in 0.12s, 4 tests

   [junit4] 

   [junit4] Suite: org.apache.lucene.index.TestLazyProxSkipping

   [junit4] Completed [92/438] on J2 in 0.41s, 2 tests

   [junit4] 

   [junit4] Suite: org.apache.lucene.search.similarities.TestBM25Similarity

   [junit4] Completed [93/438] on J2 in 0.02s, 3 tests

   [junit4] 

   [junit4] Suite: org.apache.lucene.util.automaton.TestMinimize

   [junit4] Completed [94/438] on J0 in 5.25s, 3 tests

   [junit4] 

   [junit4] Suite: org.apache.lucene.util.TestCloseableThreadLocal

   [junit4] Completed [95/438] on J0 in 0.09s, 3 tests

   [junit4] 

   [junit4] Suite: org.apache.lucene.index.TestDocValues

   [junit4] Completed [96/438] on J0 in 0.13s, 7 tests

   [junit4] 

   [junit4] Suite: org.apache.lucene.index.Test2BPositions

   [junit4] IGNOR/A 0.00s J0 | Test2BPositions.test

   [junit4]    > Assumption #1: 'monster' test group is disabled (@Monster(value=uses lots of space and takes a few minutes))

   [junit4] Completed [97/438] on J0 in 0.01s, 1 test, 1 skipped

   [junit4] 

   [junit4] Suite: org.apache.lucene.util.TestTimSorter

   [junit4] Completed [98/438] on J0 in 0.12s, 9 tests

   [junit4] 

   [junit4] Suite: org.apache.lucene.search.similarities.TestSimilarity2

   [junit4] Completed [99/438] on J0 in 0.14s, 8 tests

   [junit4] 

   [junit4] Suite: org.apache.lucene.analysis.tokenattributes.TestSimpleAttributeImpl

   [junit4] Completed [100/438] on J0 in 0.01s, 1 test

   [junit4] 

   [junit4] Suite: org.apache.lucene.util.automaton.TestRegExp

   [junit4] Completed [101/438] on J0 in 0.10s, 5 tests

   [junit4] 

   [junit4] Suite: org.apache.lucene.search.spans.TestSpanExplanationsOfNonMatches

   [junit4] Completed [102/438] on J0 in 0.07s, 30 tests

   [junit4] 

   [junit4] Suite: org.apache.lucene.index.TestSegmentInfos

   [junit4] Completed [103/438] on J0 in 0.01s, 3 tests

   [junit4] 

   [junit4] Suite: org.apache.lucene.index.TestIndexInput

   [junit4] Completed [104/438] on J2 in 1.10s, 2 tests

   [junit4] 

   [junit4] Suite: org.apache.lucene.search.TestTopFieldCollector

   [junit4] Completed [105/438] on J0 in 0.23s, 7 tests

   [junit4] 

   [junit4] Suite: org.apache.lucene.search.spans.TestSpansEnum

   [junit4] Completed [106/438] on J0 in 0.08s, 7 tests

   [junit4] 

   [junit4] Suite: org.apache.lucene.util.TestSentinelIntSet

   [junit4] Completed [107/438] on J0 in 0.17s, 2 tests

   [junit4] 

   [junit4] Suite: org.apache.lucene.codecs.lucene62.TestLucene62SegmentInfoFormat

   [junit4] Completed [108/438] on J2 in 0.64s, 16 tests

   [junit4] 

   [junit4] Suite: org.apache.lucene.search.TestDisjunctionMaxQuery

   [junit4] Completed [109/438] on J0 in 0.46s, 11 tests

   [junit4] 

   [junit4] Suite: org.apache.lucene.index.TestMergeRateLimiter

   [junit4] Completed [110/438] on J0 in 0.05s, 1 test

   [junit4] 

   [junit4] Suite: org.apache.lucene.index.TestNRTReaderCleanup

   [junit4] Completed [111/438] on J0 in 0.05s, 1 test

   [junit4] 

   [junit4] Suite: org.apache.lucene.search.TestNGramPhraseQuery

   [junit4] Completed [112/438] on J0 in 0.04s, 1 test

   [junit4] 

   [junit4] Suite: org.apache.lucene.index.TestTermVectorsReader

   [junit4] Completed [113/438] on J0 in 0.21s, 13 tests

   [junit4] 

   [junit4] Suite: org.apache.lucene.search.TestMultiPhraseEnum

   [junit4] Completed [114/438] on J0 in 0.05s, 2 tests

   [junit4] 

   [junit4] Suite: org.apache.lucene.index.TestSwappedIndexFiles

   [junit4] Completed [115/438] on J0 in 0.11s, 1 test

   [junit4] 

   [junit4] Suite: org.apache.lucene.index.TestStressIndexing2

   [junit4] Completed [116/438] on J2 in 1.33s, 3 tests

   [junit4] 

   [junit4] Suite: org.apache.lucene.index.TestMergePolicyWrapper

   [junit4] Completed [117/438] on J2 in 0.05s, 1 test

   [junit4] 

   [junit4] Suite: org.apache.lucene.search.TestPhraseQuery

   [junit4] Completed [118/438] on J0 in 1.84s, 21 tests

   [junit4] 

   [junit4] Suite: org.apache.lucene.util.Test2BPagedBytes

   [junit4] IGNOR/A 0.00s J0 | Test2BPagedBytes.test

   [junit4]    > Assumption #1: 'monster' test group is disabled (@Monster(value=You must increase heap to > 2 G to run this))

   [junit4] Completed [119/438] on J0 in 0.00s, 1 test, 1 skipped

   [junit4] 

   [junit4] Suite: org.apache.lucene.util.TestBytesRefArray

   [junit4] Completed [120/438] on J0 in 0.29s, 2 tests

   [junit4] 

   [junit4] Suite: org.apache.lucene.index.TestIndexWriterForceMerge

   [junit4] Completed [121/438] on J2 in 1.60s, 4 tests

   [junit4] 

   [junit4] Suite: org.apache.lucene.index.TestOrdinalMap

   [junit4] Completed [122/438] on J2 in 0.15s, 1 test

   [junit4] 

   [junit4] Suite: org.apache.lucene.analysis.TestCharArrayMap

   [junit4] Completed [123/438] on J0 in 0.21s, 4 tests

   [junit4] 

   [junit4] Suite: org.apache.lucene.analysis.TestCharacterUtils

   [junit4] Completed [124/438] on J2 in 0.02s, 4 tests

   [junit4] 

   [junit4] Suite: org.apache.lucene.store.TestFilterDirectory

   [junit4] IGNOR/A 0.00s J2 | TestFilterDirectory.testPendingDeletions

   [junit4]    > Assumption #1: we can only install VirusCheckingFS on an FSDirectory

   [junit4] IGNOR/A 0.00s J2 | TestFilterDirectory.testFsyncDoesntCreateNewFiles

   [junit4]    > Assumption #1: test only works for FSDirectory subclasses

   [junit4] Completed [125/438] on J2 in 0.87s, 46 tests, 2 skipped

   [junit4] 

   [junit4] Suite: org.apache.lucene.index.TestIndexWriterExceptions2

   [junit4] Completed [126/438] on J0 in 5.29s, 1 test

   [junit4] 

   [junit4] Suite: org.apache.lucene.index.TestLongPostings

   [junit4] Completed [127/438] on J2 in 5.03s, 2 tests

   [junit4] 

   [junit4] Suite: org.apache.lucene.search.TestSimilarityProvider

   [junit4] Completed [128/438] on J2 in 0.02s, 1 test

   [junit4] 

   [junit4] Suite: org.apache.lucene.search.spans.TestSpanNearQuery

   [junit4] Completed [129/438] on J2 in 0.04s, 4 tests

   [junit4] 

   [junit4] Suite: org.apache.lucene.index.TestOmitPositions

   [junit4] Completed [130/438] on J2 in 0.34s, 4 tests

   [junit4] 

   [junit4] Suite: org.apache.lucene.util.automaton.TestOperations

   [junit4] Completed [131/438] on J2 in 0.93s, 5 tests

   [junit4] 

   [junit4] Suite: org.apache.lucene.util.packed.TestDirectMonotonic

   [junit4] Completed [132/438] on J0 in 2.58s, 4 tests

   [junit4] 

   [junit4] Suite: org.apache.lucene.util.TestInPlaceMergeSorter

   [junit4] Completed [133/438] on J0 in 0.05s, 9 tests

   [junit4] 

   [junit4] Suite: org.apache.lucene.util.TestSPIClassIterator

   [junit4] Completed [134/438] on J0 in 0.01s, 1 test

   [junit4] 

   [junit4] Suite: org.apache.lucene.util.TestMSBRadixSorter

   [junit4] Completed [135/438] on J0 in 4.22s, 7 tests

   [junit4] 

   [junit4] Suite: org.apache.lucene.search.FuzzyTermOnShortTermsTest

   [junit4] Completed [136/438] on J0 in 0.06s, 1 test

   [junit4] 

   [junit4] Suite: org.apache.lucene.document.TestFieldType

   [junit4] Completed [137/438] on J0 in 0.02s, 3 tests

   [junit4] 

   [junit4] Suite: org.apache.lucene.search.TestDateSort

   [junit4] Completed [138/438] on J0 in 0.02s, 1 test

   [junit4] 

   [junit4] Suite: org.apache.lucene.util.TestCollectionUtil

   [junit4] Completed [139/438] on J2 in 9.65s, 4 tests

   [junit4] 

   [junit4] Suite: org.apache.lucene.index.TestIndexWriterDelete

   [junit4] IGNOR/A 0.00s J0 | TestIndexWriterDelete.testApplyDeletesOnFlush

   [junit4]    > Assumption #1: 'nightly' test group is disabled (@Nightly())

   [junit4] Completed [140/438] on J0 in 6.58s, 27 tests, 1 skipped

   [junit4] 

   [junit4] Suite: org.apache.lucene.index.Test2BSortedDocValuesFixedSorted

   [junit4] IGNOR/A 0.00s J0 | Test2BSortedDocValuesFixedSorted.testFixedSorted

   [junit4]    > Assumption #1: 'monster' test group is disabled (@Monster(value=Takes ~ 6 hours if the heap is 5gb))

   [junit4] Completed [141/438] on J0 in 0.00s, 1 test, 1 skipped

   [junit4] 

   [junit4] Suite: org.apache.lucene.index.TestOmitNorms

   [junit4] Completed [142/438] on J0 in 0.81s, 5 tests

   [junit4] 

   [junit4] Suite: org.apache.lucene.index.TestCrash

   [junit4] Completed [143/438] on J0 in 0.29s, 5 tests

   [junit4] 

   [junit4] Suite: org.apache.lucene.index.TestConcurrentMergeScheduler

   [junit4] Completed [144/438] on J2 in 3.71s, 16 tests

   [junit4] 

   [junit4] Suite: org.apache.lucene.index.Test2BBinaryDocValues

   [junit4] IGNOR/A 0.00s J2 | Test2BBinaryDocValues.testVariableBinary

   [junit4]    > Assumption #1: 'monster' test group is disabled (@Monster(value=takes ~ 6 hours if the heap is 5gb))

   [junit4] IGNOR/A 0.00s J2 | Test2BBinaryDocValues.testFixedBinary

   [junit4]    > Assumption #1: 'monster' test group is disabled (@Monster(value=takes ~ 6 hours if the heap is 5gb))

   [junit4] Completed [145/438] on J2 in 0.00s, 2 tests, 2 skipped

   [junit4] 

   [junit4] Suite: org.apache.lucene.store.TestRateLimiter

   [junit4] Completed [146/438] on J0 in 0.91s, 2 tests

   [junit4] 

   [junit4] Suite: org.apache.lucene.index.TestDocCount

   [junit4] Completed [147/438] on J0 in 0.07s, 1 test

   [junit4] 

   [junit4] Suite: org.apache.lucene.search.spans.TestSpanMultiTermQueryWrapper

   [junit4] Completed [148/438] on J0 in 0.11s, 9 tests

   [junit4] 

   [junit4] Suite: org.apache.lucene.util.TestUnicodeUtil

   [junit4] Completed [149/438] on J2 in 0.76s, 5 tests

   [junit4] 

   [junit4] Suite: org.apache.lucene.search.TestSortedNumericSortField

   [junit4] Completed [150/438] on J2 in 0.08s, 9 tests

   [junit4] 

   [junit4] Suite: org.apache.lucene.index.TestIntBlockPool

   [junit4] Completed [151/438] on J0 in 0.58s, 2 tests

   [junit4] 

   [junit4] Suite: org.apache.lucene.codecs.TestCodecLoadingDeadlock

   [junit4] Completed [152/438] on J2 in 0.30s, 1 test

   [junit4] 

   [junit4] Suite: org.apache.lucene.index.TestIndexWriter

   [junit4] Completed [153/438] on J0 in 6.50s, 71 tests

   [junit4] 

   [junit4] Suite: org.apache.lucene.util.bkd.TestBKD

   [junit4] IGNOR/A 0.00s J2 | TestBKD.testRandomBinaryBig

   [junit4]    > Assumption #1: 'nightly' test group is disabled (@Nightly())

   [junit4] Completed [154/438] on J2 in 6.37s, 16 tests, 1 skipped

   [junit4] 

   [junit4] Suite: org.apache.lucene.search.TestTimeLimitingCollector

   [junit4] Completed [155/438] on J2 in 2.46s, 7 tests

   [junit4] 

   [junit4] Suite: org.apache.lucene.index.TestNoMergeScheduler

   [junit4] Completed [156/438] on J2 in 0.04s, 3 tests

   [junit4] 

   [junit4] Suite: org.apache.lucene.search.TestSimpleExplanationsOfNonMatches

   [junit4] Completed [157/438] on J2 in 0.26s, 70 tests

   [junit4] 

   [junit4] Suite: org.apache.lucene.search.spans.TestSpanBoostQuery

   [junit4] Completed [158/438] on J2 in 0.06s, 2 tests

   [junit4] 

   [junit4] Suite: org.apache.lucene.util.TestRoaringDocIdSet

   [junit4] Completed [159/438] on J2 in 0.58s, 5 tests

   [junit4] 

   [junit4] Suite: org.apache.lucene.index.TestTransactionRollback

   [junit4] Completed [160/438] on J2 in 0.13s, 2 tests

   [junit4] 

   [junit4] Suite: org.apache.lucene.index.TestIndexWriterMerging

   [junit4] Completed [161/438] on J2 in 3.14s, 6 tests

   [junit4] 

   [junit4] Suite: org.apache.lucene.util.fst.TestFSTs

   [junit4] IGNOR/A 0.00s J0 | TestFSTs.testBigSet

   [junit4]    > Assumption #1: 'nightly' test group is disabled (@Nightly())

   [junit4] Completed [162/438] on J0 in 8.52s, 20 tests, 1 skipped

   [junit4] 

   [junit4] Suite: org.apache.lucene.index.TestIndexWriterReader

   [junit4] IGNOR/A 0.00s J2 | TestIndexWriterReader.testDuringAddIndexes

   [junit4]    > Assumption #1: 'nightly' test group is disabled (@Nightly())

   [junit4] Completed [163/438] on J2 in 4.58s, 23 tests, 1 skipped

   [junit4] 

   [junit4] Suite: org.apache.lucene.search.TestDocBoost

   [junit4] Completed [164/438] on J2 in 0.01s, 1 test

   [junit4] 

   [junit4] Suite: org.apache.lucene.index.TestPayloads

   [junit4] Completed [165/438] on J2 in 0.19s, 7 tests

   [junit4] 

   [junit4] Suite: org.apache.lucene.search.TestBoostQuery

   [junit4] Completed [166/438] on J2 in 0.05s, 3 tests

   [junit4] 

   [junit4] Suite: org.apache.lucene.index.TestParallelReaderEmptyIndex

   [junit4] Completed [167/438] on J2 in 0.03s, 2 tests

   [junit4] 

   [junit4] Suite: org.apache.lucene.search.TestElevationComparator

   [junit4] Completed [168/438] on J2 in 0.05s, 1 test

   [junit4] 

   [junit4] Suite: org.apache.lucene.store.TestMultiMMap

   [junit4] Completed [169/438] on J2 in 1.42s, 56 tests

   [junit4] 

   [junit4] Suite: org.apache.lucene.store.TestSimpleFSLockFactory

   [junit4] Completed [170/438] on J2 in 5.82s, 7 tests

   [junit4] 

   [junit4] Suite: org.apache.lucene.TestExternalCodecs

   [junit4] Completed [171/438] on J2 in 0.30s, 1 test

   [junit4] 

   [junit4] Suite: org.apache.lucene.index.TestFilterLeafReader

   [junit4] Completed [172/438] on J2 in 0.03s, 3 tests

   [junit4] 

   [junit4] Suite: org.apache.lucene.util.mutable.TestMutableValues

   [junit4] Completed [173/438] on J2 in 0.01s, 6 tests

   [junit4] 

   [junit4] Suite: org.apache.lucene.util.TestFrequencyTrackingRingBuffer

   [junit4] Completed [174/438] on J2 in 0.20s, 2 tests

   [junit4] 

   [junit4] Suite: org.apache.lucene.util.TestRecyclingByteBlockAllocator

   [junit4] Completed [175/438] on J2 in 0.07s, 3 tests

   [junit4] 

   [junit4] Suite: org.apache.lucene.util.TestIntsRef

   [junit4] Completed [176/438] on J2 in 0.01s, 2 tests

   [junit4] 

   [junit4] Suite: org.apache.lucene.index.TestRollingUpdates

   [junit4] Completed [177/438] on J2 in 1.41s, 2 tests

   [junit4] 

   [junit4] Suite: org.apache.lucene.document.TestField

   [junit4] Completed [178/438] on J2 in 0.06s, 27 tests

   [junit4] 

   [junit4] Suite: org.apache.lucene.search.TestNumericRangeQuery64

   [junit4] Completed [179/438] on J0 in 12.92s, 29 tests

   [junit4] 

   [junit4] Suite: org.apache.lucene.util.fst.TestBytesStore

   [junit4] Completed [180/438] on J0 in 1.42s, 1 test

   [junit4] 

   [junit4] Suite: org.apache.lucene.index.TestTieredMergePolicy

   [junit4] Completed [181/438] on J2 in 3.53s, 6 tests

   [junit4] 

   [junit4] Suite: org.apache.lucene.index.TestFilterDirectoryReader

   [junit4] Completed [182/438] on J2 in 0.01s, 1 test

   [junit4] 

   [junit4] Suite: org.apache.lucene.index.Test2BPostings

   [junit4] IGNOR/A 0.00s J2 | Test2BPostings.test

   [junit4]    > Assumption #1: 'nightly' test group is disabled (@Nightly())

   [junit4] Completed [183/438] on J2 in 0.00s, 1 test, 1 skipped

   [junit4] 

   [junit4] Suite: org.apache.lucene.index.TestLogMergePolicy

   [junit4] Completed [184/438] on J2 in 0.01s, 2 tests

   [junit4] 

   [junit4] Suite: org.apache.lucene.index.TestIndexWriterWithThreads

   [junit4] IGNOR/A 0.03s J0 | TestIndexWriterWithThreads.testOpenTwoIndexWritersOnDifferentThreads

   [junit4]    > Assumption #1: aborting test: timeout obtaining lock

   [junit4] Completed [185/438] on J0 in 1.91s, 12 tests, 1 skipped

   [junit4] 

   [junit4] Suite: org.apache.lucene.search.TestNumericRangeQuery32

   [junit4] Completed [186/438] on J0 in 3.49s, 23 tests

   [junit4] 

   [junit4] Suite: org.apache.lucene.index.TestAtomicUpdate

   [junit4] Completed [187/438] on J2 in 4.85s, 1 test

   [junit4] 

   [junit4] Suite: org.apache.lucene.store.TestByteArrayDataInput

   [junit4] Completed [188/438] on J2 in 0.01s, 1 test

   [junit4] 

   [junit4] HEARTBEAT J1 PID(23862@localhost): 2016-07-31T23:31:56, stalled for 66.5s at: TestGrowableByteArrayDataOutput.testWriteLargeStrings

   [junit4] Suite: org.apache.lucene.index.TestCodecs

   [junit4] Completed [189/438] on J2 in 0.23s, 3 tests

   [junit4] 

   [junit4] Suite: org.apache.lucene.search.TestWildcard

   [junit4] Completed [190/438] on J2 in 0.07s, 8 tests

   [junit4] 

   [junit4] Suite: org.apache.lucene.index.TestIndexWriterDeleteByQuery

   [junit4] Completed [191/438] on J2 in 0.01s, 1 test

   [junit4] 

   [junit4] Suite: org.apache.lucene.search.TestSearcherManager

   [junit4] Completed [192/438] on J2 in 4.50s, 10 tests

   [junit4] 

   [junit4] Suite: org.apache.lucene.index.TestDeletionPolicy

   [junit4] Completed [193/438] on J2 in 4.01s, 6 tests

   [junit4] 

   [junit4] Suite: org.apache.lucene.index.TestIndexWriterExceptions

   [junit4] IGNOR/A 0.00s J0 | TestIndexWriterExceptions.testTooManyTokens

   [junit4]    > Assumption #1: 'nightly' test group is disabled (@Nightly())

   [junit4] Completed [194/438] on J0 in 11.10s, 36 tests, 1 skipped

   [junit4] 

   [junit4] Suite: org.apache.lucene.search.spans.TestBasics

   [junit4] Completed [195/438] on J0 in 1.50s, 25 tests

   [junit4] 

   [junit4] Suite: org.apache.lucene.search.TestBooleanOr

   [junit4] Completed [196/438] on J2 in 2.85s, 7 tests

   [junit4] 

   [junit4] Suite: org.apache.lucene.search.TestSloppyPhraseQuery

   [junit4] Completed [197/438] on J2 in 0.63s, 9 tests

   [junit4] 

   [junit4] Suite: org.apache.lucene.index.TestFlushByRamOrCountsPolicy

   [junit4] Completed [198/438] on J0 in 2.10s, 5 tests

   [junit4] 

   [junit4] Suite: org.apache.lucene.index.TestIndexWriterMergePolicy

   [junit4] Completed [199/438] on J2 in 1.33s, 7 tests

   [junit4] 

   [junit4] Suite: org.apache.lucene.index.TestNRTThreads

   [junit4] Completed [200/438] on J0 in 7.72s, 1 test

   [junit4] 

   [junit4] Suite: org.apache.lucene.search.TestBoolean2

   [junit4] Completed [201/438] on J0 in 3.04s, 11 tests

   [junit4] 

   [junit4] Suite: org.apache.lucene.index.TestStressAdvance

   [junit4] Completed [202/438] on J0 in 1.66s, 1 test

   [junit4] 

   [junit4] Suite: org.apache.lucene.index.TestNorms

   [junit4] Completed [203/438] on J0 in 1.03s, 2 tests

   [junit4] 

   [junit4] Suite: org.apache.lucene.codecs.compressing.TestHighCompressionMode

   [junit4] Completed [204/438] on J0 in 1.39s, 7 tests

   [junit4] 

   [junit4] Suite: org.apache.lucene.codecs.compressing.TestGrowableByteArrayDataOutput

   [junit4] Completed [205/438] on J1 in 103.68s, 2 tests

   [junit4] 

   [junit4] Suite: org.apache.lucene.index.TestDuelingCodecs

   [junit4] Completed [206/438] on J2 in 18.81s, 2 tests

   [junit4] 

   [junit4] Suite: org.apache.lucene.util.bkd.TestMutablePointsReaderUtils

   [junit4] Completed [207/438] on J1 in 1.25s, 3 tests

   [junit4] 

   [junit4] Suite: org.apache.lucene.search.spans.TestSpanOrQuery

   [junit4] Completed [208/438] on J1 in 0.01s, 3 tests

   [junit4] 

   [junit4] Suite: org.apache.lucene.index.TestSortedSetDocValues

   [junit4] Completed [209/438] on J1 in 0.01s, 1 test

   [junit4] 

   [junit4] Suite: org.apache.lucene.search.similarities.TestSimilarityBase

   [junit4] Completed [210/438] on J1 in 1.40s, 32 tests

   [junit4] 

   [junit4] Suite: org.apache.lucene.store.TestLockFactory

   [junit4] Completed [211/438] on J1 in 0.02s, 2 tests

   [junit4] 

   [junit4] Suite: org.apache.lucene.util.TestVersion

   [junit4] Completed [212/438] on J1 in 0.10s, 11 tests

   [junit4] 

   [junit4] Suite: org.apache.lucene.search.TestEarlyTermination

   [junit4] Completed [213/438] on J1 in 0.07s, 1 test

   [junit4] 

   [junit4] Suite: org.apache.lucene.index.TestMixedDocValuesUpdates

   [junit4] IGNOR/A 0.00s J1 | TestMixedDocValuesUpdates.testTonsOfUpdates

   [junit4]    > Assumption #1: 'nightly' test group is disabled (@Nightly())

   [junit4] Completed [214/438] on J1 in 3.29s, 4 tests, 1 skipped

   [junit4] 

   [junit4] Suite: org.apache.lucene.index.TestNoMergePolicy

   [junit4] Completed [215/438] on J1 in 0.02s, 4 tests

   [junit4] 

   [junit4] Suite: org.apache.lucene.index.TestNeverDelete

   [junit4] Completed [216/438] on J2 in 4.92s, 1 test

   [junit4] 

   [junit4] Suite: org.apache.lucene.search.TestRegexpQuery

   [junit4] Completed [217/438] on J1 in 0.04s, 7 tests

   [junit4] 

   [junit4] Suite: org.apache.lucene.index.TestTransactions

   [junit4] Completed [218/438] on J1 in 1.75s, 1 test

   [junit4] 

   [junit4] Suite: org.apache.lucene.search.TestPositiveScoresOnlyCollector

   [junit4] Completed [219/438] on J1 in 0.02s, 1 test

   [junit4] 

   [junit4] Suite: org.apache.lucene.search.TestTopDocsMerge

   [junit4] Completed [220/438] on J2 in 1.88s, 2 tests

   [junit4] 

   [junit4] Suite: org.apache.lucene.index.TestThreadedForceMerge

   [junit4] Completed [221/438] on J1 in 0.41s, 1 test

   [junit4] 

   [junit4] Suite: org.apache.lucene.search.TestRegexpRandom2

   [junit4] Completed [222/438] on J1 in 3.04s, 1 test

   [junit4] 

   [junit4] Suite: org.apache.lucene.util.TestCharsRefBuilder

   [junit4] Completed [223/438] on J1 in 0.01s, 2 tests

   [junit4] 

   [junit4] Suite: org.apache.lucene.util.TestFixedLengthBytesRefArray

   [junit4] Completed [224/438] on J1 in 0.13s, 2 tests

   [junit4] 

   [junit4] Suite: org.apache.lucene.index.TestStressIndexing

   [junit4] Completed [225/438] on J2 in 3.71s, 1 test

   [junit4] 

   [junit4] Suite: org.apache.lucene.TestMergeSchedulerExternal

   [junit4] Completed [226/438] on J1 in 0.61s, 2 tests

   [junit4] 

   [junit4] Suite: org.apache.lucene.index.TestSnapshotDeletionPolicy

   [junit4] Completed [227/438] on J2 in 1.07s, 7 tests

   [junit4] 

   [junit4] Suite: org.apache.lucene.index.TestIndexWriterCommit

   [junit4] Completed [228/438] on J1 in 1.37s, 14 tests

   [junit4] 

   [junit4] Suite: org.apache.lucene.index.TestNRTReaderWithThreads

   [junit4] Completed [229/438] on J2 in 1.29s, 1 test

   [junit4] 

   [junit4] Suite: org.apache.lucene.util.automaton.TestLevenshteinAutomata

   [junit4] Completed [230/438] on J2 in 1.27s, 4 tests

   [junit4] 

   [junit4] Suite: org.apache.lucene.index.TestDocumentsWriterStallControl

   [junit4] Completed [231/438] on J0 in 20.35s, 3 tests

   [junit4] 

   [junit4] Suite: org.apache.lucene.index.TestConsistentFieldNumbers

   [junit4] Completed [232/438] on J0 in 0.87s, 4 tests

   [junit4] 

   [junit4] Suite: org.apache.lucene.util.packed.TestPackedInts

   [junit4] IGNOR/A 0.00s J1 | TestPackedInts.testBlockReaderOverflow

   [junit4]    > Assumption #1: 'nightly' test group is disabled (@Nightly())

   [junit4] Completed [233/438] on J1 in 12.72s, 28 tests, 3 skipped

   [junit4] 

   [junit4] Suite: org.apache.lucene.util.TestWeakIdentityMap

   [junit4] Completed [234/438] on J0 in 7.21s, 2 tests

   [junit4] 

   [junit4] Suite: org.apache.lucene.search.TestSimpleExplanations

   [junit4] Completed [235/438] on J0 in 1.09s, 70 tests

   [junit4] 

   [junit4] Suite: org.apache.lucene.index.TestDirectoryReader

   [junit4] Completed [236/438] on J0 in 0.91s, 24 tests

   [junit4] 

   [junit4] Suite: org.apache.lucene.index.TestSegmentMerger

   [junit4] Completed [237/438] on J0 in 0.59s, 3 tests

   [junit4] 

   [junit4] Suite: org.apache.lucene.util.TestNumericUtils

   [junit4] Completed [238/438] on J1 in 3.92s, 24 tests

   [junit4] 

   [junit4] Suite: org.apache.lucene.util.TestFixedBitSet

   [junit4] Completed [239/438] on J0 in 3.43s, 19 tests

   [junit4] 

   [junit4] Suite: org.apache.lucene.search.TestComplexExplanations

   [junit4] Completed [240/438] on J0 in 0.63s, 21 tests

   [junit4] 

   [junit4] Suite: org.apache.lucene.index.TestSegmentReader

   [junit4] Completed [241/438] on J0 in 0.47s, 7 tests

   [junit4] 

   [junit4] Suite: org.apache.lucene.codecs.compressing.TestFastDecompressionMode

   [junit4] Completed [242/438] on J0 in 2.19s, 11 tests

   [junit4] 

   [junit4] Suite: org.apache.lucene.index.TestIndexWriterNRTIsCurrent

   [junit4] Completed [243/438] on J0 in 1.12s, 1 test

   [junit4] 

   [junit4] Suite: org.apache.lucene.search.TestFieldCacheRewriteMethod

   [junit4] Completed [244/438] on J0 in 2.32s, 2 tests

   [junit4] 

   [junit4] Suite: org.apache.lucene.index.TestSegmentTermDocs

   [junit4] Completed [245/438] on J0 in 0.27s, 4 tests

   [junit4] 

   [junit4] Suite: org.apache.lucene.search.TestSort

   [junit4] Completed [246/438] on J0 in 0.08s, 25 tests

   [junit4] 

   [junit4] Suite: org.apache.lucene.index.TestMultiDocValues

   [junit4] Completed [247/438] on J0 in 0.25s, 8 tests

   [junit4] 

   [junit4] Suite: org.apache.lucene.analysis.TestToken

   [junit4] Completed [248/438] on J0 in 0.02s, 5 tests

   [junit4] 

   [junit4] Suite: org.apache.lucene.index.TestFieldsReader

   [junit4] Completed [249/438] on J0 in 0.19s, 2 tests

   [junit4] 

   [junit4] Suite: org.apache.lucene.search.TestSimpleSearchEquivalence

   [junit4] Completed [250/438] on J0 in 0.66s, 17 tests

   [junit4] 

   [junit4] Suite: org.apache.lucene.util.TestTimSorterWorstCase

   [junit4] Completed [251/438] on J1 in 13.84s, 1 test

   [junit4] 

   [junit4] Suite: org.apache.lucene.util.TestRamUsageEstimator

   [junit4] IGNOR/A 0.00s J1 | TestRamUsageEstimator.testPrintValues

   [junit4]    > Assumption #1: Specify -Dtests.verbose=true to print constants of RamUsageEstimator.

   [junit4] Completed [252/438] on J1 in 0.01s, 5 tests, 1 skipped

   [junit4] 

   [junit4] Suite: org.apache.lucene.search.MultiCollectorTest

   [junit4] Completed [253/438] on J1 in 0.01s, 4 tests

   [junit4] 

   [junit4] Suite: org.apache.lucene.search.TestCustomSearcherSort

   [junit4] Completed [254/438] on J0 in 1.72s, 2 tests

   [junit4] 

   [junit4] Suite: org.apache.lucene.index.TestDocValuesIndexing

   [junit4] Completed [255/438] on J0 in 0.24s, 34 tests

   [junit4] 

   [junit4] Suite: org.apache.lucene.search.TestBooleanMinShouldMatch

   [junit4] Completed [256/438] on J0 in 2.54s, 17 tests

   [junit4] 

   [junit4] Suite: org.apache.lucene.index.TestTermsEnum2

   [junit4] Completed [257/438] on J0 in 0.90s, 4 tests

   [junit4] 

   [junit4] Suite: org.apache.lucene.codecs.perfield.TestPerFieldPostingsFormat

   [junit4] IGNOR/A 0.00s J1 | TestPerFieldPostingsFormat.testMergeStability

   [junit4]    > Assumption #1: The MockRandom PF randomizes content on the fly, so we can't check it

   [junit4] IGNOR/A 0.00s J1 | TestPerFieldPostingsFormat.testPostingsEnumReuse

   [junit4]    > Assumption #1: The MockRandom PF randomizes content on the fly, so we can't check it

   [junit4] Completed [258/438] on J1 in 5.32s, 24 tests, 2 skipped

   [junit4] 

   [junit4] Suite: org.apache.lucene.search.TestDocValuesScoring

   [junit4] Completed [259/438] on J1 in 0.05s, 1 test

   [junit4] 

   [junit4] Suite: org.apache.lucene.util.TestLegacyNumericUtils

   [junit4] Completed [260/438] on J0 in 1.00s, 12 tests

   [junit4] 

   [junit4] Suite: org.apache.lucene.util.automaton.TestDeterminizeLexicon

   [junit4] Completed [261/438] on J0 in 1.71s, 1 test

   [junit4] 

   [junit4] Suite: org.apache.lucene.index.TestIndexWriterOnDiskFull

   [junit4] Completed [262/438] on J0 in 0.22s, 4 tests

   [junit4] 

   [junit4] Suite: org.apache.lucene.index.TestMixedCodecs

   [junit4] Completed [263/438] on J0 in 1.39s, 1 test

   [junit4] 

   [junit4] Suite: org.apache.lucene.index.TestFlex

   [junit4] Completed [264/438] on J0 in 0.05s, 2 tests

   [junit4] 

   [junit4] Suite: org.apache.lucene.util.automaton.TestUTF32ToUTF8

   [junit4] Completed [265/438] on J0 in 3.75s, 6 tests

   [junit4] 

   [junit4] Suite: org.apache.lucene.search.spans.TestSpanExplanations

   [junit4] Completed [266/438] on J0 in 0.21s, 30 tests

   [junit4] 

   [junit4] Suite: org.apache.lucene.search.TestMultiPhraseQuery

   [junit4] Completed [267/438] on J0 in 0.06s, 17 tests, 1 skipped

   [junit4] 

   [junit4] Suite: org.apache.lucene.util.automaton.TestDeterminism

   [junit4] Completed [268/438] on J0 in 0.52s, 2 tests

   [junit4] 

   [junit4] Suite: org.apache.lucene.index.TestDocsAndPositions

   [junit4] Completed [269/438] on J0 in 0.36s, 6 tests

   [junit4] 

   [junit4] Suite: org.apache.lucene.index.TestTermVectorsWriter

   [junit4] Completed [270/438] on J0 in 0.08s, 15 tests

   [junit4] 

   [junit4] Suite: org.apache.lucene.index.TestParallelLeafReader

   [junit4] Completed [271/438] on J0 in 0.11s, 9 tests

   [junit4] 

   [junit4] Suite: org.apache.lucene.util.TestBytesRefHash

   [junit4] Completed [272/438] on J0 in 1.78s, 8 tests

   [junit4] 

   [junit4] Suite: org.apache.lucene.index.TestOmitTf

   [junit4] Completed [273/438] on J0 in 0.11s, 6 tests

   [junit4] 

   [junit4] Suite: org.apache.lucene.search.spans.TestNearSpansOrdered

   [junit4] Completed [274/438] on J0 in 0.09s, 19 tests

   [junit4] 

   [junit4] Suite: org.apache.lucene.search.TestSameScoresWithThreads

   [junit4] Completed [275/438] on J0 in 0.26s, 1 test

   [junit4] 

   [junit4] Suite: org.apache.lucene.index.TestMultiFields

   [junit4] Completed [276/438] on J0 in 1.17s, 3 tests

   [junit4] 

   [junit4] Suite: org.apache.lucene.search.TestTermRangeQuery

   [junit4] Completed [277/438] on J0 in 0.05s, 7 tests

   [junit4] 

   [junit4] Suite: org.apache.lucene.index.TestDocumentsWriterDeleteQueue

   [junit4] Completed [278/438] on J0 in 0.10s, 5 tests

   [junit4] 

   [junit4] Suite: org.apache.lucene.index.TestDocumentWriter

   [junit4] Completed [279/438] on J0 in 0.08s, 6 tests

   [junit4] 

   [junit4] Suite: org.apache.lucene.search.TestScorerPerf

   [junit4] Completed [280/438] on J0 in 4.79s, 1 test

   [junit4] 

   [junit4] Suite: org.apache.lucene.search.TestMultiTermConstantScore

   [junit4] Completed [281/438] on J0 in 0.42s, 8 tests

   [junit4] 

   [junit4] Suite: org.apache.lucene.index.TestIndexSorting

   [junit4] Completed [282/438] on J1 in 22.28s, 27 tests

   [junit4] 

   [junit4] Suite: org.apache.lucene.search.TestLiveFieldValues

   [junit4] Completed [283/438] on J0 in 1.05s, 1 test

   [junit4] 

   [junit4] Suite: org.apache.lucene.index.TestForTooMuchCloning

   [junit4] Completed [284/438] on J0 in 0.04s, 1 test

   [junit4] 

   [junit4] Suite: org.apache.lucene.geo.TestGeoEncodingUtils

   [junit4] Completed [285/438] on J1 in 0.50s, 3 tests

   [junit4] 

   [junit4] Suite: org.apache.lucene.search.TestFuzzyQuery

   [junit4] Completed [286/438] on J0 in 0.06s, 10 tests

   [junit4] 

   [junit4] Suite: org.apache.lucene.index.TestPerSegmentDeletes

   [junit4] Completed [287/438] on J1 in 0.02s, 1 test

   [junit4] 

   [junit4] Suite: org.apache.lucene.index.Test2BSortedDocValuesOrds

   [junit4] IGNOR/A 0.00s J1 | Test2BSortedDocValuesOrds.test2BOrds

   [junit4]    > Assumption #1: 'monster' test group is disabled (@Monster(value=Takes ~ 6 hours if the heap is 5gb))

   [junit4] Completed [288/438] on J1 in 0.00s, 1 test, 1 skipped

   [junit4] 

   [junit4] Suite: org.apache.lucene.util.TestByteBlockPool

   [junit4] Completed [289/438] on J1 in 0.06s, 1 test

   [junit4] 

   [junit4] Suite: org.apache.lucene.index.TestDoc

   [junit4] Completed [290/438] on J1 in 0.09s, 1 test

   [junit4] 

   [junit4] Suite: org.apache.lucene.search.spans.TestFieldMaskingSpanQuery

   [junit4] IGNOR/A 0.00s J0 | TestFieldMaskingSpanQuery.testSpans2

   [junit4]    > Assumption #1: Broken scoring: LUCENE-3723

   [junit4] IGNOR/A 0.00s J0 | TestFieldMaskingSpanQuery.testSimple2

   [junit4]    > Assumption #1: Broken scoring: LUCENE-3723

   [junit4] Completed [291/438] on J0 in 0.09s, 11 tests, 2 skipped

   [junit4] 

   [junit4] Suite: org.apache.lucene.search.spans.TestSpans

   [junit4] Completed [292/438] on J1 in 0.26s, 26 tests

   [junit4] 

   [junit4] Suite: org.apache.lucene.search.TestMultiValuedNumericRangeQuery

   [junit4] Completed [293/438] on J0 in 0.84s, 1 test

   [junit4] 

   [junit4] Suite: org.apache.lucene.index.TestSegmentTermEnum

   [junit4] Completed [294/438] on J0 in 0.02s, 2 tests

   [junit4] 

   [junit4] Suite: org.apache.lucene.index.TestUniqueTermCount

   [junit4] Completed [295/438] on J0 in 0.02s, 1 test

   [junit4] 

   [junit4] Suite: org.apache.lucene.search.TestComplexExplanationsOfNonMatches

   [junit4] Completed [296/438] on J0 in 0.04s, 21 tests

   [junit4] 

   [junit4] Suite: org.apache.lucene.search.TestSortRandom

   [junit4] Completed [297/438] on J0 in 0.27s, 2 tests

   [junit4] 

   [junit4] Suite: org.apache.lucene.index.TestPrefixCodedTerms

   [junit4] Completed [298/438] on J0 in 0.26s, 5 tests

   [junit4] 

   [junit4] Suite: org.apache.lucene.index.TestIndexWriterUnicode

   [junit4] Completed [299/438] on J1 in 3.03s, 5 tests

   [junit4] 

   [junit4] Suite: org.apache.lucene.index.TestAllFilesHaveCodecHeader

   [junit4] Completed [300/438] on J0 in 0.30s, 1 test

   [junit4] 

   [junit4] Suite: org.apache.lucene.document.TestDocument

   [junit4] Completed [301/438] on J0 in 0.02s, 12 tests

   [junit4] 

   [junit4] Suite: org.apache.lucene.index.TestSumDocFreq

   [junit4] Completed [302/438] on J0 in 0.12s, 1 test

   [junit4] 

   [junit4] Suite: org.apache.lucene.search.TestAutomatonQuery

   [junit4] Completed [303/438] on J1 in 0.98s, 8 tests

   [junit4] 

   [junit4] Suite: org.apache.lucene.search.TestWildcardRandom

   [junit4] Completed [304/438] on J1 in 0.10s, 1 test

   [junit4] 

   [junit4] Suite: org.apache.lucene.index.TestIndexableField

   [junit4] Completed [305/438] on J0 in 1.01s, 2 tests

   [junit4] 

   [junit4] Suite: org.apache.lucene.store.TestDirectory

   [junit4] Completed [306/438] on J0 in 0.62s, 3 tests

   [junit4] 

   [junit4] Suite: org.apache.lucene.search.TestPrefixRandom

   [junit4] Completed [307/438] on J1 in 1.48s, 1 test

   [junit4] 

   [junit4] Suite: org.apache.lucene.search.TestRegexpRandom

   [junit4] Completed [308/438] on J0 in 0.07s, 1 test

   [junit4] 

   [junit4] Suite: org.apache.lucene.index.TestMultiLevelSkipList

   [junit4] Completed [309/438] on J1 in 0.10s, 1 test

   [junit4] 

   [junit4] Suite: org.apache.lucene.index.TestPayloadsOnVectors

   [junit4] Completed [310/438] on J1 in 0.02s, 3 tests

   [junit4] 

   [junit4] Suite: org.apache.lucene.search.TestBooleanQueryVisitSubscorers

   [junit4] Completed [311/438] on J1 in 0.03s, 5 tests

   [junit4] 

   [junit4] Suite: org.apache.lucene.TestSearchForDuplicates

   [junit4] Completed [312/438] on J1 in 0.09s, 1 test

   [junit4] 

   [junit4] Suite: org.apache.lucene.index.TestCheckIndex

   [junit4] Completed [313/438] on J0 in 0.91s, 5 tests

   [junit4] 

   [junit4] Suite: org.apache.lucene.util.automaton.TestCompiledAutomaton

   [junit4] Completed [314/438] on J0 in 0.14s, 6 tests

   [junit4] 

   [junit4] Suite: org.apache.lucene.search.TestConstantScoreQuery

   [junit4] Completed [315/438] on J0 in 0.02s, 5 tests

   [junit4] 

   [junit4] Suite: org.apache.lucene.index.TestIndexFileDeleter

   [junit4] Completed [316/438] on J1 in 0.53s, 10 tests

   [junit4] 

   [junit4] Suite: org.apache.lucene.search.TestMatchAllDocsQuery

   [junit4] Completed [317/438] on J0 in 0.01s, 2 tests

   [junit4] 

   [junit4] Suite: org.apache.lucene.index.TestBinaryTerms

   [junit4] Completed [318/438] on J0 in 0.06s, 2 tests

   [junit4] 

   [junit4] Suite: org.apache.lucene.search.TestSubScorerFreqs

   [junit4] Completed [319/438] on J0 in 0.04s, 3 tests

   [junit4] 

   [junit4] Suite: org.apache.lucene.util.TestRecyclingIntBlockAllocator

   [junit4] Completed [320/438] on J0 in 0.50s, 3 tests

   [junit4] 

   [junit4] Suite: org.apache.lucene.index.TestIndexWriterConfig

   [junit4] Completed [321/438] on J0 in 0.04s, 8 tests

   [junit4] 

   [junit4] Suite: org.apache.lucene.search.TestConjunctions

   [junit4] Completed [322/438] on J0 in 0.01s, 1 test

   [junit4] 

   [junit4] Suite: org.apache.lucene.search.TestMultiTermQueryRewrites

   [junit4] Completed [323/438] on J0 in 0.02s, 3 tests

   [junit4] 

   [junit4] Suite: org.apache.lucene.search.TestPositionIncrement

   [junit4] Completed [324/438] on J0 in 0.02s, 2 tests

   [junit4] 

   [junit4] Suite: org.apache.lucene.search.TestSimilarity

   [junit4] Completed [325/438] on J0 in 0.01s, 1 test

   [junit4] 

   [junit4] Suite: org.apache.lucene.util.TestVirtualMethod

   [junit4] Completed [326/438] on J0 in 0.01s, 2 tests

   [junit4] 

   [junit4] Suite: org.apache.lucene.util.TestSmallFloat

   [junit4] Completed [327/438] on J0 in 0.13s, 2 tests

   [junit4] 

   [junit4] Suite: org.apache.lucene.analysis.TestNumericTokenStream

   [junit4] Completed [328/438] on J0 in 0.01s, 6 tests

   [junit4] 

   [junit4] Suite: org.apache.lucene.TestSearch

   [junit4] Completed [329/438] on J0 in 0.02s, 2 tests

   [junit4] 

   [junit4] Suite: org.apache.lucene.search.TestPrefixQuery

   [junit4] Completed [330/438] on J1 in 3.74s, 3 tests

   [junit4] 

   [junit4] Suite: org.apache.lucene.analysis.TestCachingTokenFilter

   [junit4] Completed [331/438] on J0 in 0.04s, 2 tests

   [junit4] 

   [junit4] Suite: org.apache.lucene.search.TestCachingCollector

   [junit4] Completed [332/438] on J0 in 0.02s, 4 tests

   [junit4] 

   [junit4] Suite: org.apache.lucene.search.TestAutomatonQueryUnicode

   [junit4] Completed [333/438] on J0 in 0.01s, 1 test

   [junit4] 

   [junit4] Suite: org.apache.lucene.util.TestPriorityQueue

   [junit4] Completed [334/438] on J1 in 0.57s, 9 tests

   [junit4] 

   [junit4] Suite: org.apache.lucene.search.TestTotalHitCountCollector

   [junit4] Completed [335/438] on J0 in 0.01s, 1 test

   [junit4] 

   [junit4] Suite: org.apache.lucene.search.spans.TestSpanFirstQuery

   [junit4] Completed [336/438] on J1 in 0.02s, 1 test

   [junit4] 

   [junit4] Suite: org.apache.lucene.index.TestIndexWriterLockRelease

   [junit4] Completed [337/438] on J0 in 0.01s, 1 test

   [junit4] 

   [junit4] Suite: org.apache.lucene.search.TestPhrasePrefixQuery

   [junit4] Completed [338/438] on J1 in 0.02s, 1 test

   [junit4] 

   [junit4] Suite: org.apache.lucene.util.TestBytesRef

   [junit4] Completed [339/438] on J0 in 0.01s, 3 tests

   [junit4] 

   [junit4] Suite: org.apache.lucene.TestDemo

   [junit4] Completed [340/438] on J1 in 0.01s, 1 test

   [junit4] 

   [junit4] Suite: org.apache.lucene.TestAssertions

   [junit4] Completed [341/438] on J0 in 0.01s, 1 test

   [junit4] 

   [junit4] Suite: org.apache.lucene.analysis.TestCharFilter

   [junit4] Completed [342/438] on J1 in 0.01s, 4 tests

   [junit4] 

   [junit4] Suite: org.apache.lucene.index.TestRollback

   [junit4] Completed [343/438] on J0 in 0.01s, 1 test

   [junit4] 

   [junit4] Suite: org.apache.lucene.index.TestTwoPhaseCommitTool

   [junit4] Completed [344/438] on J1 in 0.01s, 3 tests

   [junit4] 

   [junit4] Suite: org.apache.lucene.search.TestNot

   [junit4] Completed [345/438] on J0 in 0.01s, 1 test

   [junit4] 

   [junit4] Suite: org.apache.lucene.index.TestIndexWriterOnJRECrash

   [junit4] IGNOR/A 0.00s J1 | TestIndexWriterOnJRECrash.testNRTThreads

   [junit4]    > Assumption #1: 'nightly' test group is disabled (@Nightly())

   [junit4] Completed [346/438] on J1 in 0.00s, 1 test, 1 skipped

   [junit4] 

   [junit4] Suite: org.apache.lucene.index.Test4GBStoredFields

   [junit4] IGNOR/A 0.00s J0 | Test4GBStoredFields.test

   [junit4]    > Assumption #1: 'nightly' test group is disabled (@Nightly())

   [junit4] Completed [347/438] on J0 in 0.00s, 1 test, 1 skipped

   [junit4] 

   [junit4] Suite: org.apache.lucene.index.TestReaderClosed

   [junit4] Completed [348/438] on J1 in 0.02s, 2 tests

   [junit4] 

   [junit4] Suite: org.apache.lucene.index.TestIndexCommit

   [junit4] Completed [349/438] on J0 in 0.01s, 1 test

   [junit4] 

   [junit4] Suite: org.apache.lucene.index.TestTerm

   [junit4] Completed [350/438] on J1 in 0.01s, 1 test

   [junit4] 

   [junit4] Suite: org.apache.lucene.index.Test2BPostingsBytes

   [junit4] IGNOR/A 0.00s J0 | Test2BPostingsBytes.test

   [junit4]    > Assumption #1: 'monster' test group is disabled (@Monster(value=takes ~20GB-30GB of space and 10 minutes))

   [junit4] Completed [351/438] on J0 in 0.00s, 1 test, 1 skipped

   [junit4] 

   [junit4] Suite: org.apache.lucene.index.Test2BTerms

   [junit4] IGNOR/A 0.00s J1 | Test2BTerms.test2BTerms

   [junit4]    > Assumption #1: 'monster' test group is disabled (@Monster(value=very slow, use 5g minimum heap))

   [junit4] Completed [352/438] on J1 in 0.00s, 1 test, 1 skipped

   [junit4] 

   [junit4] Suite: org.apache.lucene.index.TestNewestSegment

   [junit4] Completed [353/438] on J0 in 0.01s, 1 test

   [junit4] 

   [junit4] Suite: org.apache.lucene.index.Test2BNumericDocValues

   [junit4] IGNOR/A 0.00s J1 | Test2BNumericDocValues.testNumerics

   [junit4]    > Assumption #1: 'monster' test group is disabled (@Monster(value=takes ~ 2 hours if the heap is 5gb))

   [junit4] Completed [354/438] on J1 in 0.00s, 1 test, 1 skipped

   [junit4] 

   [junit4] Suite: org.apache.lucene.analysis.TestCharArraySet

   [junit4] Completed [356/438] on J1 in 0.02s, 15 tests

   [junit4] 

   [junit4] Suite: org.apache.lucene.analysis.TestReusableStringReader

   [junit4] Completed [357/438] on J0 in 0.01s, 1 test

   [junit4] 

   [junit4] Suite: org.apache.lucene.analysis.tokenattributes.TestBytesRefAttImpl

   [junit4] Completed [358/438] on J1 in 0.01s, 1 test

   [junit4] 

   [junit4] Suite: org.apache.lucene.analysis.tokenattributes.TestPackedTokenAttributeImpl

   [junit4] Completed [359/438] on J0 in 0.01s, 4 tests

   [junit4] 

   [junit4] Suite: org.apache.lucene.codecs.TestCodecUtil

   [junit4] Completed [360/438] on J1 in 0.02s, 15 tests

   [junit4] 

   [junit4] Suite: org.apache.lucene.codecs.lucene50.TestForUtil

   [junit4] Completed [361/438] on J0 in 0.03s, 1 test

   [junit4] 

   [junit4] Suite: org.apache.lucene.codecs.lucene50.TestLucene50FieldInfoFormat

   [junit4] Completed [362/438] on J0 in 0.25s, 11 tests

   [junit4] 

   [junit4] Suite: org.apache.lucene.codecs.lucene50.TestLucene50StoredFieldsFormat

   [junit4] IGNOR/A 0.00s J0 | TestLucene50StoredFieldsFormat.testBigDocuments

   [junit4]    > Assumption #1: 'nightly' test group is disabled (@Nightly())

   [junit4] Completed [363/438] on J0 in 6.06s, 17 tests, 1 skipped

   [junit4] 

   [junit4] HEARTBEAT J2 PID(23868@localhost): 2016-07-31T23:34:08, stalled for 65.2s at: TestTermsEnum.testVaryingTermsPerSegment

   [junit4] Suite: org.apache.lucene.codecs.lucene50.TestLucene50StoredFieldsFormatHighCompression

   [junit4] IGNOR/A 0.00s J0 | TestLucene50StoredFieldsFormatHighCompression.testBigDocuments

   [junit4]    > Assumption #1: 'nightly' test group is disabled (@Nightly())

   [junit4] Completed [364/438] on J0 in 10.55s, 19 tests, 1 skipped

   [junit4] 

   [junit4] Suite: org.apache.lucene.codecs.lucene50.TestLucene50CompoundFormat

   [junit4] Completed [365/438] on J1 in 20.60s, 26 tests

   [junit4] 

   [junit4] Suite: org.apache.lucene.codecs.lucene53.TestLucene53NormsFormat

   [junit4] IGNOR/A 0.00s J1 | TestLucene53NormsFormat.testMergeStability

   [junit4]    > Assumption #1: The MockRandom PF randomizes content on the fly, so we can't check it

   [junit4] IGNOR/A 0.00s J1 | TestLucene53NormsFormat.testNCommonBig

   [junit4]    > Assumption #1: 'nightly' test group is disabled (@Nightly())

   [junit4] Completed [366/438] on J1 in 7.10s, 17 tests, 2 skipped

   [junit4] 

   [junit4] Suite: org.apache.lucene.codecs.lucene50.TestLucene50TermVectorsFormat

   [junit4] Completed [367/438] on J0 in 15.20s, 17 tests

   [junit4] 

   [junit4] Suite: org.apache.lucene.codecs.lucene60.TestLucene60PointsFormat

   [junit4] IGNOR/A 0.00s J0 | TestLucene60PointsFormat.testRandomBinaryBig

   [junit4]    > Assumption #1: 'nightly' test group is disabled (@Nightly())

   [junit4] IGNOR/A 0.00s J0 | TestLucene60PointsFormat.testMergeStability

   [junit4]    > Assumption #1: merge is not stable

   [junit4] Completed [368/438] on J0 in 5.11s, 17 tests, 2 skipped

   [junit4] 

   [junit4] Suite: org.apache.lucene.index.TestTermsEnum

   [junit4] Completed [369/438] on J2 in 111.82s, 11 tests

   [junit4] 

   [junit4] Suite: org.apache.lucene.index.Test2BPoints

   [junit4] IGNOR/A 0.00s J2 | Test2BPoints.test2D

   [junit4]    > Assumption #1: 'monster' test group is disabled (@Monster(value=takes at least 4 hours and consumes many GB of temp disk space))

   [junit4] IGNOR/A 0.00s J2 | Test2BPoints.test1D

   [junit4]    > Assumption #1: 'monster' test group is disabled (@Monster(value=takes at least 4 hours and consumes many GB of temp disk space))

   [junit4] Completed [370/438] on J2 in 0.00s, 2 tests, 2 skipped

   [junit4] 

   [junit4] Suite: org.apache.lucene.index.TestAllFilesCheckIndexHeader

   [junit4] Completed [371/438] on J2 in 0.27s, 1 test

   [junit4] 

   [junit4] Suite: org.apache.lucene.index.TestAllFilesDetectTruncation

   [junit4] Completed [372/438] on J2 in 0.24s, 1 test

   [junit4] 

   [junit4] Suite: org.apache.lucene.index.TestBinaryDocValuesUpdates

   [junit4] IGNOR/A 0.00s J2 | TestBinaryDocValuesUpdates.testTonsOfUpdates

   [junit4]    > Assumption #1: 'nightly' test group is disabled (@Nightly())

   [junit4] Completed [373/438] on J2 in 5.95s, 28 tests, 1 skipped

   [junit4] 

   [junit4] Suite: org.apache.lucene.index.TestDemoParallelLeafReader

   [junit4] Completed [374/438] on J2 in 3.91s, 5 tests

   [junit4] 

   [junit4] Suite: org.apache.lucene.index.TestDocInverterPerFieldErrorInfo

   [junit4] Completed [375/438] on J2 in 0.01s, 2 tests

   [junit4] 

   [junit4] Suite: org.apache.lucene.index.TestDuelingCodecsAtNight

   [junit4] IGNOR/A 0.00s J2 | TestDuelingCodecsAtNight.testEquals

   [junit4]    > Assumption #1: 'nightly' test group is disabled (@Nightly())

   [junit4] IGNOR/A 0.00s J2 | TestDuelingCodecsAtNight.testCrazyReaderEquals

   [junit4]    > Assumption #1: 'nightly' test group is disabled (@Nightly())

   [junit4] IGNOR/A 0.00s J2 | TestDuelingCodecsAtNight.testBigEquals

   [junit4]    > Assumption #1: 'nightly' test group is disabled (@Nightly())

   [junit4] Completed [376/438] on J2 in 0.00s, 3 tests, 3 skipped

   [junit4] 

   [junit4] Suite: org.apache.lucene.index.TestExceedMaxTermLength

   [junit4] Completed [377/438] on J2 in 0.01s, 1 test

   [junit4] 

   [junit4] Suite: org.apache.lucene.index.TestExitableDirectoryReader

   [junit4] Completed [378/438] on J2 in 0.42s, 1 test

   [junit4] 

   [junit4] Suite: org.apache.lucene.index.TestFieldReuse

   [junit4] Completed [379/438] on J2 in 0.01s, 3 tests

   [junit4] 

   [junit4] Suite: org.apache.lucene.index.TestIndexReaderClose

   [junit4] Completed [380/438] on J2 in 0.21s, 2 tests

   [junit4] 

   [junit4] Suite: org.apache.lucene.index.TestIndexWriterMaxDocs

   [junit4] IGNOR/A 0.00s J2 | TestIndexWriterMaxDocs.testExactlyAtTrueLimit

   [junit4]    > Assumption #1: 'monster' test group is disabled (@Monster(value=takes over two hours))

   [junit4] Completed [381/438] on J2 in 1.11s, 21 tests, 1 skipped

   [junit4] 

   [junit4] Suite: org.apache.lucene.index.TestIndexWriterThreadsToSegments

   [junit4] Completed [382/438] on J2 in 1.06s, 4 tests

   [junit4] 

   [junit4] Suite: org.apache.lucene.index.TestManyFields

   [junit4] Completed [383/438] on J2 in 0.53s, 3 tests

   [junit4] 

   [junit4] Suite: org.apache.lucene.index.TestMaxPosition

   [junit4] Completed [384/438] on J2 in 0.02s, 2 tests

   [junit4] 

   [junit4] Suite: org.apache.lucene.index.TestMultiTermsEnum

   [junit4] Completed [385/438] on J2 in 0.01s, 1 test

   [junit4] 

   [junit4] Suite: org.apache.lucene.index.TestNumericDocValuesUpdates

   [junit4] IGNOR/A 0.00s J2 | TestNumericDocValuesUpdates.testTonsOfUpdates

   [junit4]    > Assumption #1: 'nightly' test group is disabled (@Nightly())

   [junit4] Completed [386/438] on J2 in 3.65s, 31 tests, 1 skipped

   [junit4] 

   [junit4] Suite: org.apache.lucene.index.TestReaderWrapperDVTypeCheck

   [junit4] Completed [387/438] on J2 in 0.02s, 1 test

   [junit4] 

   [junit4] Suite: org.apache.lucene.index.TestStressDeletes

   [junit4] Completed [388/438] on J2 in 0.62s, 1 test

   [junit4] 

   [junit4] Suite: org.apache.lucene.index.TestTerms

   [junit4] Completed [389/438] on J2 in 0.13s, 8 tests

   [junit4] 

   [junit4] Suite: org.apache.lucene.index.TestTragicIndexWriterDeadlock

   [junit4] Completed [390/438] on J2 in 0.01s, 1 test

   [junit4] 

   [junit4] Suite: org.apache.lucene.index.TestTryDelete

   [junit4] Completed [391/438] on J2 in 0.01s, 3 tests

   [junit4] 

   [junit4] Suite: org.apache.lucene.index.TestUpgradeIndexMergePolicy

   [junit4] Completed [392/438] on J2 in 0.02s, 1 test

   [junit4] 

   [junit4] Suite: org.apache.lucene.geo.TestPolygon2D

   [junit4] Completed [393/438] on J0 in 24.51s, 10 tests

   [junit4] 

   [junit4] Suite: org.apache.lucene.search.TestBlendedTermQuery

   [junit4] Completed [394/438] on J0 in 0.01s, 3 tests

   [junit4] 

   [junit4] Suite: org.apache.lucene.search.TestApproximationSearchEquivalence

   [junit4] Completed [395/438] on J2 in 0.41s, 10 tests

   [junit4] 

   [junit4] Suite: org.apache.lucene.search.TestBooleanCoord

   [junit4] Completed [396/438] on J0 in 0.11s, 76 tests

   [junit4] 

   [junit4] Suite: org.apache.lucene.search.TestBooleanRewrites

   [junit4] Completed [397/438] on J2 in 0.17s, 7 tests

   [junit4] 

   [junit4] Suite: org.apache.lucene.search.TestControlledRealTimeReopenThread

   [junit4] IGNOR/A 0.00s J2 | TestControlledRealTimeReopenThread.testCRTReopen

   [junit4]    > Assumption #1: 'awaitsfix' test group is disabled (@AwaitsFix(bugUrl=https://issues.apache.org/jira/browse/LUCENE-5737))

   [junit4] Completed [398/438] on J2 in 4.06s, 6 tests, 1 skipped

   [junit4] 

   [junit4] Suite: org.apache.lucene.search.TestDocValuesRewriteMethod

   [junit4] Completed [399/438] on J2 in 1.80s, 2 tests

   [junit4] 

   [junit4] Suite: org.apache.lucene.search.TestConjunctionDISI

   [junit4] Completed [400/438] on J0 in 7.66s, 5 tests

   [junit4] 

   [junit4] Suite: org.apache.lucene.search.TestFieldValueQuery

   [junit4] Completed [401/438] on J0 in 3.21s, 6 tests

   [junit4] 

   [junit4] Suite: org.apache.lucene.search.TestFilterWeight

   [junit4] Completed [402/438] on J0 in 0.01s, 1 test

   [junit4] 

   [junit4] Suite: org.apache.lucene.search.TestIndexSearcher

   [junit4] Completed [403/438] on J0 in 0.07s, 5 tests

   [junit4] 

   [junit4] Suite: org.apache.lucene.search.TestMatchNoDocsQuery

   [junit4] Completed [404/438] on J0 in 0.01s, 3 tests

   [junit4] 

   [junit4] Suite: org.apache.lucene.search.TestMinShouldMatch2

   [junit4] Completed [405/438] on J0 in 2.69s, 6 tests

   [junit4] 

   [junit4] Suite: org.apache.lucene.search.TestMultiCollector

   [junit4] Completed [406/438] on J0 in 0.17s, 2 tests

   [junit4] 

   [junit4] Suite: org.apache.lucene.search.TestMultiset

   [junit4] Completed [407/438] on J0 in 0.01s, 2 tests

   [junit4] 

   [junit4] Suite: org.apache.lucene.search.TestEarlyTerminatingSortingCollector

   [junit4] Completed [408/438] on J2 in 10.06s, 4 tests

   [junit4] 

   [junit4] Suite: org.apache.lucene.search.TestQueryRescorer

   [junit4] Completed [409/438] on J2 in 0.31s, 6 tests

   [junit4] 

   [junit4] Suite: org.apache.lucene.search.TestSimpleExplanationsWithFillerDocs

   [junit4] IGNOR/A 0.01s J2 | TestSimpleExplanationsWithFillerDocs.testMA1

   [junit4]    > Assumption #1: got: <[test is not viable with empty filler docs, null]>, expected: each not null

   [junit4] IGNOR/A 0.00s J2 | TestSimpleExplanationsWithFillerDocs.testMA2

   [junit4]    > Assumption #1: got: <[test is not viable with empty filler docs, null]>, expected: each not null

   [junit4] Completed [410/438] on J2 in 6.67s, 70 tests, 2 skipped

   [junit4] 

   [junit4] Suite: org.apache.lucene.search.TestSortRescorer

   [junit4] Completed [411/438] on J2 in 0.35s, 2 tests

   [junit4] 

   [junit4] Suite: org.apache.lucene.search.TestSortedSetSelector

   [junit4] Completed [412/438] on J2 in 0.08s, 15 tests

   [junit4] 

   [junit4] Suite: org.apache.lucene.search.TestSortedSetSortField

   [junit4] Completed [413/438] on J2 in 0.05s, 7 tests

   [junit4] 

   [junit4] Suite: org.apache.lucene.search.TestSynonymQuery

   [junit4] Completed [414/438] on J2 in 0.01s, 4 tests

   [junit4] 

   [junit4] Suite: org.apache.lucene.search.similarities.TestClassicSimilarity

   [junit4] Completed [415/438] on J2 in 0.03s, 11 tests

   [junit4] 

   [junit4] Suite: org.apache.lucene.search.spans.TestSpanCollection

   [junit4] Completed [416/438] on J2 in 0.03s, 3 tests

   [junit4] 

   [junit4] Suite: org.apache.lucene.search.spans.TestSpanContainQuery

   [junit4] Completed [417/438] on J2 in 0.04s, 4 tests

   [junit4] 

   [junit4] Suite: org.apache.lucene.search.TestPointQueries

   [junit4] IGNOR/A 0.00s J0 | TestPointQueries.testRandomBinaryBig

   [junit4]    > Assumption #1: 'nightly' test group is disabled (@Nightly())

   [junit4] IGNOR/A 0.00s J0 | TestPointQueries.testRandomLongsBig

   [junit4]    > Assumption #1: 'nightly' test group is disabled (@Nightly())

   [junit4] Completed [418/438] on J0 in 10.85s, 46 tests, 2 skipped

   [junit4] 

   [junit4] Suite: org.apache.lucene.search.spans.TestSpanNotQuery

   [junit4] Completed [419/438] on J2 in 0.01s, 3 tests

   [junit4] 

   [junit4] Suite: org.apache.lucene.store.TestBufferedChecksum

   [junit4] Completed [420/438] on J0 in 0.04s, 2 tests

   [junit4] 

   [junit4] Suite: org.apache.lucene.store.TestNIOFSDirectory

   [junit4] Completed [421/438] on J2 in 0.87s, 44 tests

   [junit4] 

   [junit4] Suite: org.apache.lucene.store.TestTrackingDirectoryWrapper

   [junit4] IGNOR/A 0.00s J2 | TestTrackingDirectoryWrapper.testFsyncDoesntCreateNewFiles

   [junit4]    > Assumption #1: test only works for FSDirectory subclasses

   [junit4] IGNOR/A 0.00s J2 | TestTrackingDirectoryWrapper.testPendingDeletions

   [junit4]    > Assumption #1: we can only install VirusCheckingFS on an FSDirectory

   [junit4] Completed [422/438] on J2 in 0.40s, 49 tests, 2 skipped

   [junit4] 

   [junit4] Suite: org.apache.lucene.util.TestDocIdSetBuilder

   [junit4] Completed [423/438] on J2 in 3.49s, 7 tests

   [junit4] 

   [junit4] Suite: org.apache.lucene.util.TestFixedBitDocIdSet

   [junit4] Completed [424/438] on J2 in 0.66s, 5 tests

   [junit4] 

   [junit4] Suite: org.apache.lucene.util.TestIntArrayDocIdSet

   [junit4] Completed [425/438] on J2 in 0.42s, 5 tests

   [junit4] 

   [junit4] Suite: org.apache.lucene.util.TestIntroSelector

   [junit4] Completed [426/438] on J2 in 0.62s, 2 tests

   [junit4] 

   [junit4] Suite: org.apache.lucene.util.TestMathUtil

   [junit4] Completed [427/438] on J2 in 0.02s, 5 tests

   [junit4] 

   [junit4] Suite: org.apache.lucene.store.TestNativeFSLockFactory

   [junit4] Completed [428/438] on J0 in 7.42s, 10 tests

   [junit4] 

   [junit4] Suite: org.apache.lucene.util.TestRadixSelector

   [junit4] Completed [429/438] on J2 in 0.45s, 1 test

   [junit4] 

   [junit4] Suite: org.apache.lucene.util.TestSparseFixedBitDocIdSet

   [junit4] Completed [430/438] on J0 in 1.00s, 5 tests

   [junit4] 

   [junit4] Suite: org.apache.lucene.util.TestStringHelper

   [junit4] Completed [431/438] on J0 in 0.01s, 7 tests

   [junit4] 

   [junit4] Suite: org.apache.lucene.util.TestSparseFixedBitSet

   [junit4] Completed [432/438] on J2 in 3.81s, 11 tests

   [junit4] 

   [junit4] Suite: org.apache.lucene.util.TestStringMSBRadixSorter

   [junit4] Completed [433/438] on J0 in 4.13s, 7 tests

   [junit4] 

   [junit4] Suite: org.apache.lucene.util.automaton.LimitedFiniteStringsIteratorTest

   [junit4] Completed [434/438] on J0 in 0.18s, 6 tests

   [junit4] 

   [junit4] Suite: org.apache.lucene.util.automaton.FiniteStringsIteratorTest

   [junit4] Completed [435/438] on J2 in 1.86s, 7 tests

   [junit4] 

   [junit4] Suite: org.apache.lucene.util.packed.TestDirectPacked

   [junit4] Completed [436/438] on J2 in 1.22s, 4 tests

   [junit4] 

   [junit4] Suite: org.apache.lucene.util.bkd.TestDocIdsWriter

   [junit4] Completed [437/438] on J0 in 4.70s, 2 tests

   [junit4] 

   [junit4] Suite: org.apache.lucene.codecs.lucene54.TestLucene54DocValuesFormat

   [junit4] IGNOR/A 0.00s J1 | TestLucene54DocValuesFormat.testTermsEnumRandomMany

   [junit4]    > Assumption #1: 'nightly' test group is disabled (@Nightly())

   [junit4] IGNOR/A 0.00s J1 | TestLucene54DocV

[...truncated too long message...]

ocs-uptodate:


javadocs-misc:


check-spatial3d-javadocs-uptodate:


javadocs-spatial3d:


check-queries-uptodate:


jar-queries:


check-misc-uptodate:


jar-misc:


check-spatial3d-uptodate:


jar-spatial3d:


-check-git-state:


-git-cleanroot:


-copy-git-state:


git-autoclean:


ivy-availability-check:


ivy-fail:


ivy-configure:

[ivy:configure] :: loading settings :: file = /home/jenkins/workspace/Lucene-Solr-6.x-Linux/lucene/top-level-ivy-settings.xml


resolve:


common.init:


compile-lucene-core:


init:


-clover.disable:


-clover.load:


-clover.classpath:


-clover.setup:


clover:


common.compile-core:


compile-core:


check-javadocs-uptodate:


javadocs:


-check-git-state:


-git-cleanroot:


-copy-git-state:


git-autoclean:


ivy-availability-check:


ivy-fail:


ivy-configure:

[ivy:configure] :: loading settings :: file = /home/jenkins/workspace/Lucene-Solr-6.x-Linux/lucene/top-level-ivy-settings.xml


resolve:


common.init:


compile-lucene-core:


init:


-clover.disable:


-clover.load:


-clover.classpath:


-clover.setup:


clover:


compile-core:


check-lucene-core-javadocs-uptodate:


javadocs-lucene-core:


check-javadocs-uptodate:


javadocs:

    [mkdir] Created dir: /home/jenkins/workspace/Lucene-Solr-6.x-Linux/lucene/build/docs/spatial


download-java8-javadoc-packagelist:

     [copy] Copying 1 file to /home/jenkins/workspace/Lucene-Solr-6.x-Linux/lucene/build/docs/spatial

  [javadoc] Generating Javadoc

  [javadoc] Javadoc execution

  [javadoc] Loading source files for package org.apache.lucene.spatial...

  [javadoc] Loading source files for package org.apache.lucene.spatial.geopoint.document...

  [javadoc] Loading source files for package org.apache.lucene.spatial.geopoint.search...

  [javadoc] Loading source files for package org.apache.lucene.spatial.util...

  [javadoc] Constructing Javadoc information...

  [javadoc] Standard Doclet version 1.8.0_102

  [javadoc] Building tree for all the packages and classes...

  [javadoc] Building index for all the packages and classes...

  [javadoc] Building index for all classes...

  [javadoc] Generating /home/jenkins/workspace/Lucene-Solr-6.x-Linux/lucene/build/docs/spatial/help-doc.html...

  [javadoc] Note: Custom tags that were not seen:  @lucene.internal

      [jar] Building jar: /home/jenkins/workspace/Lucene-Solr-6.x-Linux/lucene/build/spatial/lucene-spatial-6.2.0-SNAPSHOT-javadoc.jar


-check-git-state:


-git-cleanroot:


-copy-git-state:


git-autoclean:


ivy-availability-check:


ivy-fail:


ivy-configure:

[ivy:configure] :: loading settings :: file = /home/jenkins/workspace/Lucene-Solr-6.x-Linux/lucene/top-level-ivy-settings.xml


resolve:


common.init:


compile-lucene-core:


init:


-clover.disable:


-clover.load:


-clover.classpath:


-clover.setup:


clover:


compile-core:


check-lucene-core-javadocs-uptodate:


javadocs-lucene-core:


check-javadocs-uptodate:


javadocs:


check-queries-javadocs-uptodate:


javadocs-queries:


check-misc-javadocs-uptodate:


javadocs-misc:


check-expressions-uptodate:


jar-expressions:


check-misc-uptodate:


jar-misc:


check-analyzers-common-uptodate:


jar-analyzers-common:


-check-git-state:


-git-cleanroot:


-copy-git-state:


git-autoclean:


ivy-availability-check:


ivy-fail:


ivy-configure:

[ivy:configure] :: loading settings :: file = /home/jenkins/workspace/Lucene-Solr-6.x-Linux/lucene/top-level-ivy-settings.xml


resolve:


common.init:


compile-lucene-core:


init:


-clover.disable:


-clover.load:


-clover.classpath:


-clover.setup:


clover:


common.compile-core:


compile-core:


check-javadocs-uptodate:


javadocs:

    [mkdir] Created dir: /home/jenkins/workspace/Lucene-Solr-6.x-Linux/lucene/build/docs/suggest


download-java8-javadoc-packagelist:

     [copy] Copying 1 file to /home/jenkins/workspace/Lucene-Solr-6.x-Linux/lucene/build/docs/suggest

  [javadoc] Generating Javadoc

  [javadoc] Javadoc execution

  [javadoc] Loading source files for package org.apache.lucene.search.spell...

  [javadoc] Loading source files for package org.apache.lucene.search.suggest...

  [javadoc] Loading source files for package org.apache.lucene.search.suggest.analyzing...

  [javadoc] Loading source files for package org.apache.lucene.search.suggest.document...

  [javadoc] Loading source files for package org.apache.lucene.search.suggest.fst...

  [javadoc] Loading source files for package org.apache.lucene.search.suggest.jaspell...

  [javadoc] Loading source files for package org.apache.lucene.search.suggest.tst...

  [javadoc] Constructing Javadoc information...

  [javadoc] Standard Doclet version 1.8.0_102

  [javadoc] Building tree for all the packages and classes...

  [javadoc] Building index for all the packages and classes...

  [javadoc] Building index for all classes...

      [jar] Building jar: /home/jenkins/workspace/Lucene-Solr-6.x-Linux/lucene/build/suggest/lucene-suggest-6.2.0-SNAPSHOT-javadoc.jar


check-lucene-test-framework-javadocs-uptodate:


javadocs-test-framework:


-check-git-state:


-git-cleanroot:


-copy-git-state:


git-autoclean:


ivy-availability-check:


ivy-fail:


ivy-configure:

[ivy:configure] :: loading settings :: file = /home/jenkins/workspace/Lucene-Solr-6.x-Linux/lucene/top-level-ivy-settings.xml


resolve:


init:


check-lucene-core-javadocs-uptodate:


javadocs-lucene-core:


check-lucene-codecs-javadocs-uptodate:


javadocs-lucene-codecs:


check-javadocs-uptodate:


javadocs:

    [mkdir] Created dir: /home/jenkins/workspace/Lucene-Solr-6.x-Linux/lucene/build/docs/test-framework


download-java8-javadoc-packagelist:

     [copy] Copying 1 file to /home/jenkins/workspace/Lucene-Solr-6.x-Linux/lucene/build/docs/test-framework

  [javadoc] Generating Javadoc

  [javadoc] Javadoc execution

  [javadoc] Loading source files for package org.apache.lucene.analysis...

  [javadoc] Loading source files for package org.apache.lucene.analysis.standard...

  [javadoc] Loading source files for package org.apache.lucene.codecs...

  [javadoc] Loading source files for package org.apache.lucene.codecs.asserting...

  [javadoc] Loading source files for package org.apache.lucene.codecs.blockterms...

  [javadoc] Loading source files for package org.apache.lucene.codecs.bloom...

  [javadoc] Loading source files for package org.apache.lucene.codecs.cheapbastard...

  [javadoc] Loading source files for package org.apache.lucene.codecs.compressing...

  [javadoc] Loading source files for package org.apache.lucene.codecs.compressing.dummy...

  [javadoc] Loading source files for package org.apache.lucene.codecs.cranky...

  [javadoc] Loading source files for package org.apache.lucene.codecs.mockrandom...

  [javadoc] Loading source files for package org.apache.lucene.codecs.ramonly...

  [javadoc] Loading source files for package org.apache.lucene.geo...

  [javadoc] Loading source files for package org.apache.lucene.index...

  [javadoc] Loading source files for package org.apache.lucene.mockfile...

  [javadoc] Loading source files for package org.apache.lucene.search...

  [javadoc] Loading source files for package org.apache.lucene.search.similarities...

  [javadoc] Loading source files for package org.apache.lucene.search.spans...

  [javadoc] Loading source files for package org.apache.lucene.store...

  [javadoc] Loading source files for package org.apache.lucene.util...

  [javadoc] Loading source files for package org.apache.lucene.util.automaton...

  [javadoc] Loading source files for package org.apache.lucene.util.fst...

  [javadoc] Constructing Javadoc information...

  [javadoc] Standard Doclet version 1.8.0_102

  [javadoc] Building tree for all the packages and classes...

  [javadoc] Building index for all the packages and classes...

  [javadoc] Building index for all classes...

      [jar] Building jar: /home/jenkins/workspace/Lucene-Solr-6.x-Linux/lucene/build/test-framework/lucene-test-framework-6.2.0-SNAPSHOT-javadoc.jar


javadocs:


changes-to-html:

    [mkdir] Created dir: /home/jenkins/workspace/Lucene-Solr-6.x-Linux/lucene/build/docs/changes

      [get] Getting: https://issues.apache.org/jira/rest/api/2/project/LUCENE

      [get] To: /home/jenkins/workspace/Lucene-Solr-6.x-Linux/lucene/build/docs/changes/jiraVersionList.json

      [get] Error opening connection java.io.IOException: Server returned HTTP response code: 400 for URL: https://issues.apache.org/jira/rest/api/2/project/LUCENE

      [get] Error opening connection java.io.IOException: Server returned HTTP response code: 400 for URL: https://issues.apache.org/jira/rest/api/2/project/LUCENE

      [get] Error opening connection java.io.IOException: Server returned HTTP response code: 400 for URL: https://issues.apache.org/jira/rest/api/2/project/LUCENE

      [get] Can't get https://issues.apache.org/jira/rest/api/2/project/LUCENE to /home/jenkins/workspace/Lucene-Solr-6.x-Linux/lucene/build/docs/changes/jiraVersionList.json


BUILD FAILED

/home/jenkins/workspace/Lucene-Solr-6.x-Linux/build.xml:763: The following error occurred while executing this line:

/home/jenkins/workspace/Lucene-Solr-6.x-Linux/build.xml:101: The following error occurred while executing this line:

/home/jenkins/workspace/Lucene-Solr-6.x-Linux/lucene/build.xml:138: The following error occurred while executing this line:

/home/jenkins/workspace/Lucene-Solr-6.x-Linux/lucene/build.xml:479: The following error occurred while executing this line:

/home/jenkins/workspace/Lucene-Solr-6.x-Linux/lucene/common-build.xml:2512: Can't get https://issues.apache.org/jira/rest/api/2/project/LUCENE to /home/jenkins/workspace/Lucene-Solr-6.x-Linux/lucene/build/docs/changes/jiraVersionList.json


Total time: 68 minutes 44 seconds

Build step 'Invoke Ant' marked build as failure

Archiving artifacts

[WARNINGS] Skipping publisher since build result is FAILURE

Recording test results

Email was triggered for: Failure - Any

Sending email for trigger: Failure - Any