You are viewing a plain text version of this content. The canonical link for it is here.
Posted to notifications@maven.apache.org by Hudson <Hu...@sonatype.org> on 2010/08/28 15:40:11 UTC
Build failed in Hudson: surefire » 1.5,ubuntu #90
See <http://grid.sonatype.org/ci/job/surefire/./jdk=1.5,label=ubuntu/90/changes>
Changes:
[Benjamin Bentmann] o Fixed IT setup to use proper local repo
------------------------------------------
[...truncated 1667 lines...]
Downloading: http://repository.sonatype.org:8081/content/groups/sonatype-public-grid/org/apache/maven/doxia/doxia-module-xdoc/1.0-alpha-11/doxia-module-xdoc-1.0-alpha-11.pom
2K downloaded (doxia-module-xdoc-1.0-alpha-11.pom)
Downloading: http://repository.sonatype.org:8081/content/groups/sonatype-public-grid/org/apache/maven/doxia/doxia-module-xhtml/1.0-alpha-11/doxia-module-xhtml-1.0-alpha-11.pom
1K downloaded (doxia-module-xhtml-1.0-alpha-11.pom)
Downloading: http://repository.sonatype.org:8081/content/groups/sonatype-public-grid/org/codehaus/groovy/groovy/1.5.6/groovy-1.5.6.pom
24K downloaded (groovy-1.5.6.pom)
Downloading: http://repository.sonatype.org:8081/content/groups/sonatype-public-grid/antlr/antlr/2.7.6/antlr-2.7.6.pom
230b downloaded (antlr-2.7.6.pom)
Downloading: http://repository.sonatype.org:8081/content/groups/sonatype-public-grid/asm/asm/2.2/asm-2.2.pom
807b downloaded (asm-2.2.pom)
Downloading: http://repository.sonatype.org:8081/content/groups/sonatype-public-grid/org/apache/ant/ant/1.7.0/ant-1.7.0.pom
9K downloaded (ant-1.7.0.pom)
Downloading: http://repository.sonatype.org:8081/content/groups/sonatype-public-grid/org/apache/ant/ant-parent/1.7.0/ant-parent-1.7.0.pom
4K downloaded (ant-parent-1.7.0.pom)
Downloading: http://repository.sonatype.org:8081/content/groups/sonatype-public-grid/org/apache/ant/ant-launcher/1.7.0/ant-launcher-1.7.0.pom
2K downloaded (ant-launcher-1.7.0.pom)
Downloading: http://repository.sonatype.org:8081/content/groups/sonatype-public-grid/asm/asm-util/2.2/asm-util-2.2.pom
817b downloaded (asm-util-2.2.pom)
Downloading: http://repository.sonatype.org:8081/content/groups/sonatype-public-grid/asm/asm-analysis/2.2/asm-analysis-2.2.pom
825b downloaded (asm-analysis-2.2.pom)
Downloading: http://repository.sonatype.org:8081/content/groups/sonatype-public-grid/asm/asm-tree/2.2/asm-tree-2.2.pom
817b downloaded (asm-tree-2.2.pom)
Downloading: http://repository.sonatype.org:8081/content/groups/sonatype-public-grid/jline/jline/0.9.94/jline-0.9.94.pom
6K downloaded (jline-0.9.94.pom)
Downloading: http://repository.sonatype.org:8081/content/groups/sonatype-public-grid/org/apache/ant/ant/1.7.1/ant-1.7.1.pom
9K downloaded (ant-1.7.1.pom)
Downloading: http://repository.sonatype.org:8081/content/groups/sonatype-public-grid/org/apache/ant/ant-parent/1.7.1/ant-parent-1.7.1.pom
4K downloaded (ant-parent-1.7.1.pom)
Downloading: http://repository.sonatype.org:8081/content/groups/sonatype-public-grid/org/codehaus/plexus/plexus-interpolation/1.2/plexus-interpolation-1.2.pom
2K downloaded (plexus-interpolation-1.2.pom)
Downloading: http://repository.sonatype.org:8081/content/groups/sonatype-public-grid/org/apache/maven/shared/maven-invoker/2.0.11/maven-invoker-2.0.11.jar
Downloading: http://repository.sonatype.org:8081/content/groups/sonatype-public-grid/antlr/antlr/2.7.6/antlr-2.7.6.jar
Downloading: http://repository.sonatype.org:8081/content/groups/sonatype-public-grid/org/apache/maven/doxia/doxia-core/1.0-alpha-10/doxia-core-1.0-alpha-10.jar
Downloading: http://repository.sonatype.org:8081/content/groups/sonatype-public-grid/jline/jline/0.9.94/jline-0.9.94.jar
Downloading: http://repository.sonatype.org:8081/content/groups/sonatype-public-grid/org/apache/maven/reporting/maven-reporting-impl/2.0.4.1/maven-reporting-impl-2.0.4.1.jar
28K downloaded (maven-invoker-2.0.11.jar)
18K downloaded (maven-reporting-impl-2.0.4.1.jar)
433K downloaded (antlr-2.7.6.jar)
53K downloaded (doxia-core-1.0-alpha-10.jar)
85K downloaded (jline-0.9.94.jar)
Downloading: http://repository.sonatype.org:8081/content/groups/sonatype-public-grid/org/apache/ant/ant/1.7.1/ant-1.7.1.jar
Downloading: http://repository.sonatype.org:8081/content/groups/sonatype-public-grid/org/codehaus/groovy/groovy/1.5.6/groovy-1.5.6.jar
Downloading: http://repository.sonatype.org:8081/content/groups/sonatype-public-grid/asm/asm/2.2/asm-2.2.jar
Downloading: http://repository.sonatype.org:8081/content/groups/sonatype-public-grid/org/apache/maven/doxia/doxia-site-renderer/1.0-alpha-11/doxia-site-renderer-1.0-alpha-11.jar
Downloading: http://repository.sonatype.org:8081/content/groups/sonatype-public-grid/org/codehaus/plexus/plexus-interpolation/1.2/plexus-interpolation-1.2.jar
33K downloaded (asm-2.2.jar)
44K downloaded (doxia-site-renderer-1.0-alpha-11.jar)
35K downloaded (plexus-interpolation-1.2.jar)
1291K downloaded (ant-1.7.1.jar)
Downloading: http://repository.sonatype.org:8081/content/groups/sonatype-public-grid/asm/asm-util/2.2/asm-util-2.2.jar
Downloading: http://repository.sonatype.org:8081/content/groups/sonatype-public-grid/org/apache/maven/doxia/doxia-decoration-model/1.0-alpha-11/doxia-decoration-model-1.0-alpha-11.jar
Downloading: http://repository.sonatype.org:8081/content/groups/sonatype-public-grid/org/apache/ant/ant-launcher/1.7.0/ant-launcher-1.7.0.jar
2251K downloaded (groovy-1.5.6.jar)
32K downloaded (asm-util-2.2.jar)
48K downloaded (doxia-decoration-model-1.0-alpha-11.jar)
11K downloaded (ant-launcher-1.7.0.jar)
Downloading: http://repository.sonatype.org:8081/content/groups/sonatype-public-grid/asm/asm-analysis/2.2/asm-analysis-2.2.jar
Downloading: http://repository.sonatype.org:8081/content/groups/sonatype-public-grid/org/apache/maven/doxia/doxia-module-apt/1.0-alpha-11/doxia-module-apt-1.0-alpha-11.jar
17K downloaded (asm-analysis-2.2.jar)
45K downloaded (doxia-module-apt-1.0-alpha-11.jar)
Downloading: http://repository.sonatype.org:8081/content/groups/sonatype-public-grid/asm/asm-tree/2.2/asm-tree-2.2.jar
Downloading: http://repository.sonatype.org:8081/content/groups/sonatype-public-grid/org/apache/maven/doxia/doxia-module-fml/1.0-alpha-11/doxia-module-fml-1.0-alpha-11.jar
15K downloaded (asm-tree-2.2.jar)
17K downloaded (doxia-module-fml-1.0-alpha-11.jar)
Downloading: http://repository.sonatype.org:8081/content/groups/sonatype-public-grid/org/apache/maven/doxia/doxia-module-xdoc/1.0-alpha-11/doxia-module-xdoc-1.0-alpha-11.jar
26K downloaded (doxia-module-xdoc-1.0-alpha-11.jar)
Downloading: http://repository.sonatype.org:8081/content/groups/sonatype-public-grid/org/apache/maven/doxia/doxia-module-xhtml/1.0-alpha-11/doxia-module-xhtml-1.0-alpha-11.jar
20K downloaded (doxia-module-xhtml-1.0-alpha-11.jar)
[INFO] [invoker:install {execution: default}]
[INFO] Installing <http://grid.sonatype.org/ci/job/surefire/./jdk=1.5,label=ubuntu/ws/trunk/maven-surefire-report-plugin/pom.xml> to <http://grid.sonatype.org/ci/job/surefire/./jdk=1.5,label=ubuntu/ws/trunk/surefire-integration-tests/target/it-repo/org/apache/maven/plugins/maven-surefire-report-plugin/2.7-SNAPSHOT/maven-surefire-report-plugin-2.7-SNAPSHOT.pom>
[INFO] Installing <http://grid.sonatype.org/ci/job/surefire/./jdk=1.5,label=ubuntu/ws/trunk/maven-surefire-report-plugin/target/maven-surefire-report-plugin-2.7-SNAPSHOT.jar> to <http://grid.sonatype.org/ci/job/surefire/./jdk=1.5,label=ubuntu/ws/trunk/surefire-integration-tests/target/it-repo/org/apache/maven/plugins/maven-surefire-report-plugin/2.7-SNAPSHOT/maven-surefire-report-plugin-2.7-20100828.135705-8.jar>
[INFO] Installing <http://grid.sonatype.org/ci/job/surefire/./jdk=1.5,label=ubuntu/ws/trunk/pom.xml> to <http://grid.sonatype.org/ci/job/surefire/./jdk=1.5,label=ubuntu/ws/trunk/surefire-integration-tests/target/it-repo/org/apache/maven/surefire/surefire/2.7-SNAPSHOT/surefire-2.7-20100828.135705-8.pom>
[INFO] Installing <http://grid.sonatype.org/ci/job/surefire/./jdk=1.5,label=ubuntu/ws/trunk/maven-surefire-plugin/pom.xml> to <http://grid.sonatype.org/ci/job/surefire/./jdk=1.5,label=ubuntu/ws/trunk/surefire-integration-tests/target/it-repo/org/apache/maven/plugins/maven-surefire-plugin/2.7-SNAPSHOT/maven-surefire-plugin-2.7-SNAPSHOT.pom>
[INFO] Installing <http://grid.sonatype.org/ci/job/surefire/./jdk=1.5,label=ubuntu/ws/trunk/maven-surefire-plugin/target/maven-surefire-plugin-2.7-SNAPSHOT.jar> to <http://grid.sonatype.org/ci/job/surefire/./jdk=1.5,label=ubuntu/ws/trunk/surefire-integration-tests/target/it-repo/org/apache/maven/plugins/maven-surefire-plugin/2.7-SNAPSHOT/maven-surefire-plugin-2.7-20100828.135705-8.jar>
[INFO] Installing <http://grid.sonatype.org/ci/job/surefire/./jdk=1.5,label=ubuntu/ws/trunk/surefire-booter/target/dependency-reduced-pom.xml> to <http://grid.sonatype.org/ci/job/surefire/./jdk=1.5,label=ubuntu/ws/trunk/surefire-integration-tests/target/it-repo/org/apache/maven/surefire/surefire-booter/2.7-SNAPSHOT/surefire-booter-2.7-SNAPSHOT.pom>
[INFO] Installing <http://grid.sonatype.org/ci/job/surefire/./jdk=1.5,label=ubuntu/ws/trunk/surefire-booter/target/surefire-booter-2.7-SNAPSHOT.jar> to <http://grid.sonatype.org/ci/job/surefire/./jdk=1.5,label=ubuntu/ws/trunk/surefire-integration-tests/target/it-repo/org/apache/maven/surefire/surefire-booter/2.7-SNAPSHOT/surefire-booter-2.7-20100828.135705-8.jar>
[INFO] Installing <http://grid.sonatype.org/ci/job/surefire/./jdk=1.5,label=ubuntu/ws/trunk/surefire-api/target/dependency-reduced-pom.xml> to <http://grid.sonatype.org/ci/job/surefire/./jdk=1.5,label=ubuntu/ws/trunk/surefire-integration-tests/target/it-repo/org/apache/maven/surefire/surefire-api/2.7-SNAPSHOT/surefire-api-2.7-SNAPSHOT.pom>
[INFO] Installing <http://grid.sonatype.org/ci/job/surefire/./jdk=1.5,label=ubuntu/ws/trunk/surefire-api/target/surefire-api-2.7-SNAPSHOT.jar> to <http://grid.sonatype.org/ci/job/surefire/./jdk=1.5,label=ubuntu/ws/trunk/surefire-integration-tests/target/it-repo/org/apache/maven/surefire/surefire-api/2.7-SNAPSHOT/surefire-api-2.7-20100828.135705-8.jar>
[INFO] Installing <http://grid.sonatype.org/ci/job/surefire/./jdk=1.5,label=ubuntu/ws/trunk/maven-surefire-common/pom.xml> to <http://grid.sonatype.org/ci/job/surefire/./jdk=1.5,label=ubuntu/ws/trunk/surefire-integration-tests/target/it-repo/org/apache/maven/surefire/maven-surefire-common/2.7-SNAPSHOT/maven-surefire-common-2.7-SNAPSHOT.pom>
[INFO] Installing <http://grid.sonatype.org/ci/job/surefire/./jdk=1.5,label=ubuntu/ws/trunk/maven-surefire-common/target/maven-surefire-common-2.7-SNAPSHOT.jar> to <http://grid.sonatype.org/ci/job/surefire/./jdk=1.5,label=ubuntu/ws/trunk/surefire-integration-tests/target/it-repo/org/apache/maven/surefire/maven-surefire-common/2.7-SNAPSHOT/maven-surefire-common-2.7-20100828.135705-8.jar>
[INFO] Installing <http://grid.sonatype.org/ci/job/surefire/./jdk=1.5,label=ubuntu/ws/trunk/surefire-providers/surefire-testng/pom.xml> to <http://grid.sonatype.org/ci/job/surefire/./jdk=1.5,label=ubuntu/ws/trunk/surefire-integration-tests/target/it-repo/org/apache/maven/surefire/surefire-testng/2.7-SNAPSHOT/surefire-testng-2.7-SNAPSHOT.pom>
[INFO] Installing <http://grid.sonatype.org/ci/job/surefire/./jdk=1.5,label=ubuntu/ws/trunk/surefire-providers/surefire-testng/target/surefire-testng-2.7-SNAPSHOT.jar> to <http://grid.sonatype.org/ci/job/surefire/./jdk=1.5,label=ubuntu/ws/trunk/surefire-integration-tests/target/it-repo/org/apache/maven/surefire/surefire-testng/2.7-SNAPSHOT/surefire-testng-2.7-20100828.135705-8.jar>
[INFO] Installing <http://grid.sonatype.org/ci/job/surefire/./jdk=1.5,label=ubuntu/ws/trunk/surefire-providers/pom.xml> to <http://grid.sonatype.org/ci/job/surefire/./jdk=1.5,label=ubuntu/ws/trunk/surefire-integration-tests/target/it-repo/org/apache/maven/surefire/surefire-providers/2.7-SNAPSHOT/surefire-providers-2.7-20100828.135705-8.pom>
[INFO] Installing <http://grid.sonatype.org/ci/job/surefire/./jdk=1.5,label=ubuntu/ws/trunk/surefire-providers/surefire-junit/pom.xml> to <http://grid.sonatype.org/ci/job/surefire/./jdk=1.5,label=ubuntu/ws/trunk/surefire-integration-tests/target/it-repo/org/apache/maven/surefire/surefire-junit/2.7-SNAPSHOT/surefire-junit-2.7-SNAPSHOT.pom>
[INFO] Installing <http://grid.sonatype.org/ci/job/surefire/./jdk=1.5,label=ubuntu/ws/trunk/surefire-providers/surefire-junit/target/surefire-junit-2.7-SNAPSHOT.jar> to <http://grid.sonatype.org/ci/job/surefire/./jdk=1.5,label=ubuntu/ws/trunk/surefire-integration-tests/target/it-repo/org/apache/maven/surefire/surefire-junit/2.7-SNAPSHOT/surefire-junit-2.7-20100828.135705-8.jar>
[INFO] Installing <http://grid.sonatype.org/ci/job/surefire/./jdk=1.5,label=ubuntu/ws/trunk/surefire-providers/surefire-junit4/pom.xml> to <http://grid.sonatype.org/ci/job/surefire/./jdk=1.5,label=ubuntu/ws/trunk/surefire-integration-tests/target/it-repo/org/apache/maven/surefire/surefire-junit4/2.7-SNAPSHOT/surefire-junit4-2.7-SNAPSHOT.pom>
[INFO] Installing <http://grid.sonatype.org/ci/job/surefire/./jdk=1.5,label=ubuntu/ws/trunk/surefire-providers/surefire-junit4/target/surefire-junit4-2.7-SNAPSHOT.jar> to <http://grid.sonatype.org/ci/job/surefire/./jdk=1.5,label=ubuntu/ws/trunk/surefire-integration-tests/target/it-repo/org/apache/maven/surefire/surefire-junit4/2.7-SNAPSHOT/surefire-junit4-2.7-20100828.135705-8.jar>
[INFO] Installing <http://grid.sonatype.org/ci/job/surefire/./jdk=1.5,label=ubuntu/ws/trunk/surefire-providers/surefire-junit47/pom.xml> to <http://grid.sonatype.org/ci/job/surefire/./jdk=1.5,label=ubuntu/ws/trunk/surefire-integration-tests/target/it-repo/org/apache/maven/surefire/surefire-junit47/2.7-SNAPSHOT/surefire-junit47-2.7-SNAPSHOT.pom>
[INFO] Installing <http://grid.sonatype.org/ci/job/surefire/./jdk=1.5,label=ubuntu/ws/trunk/surefire-providers/surefire-junit47/target/surefire-junit47-2.7-SNAPSHOT.jar> to <http://grid.sonatype.org/ci/job/surefire/./jdk=1.5,label=ubuntu/ws/trunk/surefire-integration-tests/target/it-repo/org/apache/maven/surefire/surefire-junit47/2.7-SNAPSHOT/surefire-junit47-2.7-20100828.135705-8.jar>
[INFO] Installing <http://grid.sonatype.org/ci/job/surefire/./jdk=1.5,label=ubuntu/ws/trunk/surefire-integration-tests/pom.xml> to <http://grid.sonatype.org/ci/job/surefire/./jdk=1.5,label=ubuntu/ws/trunk/surefire-integration-tests/target/it-repo/org/apache/maven/surefire/surefire-integration-tests/2.7-SNAPSHOT/surefire-integration-tests-2.7-SNAPSHOT.pom>
[INFO] Installing <http://grid.sonatype.org/ci/job/surefire/./jdk=1.5,label=ubuntu/ws/trunk/surefire-integration-tests/target/surefire-integration-tests-2.7-SNAPSHOT.jar> to <http://grid.sonatype.org/ci/job/surefire/./jdk=1.5,label=ubuntu/ws/trunk/surefire-integration-tests/target/it-repo/org/apache/maven/surefire/surefire-integration-tests/2.7-SNAPSHOT/surefire-integration-tests-2.7-SNAPSHOT.jar>
[WARNING] DEPRECATED [systemProperties]: Use systemPropertyVariables instead.
[INFO] [failsafe:integration-test {execution: default}]
[INFO] Failsafe report directory: <http://grid.sonatype.org/ci/job/surefire/./jdk=1.5,label=ubuntu/ws/trunk/surefire-integration-tests/target/failsafe-reports>
-------------------------------------------------------
T E S T S
-------------------------------------------------------
Running org.apache.maven.surefire.its.TwoTestCasesIT
Tests run: 4, Failures: 0, Errors: 0, Skipped: 0, Time elapsed: 24.544 sec
Running org.apache.maven.surefire.its.UseIsolatedClassLoaderIT
Tests run: 1, Failures: 0, Errors: 0, Skipped: 0, Time elapsed: 5.257 sec
Running org.apache.maven.surefire.its.AdditionalClasspathIT
Tests run: 1, Failures: 0, Errors: 0, Skipped: 0, Time elapsed: 5.117 sec
Running org.apache.maven.surefire.its.PlexusConflictIT
Tests run: 2, Failures: 0, Errors: 0, Skipped: 0, Time elapsed: 11.243 sec
Running org.apache.maven.surefire.its.CheckTestNgBeforeMethodFailureIT
Tests run: 1, Failures: 0, Errors: 0, Skipped: 0, Time elapsed: 5.924 sec
Running org.apache.maven.surefire.its.CheckSingleTestIT
Tests run: 4, Failures: 0, Errors: 0, Skipped: 0, Time elapsed: 21.695 sec
Running org.apache.maven.surefire.its.Surefire44InnerClassTestIT
Tests run: 1, Failures: 0, Errors: 0, Skipped: 0, Time elapsed: 5.425 sec
Running org.apache.maven.surefire.its.WorkingDirectoryIT
Tests run: 4, Failures: 0, Errors: 0, Skipped: 0, Time elapsed: 16.287 sec
Running org.apache.maven.surefire.its.CheckTestNgSuiteXmlIT
Tests run: 2, Failures: 0, Errors: 0, Skipped: 0, Time elapsed: 10.908 sec
Running org.apache.maven.surefire.its.ClasspathFilteringIT
Tests run: 1, Failures: 0, Errors: 0, Skipped: 0, Time elapsed: 6.195 sec
Running org.apache.maven.surefire.its.PlainOldJavaClasspathIT
Tests run: 1, Failures: 0, Errors: 0, Skipped: 0, Time elapsed: 5.957 sec
Running org.apache.maven.surefire.its.Surefire42NotExtendingTestCaseIT
Tests run: 1, Failures: 0, Errors: 0, Skipped: 0, Time elapsed: 5.887 sec
Running org.apache.maven.surefire.its.CheckTestFailIfNoTestsForkModeIT
Tests run: 6, Failures: 0, Errors: 0, Skipped: 0, Time elapsed: 35.299 sec
Running org.apache.maven.surefire.its.CheckTestNgJdk14IT
Tests run: 1, Failures: 0, Errors: 0, Skipped: 0, Time elapsed: 5.766 sec
Running org.apache.maven.surefire.its.ForkModeIT
Tests run: 5, Failures: 0, Errors: 0, Skipped: 0, Time elapsed: 27.894 sec
Running org.apache.maven.surefire.its.Junit4VersionsIT
Tests run: 9, Failures: 0, Errors: 0, Skipped: 0, Time elapsed: 52.676 sec
Running org.apache.maven.surefire.its.Surefire621TestCountingJunit3InParallelIT
Tests run: 1, Failures: 0, Errors: 0, Skipped: 0, Time elapsed: 7.395 sec
Running org.apache.maven.surefire.its.PojoSimpleIT
Tests run: 1, Failures: 0, Errors: 0, Skipped: 0, Time elapsed: 5.364 sec
Running org.apache.maven.surefire.its.Surefire162CharsetProviderIT
Tests run: 1, Failures: 0, Errors: 0, Skipped: 0, Time elapsed: 5.389 sec
Running org.apache.maven.surefire.its.CheckTestNgBeforeMethodIT
Tests run: 1, Failures: 0, Errors: 0, Skipped: 0, Time elapsed: 5.459 sec
Running org.apache.maven.surefire.its.CheckTestNgPathWithSpacesIT
Tests run: 1, Failures: 0, Errors: 0, Skipped: 0, Time elapsed: 5.664 sec
Running org.apache.maven.surefire.its.CheckTestNgListenerReporterIT
Tests run: 1, Failures: 0, Errors: 0, Skipped: 0, Time elapsed: 5.51 sec
Running org.apache.maven.surefire.its.EnvironmentVariableIT
Tests run: 1, Failures: 0, Errors: 0, Skipped: 0, Time elapsed: 5.461 sec
Running org.apache.maven.surefire.its.CheckTestFailIfNoTestsIT
Tests run: 2, Failures: 0, Errors: 0, Skipped: 0, Time elapsed: 9.958 sec
Running org.apache.maven.surefire.its.IncludesExcludesIT
Tests run: 1, Failures: 0, Errors: 0, Skipped: 0, Time elapsed: 5.974 sec
Running org.apache.maven.surefire.its.JUnit44HamcrestIT
Tests run: 1, Failures: 0, Errors: 0, Skipped: 0, Time elapsed: 6.061 sec
Running org.apache.maven.surefire.its.AbstractTestCaseIT
Tests run: 1, Failures: 0, Errors: 0, Skipped: 0, Time elapsed: 7.389 sec
Running org.apache.maven.surefire.its.ArgLineIT
Tests run: 1, Failures: 0, Errors: 0, Skipped: 0, Time elapsed: 5.586 sec
Running org.apache.maven.surefire.its.Surefire628ConsoleOutputBeforeAndAfterClassIT
Tests run: 1, Failures: 0, Errors: 0, Skipped: 0, Time elapsed: 5.525 sec
Running org.apache.maven.surefire.its.JUnit4ForkAlwaysStaticInitPollutionIT
Tests run: 1, Failures: 0, Errors: 0, Skipped: 0, Time elapsed: 5.826 sec
Running org.apache.maven.surefire.its.Surefire377TestNgAndJUnitTogetherIT
Tests run: 1, Failures: 0, Errors: 0, Skipped: 0, Time elapsed: 5.767 sec
Running org.apache.maven.surefire.its.DefaultConfigurationIT
Tests run: 1, Failures: 0, Errors: 0, Skipped: 0, Time elapsed: 5.737 sec
Running org.apache.maven.surefire.its.ClassPathOrderIT
Tests run: 1, Failures: 0, Errors: 0, Skipped: 0, Time elapsed: 7.642 sec
Running org.apache.maven.surefire.its.Junit4IgnoreIT
Tests run: 1, Failures: 0, Errors: 0, Skipped: 0, Time elapsed: 6.493 sec
Running org.apache.maven.surefire.its.CheckTestNgExecuteErrorIT
Tests run: 1, Failures: 0, Errors: 0, Skipped: 0, Time elapsed: 5.832 sec
Running org.apache.maven.surefire.its.TimeoutForkedTestIT
Tests run: 1, Failures: 0, Errors: 0, Skipped: 0, Time elapsed: 8.451 sec
Running org.apache.maven.surefire.its.Surefire146ForkPerTestNoSetupIT
Tests run: 1, Failures: 0, Errors: 0, Skipped: 0, Time elapsed: 5.875 sec
Running org.apache.maven.surefire.its.SystemPropertiesTestIT
Tests run: 2, Failures: 0, Errors: 0, Skipped: 0, Time elapsed: 12.745 sec
Running org.apache.maven.surefire.its.CheckTestNgGroupThreadParallelIT
Tests run: 1, Failures: 0, Errors: 0, Skipped: 0, Time elapsed: 5.609 sec
Running org.apache.maven.surefire.its.Surefire613TestCountInParallelIT
Tests run: 1, Failures: 0, Errors: 0, Skipped: 0, Time elapsed: 5.4 sec
Running org.apache.maven.surefire.its.Junit47concurrencyIT
Tests run: 1, Failures: 0, Errors: 0, Skipped: 0, Time elapsed: 6.784 sec
Running org.apache.maven.surefire.its.SiblingAggregatorIT
Tests run: 1, Failures: 0, Errors: 0, Skipped: 0, Time elapsed: 4.431 sec
Running org.apache.maven.surefire.its.AggregateReportIT
Tests run: 1, Failures: 0, Errors: 1, Skipped: 0, Time elapsed: 3.859 sec <<< FAILURE!
Running org.apache.maven.surefire.its.CheckTestNgReportTestIT
Tests run: 1, Failures: 0, Errors: 0, Skipped: 0, Time elapsed: 7.35 sec
Running org.apache.maven.surefire.its.CheckTestNgSuiteXmlSingleIT
Tests run: 1, Failures: 0, Errors: 0, Skipped: 0, Time elapsed: 5.296 sec
Running org.apache.maven.surefire.its.CheckTestNgVersionsIT
Tests run: 6, Failures: 0, Errors: 0, Skipped: 0, Time elapsed: 35.018 sec
Running org.apache.maven.surefire.its.Surefire224WellFormedXmlFailuresIT
Tests run: 1, Failures: 0, Errors: 0, Skipped: 0, Time elapsed: 5.332 sec
Running org.apache.maven.surefire.its.ClasspathScopeFilteringIT
Tests run: 1, Failures: 0, Errors: 0, Skipped: 0, Time elapsed: 5.44 sec
Running org.apache.maven.surefire.its.WorkingDirectoryMissingIT
Tests run: 1, Failures: 0, Errors: 0, Skipped: 0, Time elapsed: 5.319 sec
Running org.apache.maven.surefire.its.UmlautDirIT
Tests run: 2, Failures: 0, Errors: 0, Skipped: 0, Time elapsed: 10.675 sec
Results :
Tests in error:
testAggregateReport(org.apache.maven.surefire.its.AggregateReportIT)
Tests run: 86, Failures: 0, Errors: 1, Skipped: 0
[INFO] [failsafe:verify {execution: default}]
[INFO] Failsafe report directory: <http://grid.sonatype.org/ci/job/surefire/./jdk=1.5,label=ubuntu/ws/trunk/surefire-integration-tests/target/failsafe-reports>
[INFO] ------------------------------------------------------------------------
[ERROR] BUILD FAILURE
[INFO] ------------------------------------------------------------------------
[INFO] There are test failures.
Please refer to <http://grid.sonatype.org/ci/job/surefire/./jdk=1.5,label=ubuntu/ws/trunk/surefire-integration-tests/target/failsafe-reports> for the individual test results.
[INFO] ------------------------------------------------------------------------
[INFO] Trace
org.apache.maven.BuildFailureException: There are test failures.
Please refer to <http://grid.sonatype.org/ci/job/surefire/./jdk=1.5,label=ubuntu/ws/trunk/surefire-integration-tests/target/failsafe-reports> for the individual test results.
at org.apache.maven.lifecycle.DefaultLifecycleExecutor.executeGoals(DefaultLifecycleExecutor.java:715)
at org.apache.maven.lifecycle.DefaultLifecycleExecutor.executeGoalWithLifecycle(DefaultLifecycleExecutor.java:556)
at org.apache.maven.lifecycle.DefaultLifecycleExecutor.executeGoal(DefaultLifecycleExecutor.java:535)
at org.apache.maven.lifecycle.DefaultLifecycleExecutor.executeGoalAndHandleFailures(DefaultLifecycleExecutor.java:387)
at org.apache.maven.lifecycle.DefaultLifecycleExecutor.executeTaskSegments(DefaultLifecycleExecutor.java:348)
at org.apache.maven.lifecycle.DefaultLifecycleExecutor.execute(DefaultLifecycleExecutor.java:180)
at org.apache.maven.DefaultMaven.doExecute(DefaultMaven.java:328)
at org.apache.maven.DefaultMaven.execute(DefaultMaven.java:138)
at org.apache.maven.cli.MavenCli.main(MavenCli.java:362)
at org.apache.maven.cli.compat.CompatibleMain.main(CompatibleMain.java:60)
at sun.reflect.NativeMethodAccessorImpl.invoke0(Native Method)
at sun.reflect.NativeMethodAccessorImpl.invoke(NativeMethodAccessorImpl.java:39)
at sun.reflect.DelegatingMethodAccessorImpl.invoke(DelegatingMethodAccessorImpl.java:25)
at java.lang.reflect.Method.invoke(Method.java:597)
at org.codehaus.classworlds.Launcher.launchEnhanced(Launcher.java:315)
at org.codehaus.classworlds.Launcher.launch(Launcher.java:255)
at org.codehaus.classworlds.Launcher.mainWithExitCode(Launcher.java:430)
at org.codehaus.classworlds.Launcher.main(Launcher.java:375)
Caused by: org.apache.maven.plugin.MojoFailureException: There are test failures.
Please refer to <http://grid.sonatype.org/ci/job/surefire/./jdk=1.5,label=ubuntu/ws/trunk/surefire-integration-tests/target/failsafe-reports> for the individual test results.
at org.apache.maven.plugin.failsafe.VerifyMojo.execute(VerifyMojo.java:217)
at org.apache.maven.plugin.DefaultPluginManager.executeMojo(DefaultPluginManager.java:490)
at org.apache.maven.lifecycle.DefaultLifecycleExecutor.executeGoals(DefaultLifecycleExecutor.java:694)
... 17 more
[INFO] ------------------------------------------------------------------------
[INFO] Total time: 10 minutes 49 seconds
[INFO] Finished at: Sat Aug 28 09:07:25 CDT 2010
[INFO] Final Memory: 41M/121M
[INFO] ------------------------------------------------------------------------
Hudson build is back to normal : surefire » 1.5,ubuntu #92
Posted by Hudson <Hu...@sonatype.org>.
See <http://grid.sonatype.org/ci/job/surefire/./jdk=1.5,label=ubuntu/92/changes>
Build failed in Hudson: surefire » 1.5,ubuntu #91
Posted by Hudson <Hu...@sonatype.org>.
See <http://grid.sonatype.org/ci/job/surefire/./jdk=1.5,label=ubuntu/91/>
------------------------------------------
[...truncated 1665 lines...]
Downloading: http://repository.sonatype.org:8081/content/groups/sonatype-public-grid/org/apache/maven/doxia/doxia-module-xdoc/1.0-alpha-11/doxia-module-xdoc-1.0-alpha-11.pom
2K downloaded (doxia-module-xdoc-1.0-alpha-11.pom)
Downloading: http://repository.sonatype.org:8081/content/groups/sonatype-public-grid/org/apache/maven/doxia/doxia-module-xhtml/1.0-alpha-11/doxia-module-xhtml-1.0-alpha-11.pom
1K downloaded (doxia-module-xhtml-1.0-alpha-11.pom)
Downloading: http://repository.sonatype.org:8081/content/groups/sonatype-public-grid/org/codehaus/groovy/groovy/1.5.6/groovy-1.5.6.pom
24K downloaded (groovy-1.5.6.pom)
Downloading: http://repository.sonatype.org:8081/content/groups/sonatype-public-grid/antlr/antlr/2.7.6/antlr-2.7.6.pom
230b downloaded (antlr-2.7.6.pom)
Downloading: http://repository.sonatype.org:8081/content/groups/sonatype-public-grid/asm/asm/2.2/asm-2.2.pom
807b downloaded (asm-2.2.pom)
Downloading: http://repository.sonatype.org:8081/content/groups/sonatype-public-grid/org/apache/ant/ant/1.7.0/ant-1.7.0.pom
9K downloaded (ant-1.7.0.pom)
Downloading: http://repository.sonatype.org:8081/content/groups/sonatype-public-grid/org/apache/ant/ant-parent/1.7.0/ant-parent-1.7.0.pom
4K downloaded (ant-parent-1.7.0.pom)
Downloading: http://repository.sonatype.org:8081/content/groups/sonatype-public-grid/org/apache/ant/ant-launcher/1.7.0/ant-launcher-1.7.0.pom
2K downloaded (ant-launcher-1.7.0.pom)
Downloading: http://repository.sonatype.org:8081/content/groups/sonatype-public-grid/asm/asm-util/2.2/asm-util-2.2.pom
817b downloaded (asm-util-2.2.pom)
Downloading: http://repository.sonatype.org:8081/content/groups/sonatype-public-grid/asm/asm-analysis/2.2/asm-analysis-2.2.pom
825b downloaded (asm-analysis-2.2.pom)
Downloading: http://repository.sonatype.org:8081/content/groups/sonatype-public-grid/asm/asm-tree/2.2/asm-tree-2.2.pom
817b downloaded (asm-tree-2.2.pom)
Downloading: http://repository.sonatype.org:8081/content/groups/sonatype-public-grid/jline/jline/0.9.94/jline-0.9.94.pom
6K downloaded (jline-0.9.94.pom)
Downloading: http://repository.sonatype.org:8081/content/groups/sonatype-public-grid/org/apache/ant/ant/1.7.1/ant-1.7.1.pom
9K downloaded (ant-1.7.1.pom)
Downloading: http://repository.sonatype.org:8081/content/groups/sonatype-public-grid/org/apache/ant/ant-parent/1.7.1/ant-parent-1.7.1.pom
4K downloaded (ant-parent-1.7.1.pom)
Downloading: http://repository.sonatype.org:8081/content/groups/sonatype-public-grid/org/codehaus/plexus/plexus-interpolation/1.2/plexus-interpolation-1.2.pom
2K downloaded (plexus-interpolation-1.2.pom)
Downloading: http://repository.sonatype.org:8081/content/groups/sonatype-public-grid/antlr/antlr/2.7.6/antlr-2.7.6.jar
Downloading: http://repository.sonatype.org:8081/content/groups/sonatype-public-grid/org/apache/maven/doxia/doxia-core/1.0-alpha-10/doxia-core-1.0-alpha-10.jar
Downloading: http://repository.sonatype.org:8081/content/groups/sonatype-public-grid/org/apache/maven/shared/maven-invoker/2.0.11/maven-invoker-2.0.11.jar
Downloading: http://repository.sonatype.org:8081/content/groups/sonatype-public-grid/jline/jline/0.9.94/jline-0.9.94.jar
Downloading: http://repository.sonatype.org:8081/content/groups/sonatype-public-grid/org/apache/maven/reporting/maven-reporting-impl/2.0.4.1/maven-reporting-impl-2.0.4.1.jar
18K downloaded (maven-reporting-impl-2.0.4.1.jar)
28K downloaded (maven-invoker-2.0.11.jar)
85K downloaded (jline-0.9.94.jar)
53K downloaded (doxia-core-1.0-alpha-10.jar)
433K downloaded (antlr-2.7.6.jar)
Downloading: http://repository.sonatype.org:8081/content/groups/sonatype-public-grid/org/apache/ant/ant/1.7.1/ant-1.7.1.jar
Downloading: http://repository.sonatype.org:8081/content/groups/sonatype-public-grid/org/codehaus/groovy/groovy/1.5.6/groovy-1.5.6.jar
Downloading: http://repository.sonatype.org:8081/content/groups/sonatype-public-grid/asm/asm/2.2/asm-2.2.jar
Downloading: http://repository.sonatype.org:8081/content/groups/sonatype-public-grid/org/apache/maven/doxia/doxia-site-renderer/1.0-alpha-11/doxia-site-renderer-1.0-alpha-11.jar
Downloading: http://repository.sonatype.org:8081/content/groups/sonatype-public-grid/org/codehaus/plexus/plexus-interpolation/1.2/plexus-interpolation-1.2.jar
44K downloaded (doxia-site-renderer-1.0-alpha-11.jar)
33K downloaded (asm-2.2.jar)
35K downloaded (plexus-interpolation-1.2.jar)
Downloading: http://repository.sonatype.org:8081/content/groups/sonatype-public-grid/asm/asm-util/2.2/asm-util-2.2.jar
Downloading: http://repository.sonatype.org:8081/content/groups/sonatype-public-grid/org/apache/maven/doxia/doxia-decoration-model/1.0-alpha-11/doxia-decoration-model-1.0-alpha-11.jar
32K downloaded (asm-util-2.2.jar)
Downloading: http://repository.sonatype.org:8081/content/groups/sonatype-public-grid/asm/asm-analysis/2.2/asm-analysis-2.2.jar
48K downloaded (doxia-decoration-model-1.0-alpha-11.jar)
17K downloaded (asm-analysis-2.2.jar)
Downloading: http://repository.sonatype.org:8081/content/groups/sonatype-public-grid/org/apache/maven/doxia/doxia-module-apt/1.0-alpha-11/doxia-module-apt-1.0-alpha-11.jar
Downloading: http://repository.sonatype.org:8081/content/groups/sonatype-public-grid/asm/asm-tree/2.2/asm-tree-2.2.jar
15K downloaded (asm-tree-2.2.jar)
45K downloaded (doxia-module-apt-1.0-alpha-11.jar)
Downloading: http://repository.sonatype.org:8081/content/groups/sonatype-public-grid/org/apache/maven/doxia/doxia-module-fml/1.0-alpha-11/doxia-module-fml-1.0-alpha-11.jar
17K downloaded (doxia-module-fml-1.0-alpha-11.jar)
Downloading: http://repository.sonatype.org:8081/content/groups/sonatype-public-grid/org/apache/maven/doxia/doxia-module-xdoc/1.0-alpha-11/doxia-module-xdoc-1.0-alpha-11.jar
26K downloaded (doxia-module-xdoc-1.0-alpha-11.jar)
1291K downloaded (ant-1.7.1.jar)
Downloading: http://repository.sonatype.org:8081/content/groups/sonatype-public-grid/org/apache/maven/doxia/doxia-module-xhtml/1.0-alpha-11/doxia-module-xhtml-1.0-alpha-11.jar
Downloading: http://repository.sonatype.org:8081/content/groups/sonatype-public-grid/org/apache/ant/ant-launcher/1.7.0/ant-launcher-1.7.0.jar
2251K downloaded (groovy-1.5.6.jar)
11K downloaded (ant-launcher-1.7.0.jar)
20K downloaded (doxia-module-xhtml-1.0-alpha-11.jar)
[INFO] [invoker:install {execution: default}]
[INFO] Installing <http://grid.sonatype.org/ci/job/surefire/./jdk=1.5,label=ubuntu/ws/trunk/maven-surefire-report-plugin/pom.xml> to <http://grid.sonatype.org/ci/job/surefire/./jdk=1.5,label=ubuntu/ws/trunk/surefire-integration-tests/target/it-repo/org/apache/maven/plugins/maven-surefire-report-plugin/2.7-SNAPSHOT/maven-surefire-report-plugin-2.7-SNAPSHOT.pom>
[INFO] Installing <http://grid.sonatype.org/ci/job/surefire/./jdk=1.5,label=ubuntu/ws/trunk/maven-surefire-report-plugin/target/maven-surefire-report-plugin-2.7-SNAPSHOT.jar> to <http://grid.sonatype.org/ci/job/surefire/./jdk=1.5,label=ubuntu/ws/trunk/surefire-integration-tests/target/it-repo/org/apache/maven/plugins/maven-surefire-report-plugin/2.7-SNAPSHOT/maven-surefire-report-plugin-2.7-20100828.151007-9.jar>
[INFO] Installing <http://grid.sonatype.org/ci/job/surefire/./jdk=1.5,label=ubuntu/ws/trunk/pom.xml> to <http://grid.sonatype.org/ci/job/surefire/./jdk=1.5,label=ubuntu/ws/trunk/surefire-integration-tests/target/it-repo/org/apache/maven/surefire/surefire/2.7-SNAPSHOT/surefire-2.7-20100828.151007-9.pom>
[INFO] Installing <http://grid.sonatype.org/ci/job/surefire/./jdk=1.5,label=ubuntu/ws/trunk/maven-surefire-plugin/pom.xml> to <http://grid.sonatype.org/ci/job/surefire/./jdk=1.5,label=ubuntu/ws/trunk/surefire-integration-tests/target/it-repo/org/apache/maven/plugins/maven-surefire-plugin/2.7-SNAPSHOT/maven-surefire-plugin-2.7-SNAPSHOT.pom>
[INFO] Installing <http://grid.sonatype.org/ci/job/surefire/./jdk=1.5,label=ubuntu/ws/trunk/maven-surefire-plugin/target/maven-surefire-plugin-2.7-SNAPSHOT.jar> to <http://grid.sonatype.org/ci/job/surefire/./jdk=1.5,label=ubuntu/ws/trunk/surefire-integration-tests/target/it-repo/org/apache/maven/plugins/maven-surefire-plugin/2.7-SNAPSHOT/maven-surefire-plugin-2.7-20100828.151007-9.jar>
[INFO] Installing <http://grid.sonatype.org/ci/job/surefire/./jdk=1.5,label=ubuntu/ws/trunk/surefire-booter/target/dependency-reduced-pom.xml> to <http://grid.sonatype.org/ci/job/surefire/./jdk=1.5,label=ubuntu/ws/trunk/surefire-integration-tests/target/it-repo/org/apache/maven/surefire/surefire-booter/2.7-SNAPSHOT/surefire-booter-2.7-SNAPSHOT.pom>
[INFO] Installing <http://grid.sonatype.org/ci/job/surefire/./jdk=1.5,label=ubuntu/ws/trunk/surefire-booter/target/surefire-booter-2.7-SNAPSHOT.jar> to <http://grid.sonatype.org/ci/job/surefire/./jdk=1.5,label=ubuntu/ws/trunk/surefire-integration-tests/target/it-repo/org/apache/maven/surefire/surefire-booter/2.7-SNAPSHOT/surefire-booter-2.7-20100828.151007-9.jar>
[INFO] Installing <http://grid.sonatype.org/ci/job/surefire/./jdk=1.5,label=ubuntu/ws/trunk/surefire-api/target/dependency-reduced-pom.xml> to <http://grid.sonatype.org/ci/job/surefire/./jdk=1.5,label=ubuntu/ws/trunk/surefire-integration-tests/target/it-repo/org/apache/maven/surefire/surefire-api/2.7-SNAPSHOT/surefire-api-2.7-SNAPSHOT.pom>
[INFO] Installing <http://grid.sonatype.org/ci/job/surefire/./jdk=1.5,label=ubuntu/ws/trunk/surefire-api/target/surefire-api-2.7-SNAPSHOT.jar> to <http://grid.sonatype.org/ci/job/surefire/./jdk=1.5,label=ubuntu/ws/trunk/surefire-integration-tests/target/it-repo/org/apache/maven/surefire/surefire-api/2.7-SNAPSHOT/surefire-api-2.7-20100828.151007-9.jar>
[INFO] Installing <http://grid.sonatype.org/ci/job/surefire/./jdk=1.5,label=ubuntu/ws/trunk/maven-surefire-common/pom.xml> to <http://grid.sonatype.org/ci/job/surefire/./jdk=1.5,label=ubuntu/ws/trunk/surefire-integration-tests/target/it-repo/org/apache/maven/surefire/maven-surefire-common/2.7-SNAPSHOT/maven-surefire-common-2.7-SNAPSHOT.pom>
[INFO] Installing <http://grid.sonatype.org/ci/job/surefire/./jdk=1.5,label=ubuntu/ws/trunk/maven-surefire-common/target/maven-surefire-common-2.7-SNAPSHOT.jar> to <http://grid.sonatype.org/ci/job/surefire/./jdk=1.5,label=ubuntu/ws/trunk/surefire-integration-tests/target/it-repo/org/apache/maven/surefire/maven-surefire-common/2.7-SNAPSHOT/maven-surefire-common-2.7-20100828.151007-9.jar>
[INFO] Installing <http://grid.sonatype.org/ci/job/surefire/./jdk=1.5,label=ubuntu/ws/trunk/surefire-providers/surefire-testng/pom.xml> to <http://grid.sonatype.org/ci/job/surefire/./jdk=1.5,label=ubuntu/ws/trunk/surefire-integration-tests/target/it-repo/org/apache/maven/surefire/surefire-testng/2.7-SNAPSHOT/surefire-testng-2.7-SNAPSHOT.pom>
[INFO] Installing <http://grid.sonatype.org/ci/job/surefire/./jdk=1.5,label=ubuntu/ws/trunk/surefire-providers/surefire-testng/target/surefire-testng-2.7-SNAPSHOT.jar> to <http://grid.sonatype.org/ci/job/surefire/./jdk=1.5,label=ubuntu/ws/trunk/surefire-integration-tests/target/it-repo/org/apache/maven/surefire/surefire-testng/2.7-SNAPSHOT/surefire-testng-2.7-20100828.151007-9.jar>
[INFO] Installing <http://grid.sonatype.org/ci/job/surefire/./jdk=1.5,label=ubuntu/ws/trunk/surefire-providers/pom.xml> to <http://grid.sonatype.org/ci/job/surefire/./jdk=1.5,label=ubuntu/ws/trunk/surefire-integration-tests/target/it-repo/org/apache/maven/surefire/surefire-providers/2.7-SNAPSHOT/surefire-providers-2.7-20100828.151007-9.pom>
[INFO] Installing <http://grid.sonatype.org/ci/job/surefire/./jdk=1.5,label=ubuntu/ws/trunk/surefire-providers/surefire-junit/pom.xml> to <http://grid.sonatype.org/ci/job/surefire/./jdk=1.5,label=ubuntu/ws/trunk/surefire-integration-tests/target/it-repo/org/apache/maven/surefire/surefire-junit/2.7-SNAPSHOT/surefire-junit-2.7-SNAPSHOT.pom>
[INFO] Installing <http://grid.sonatype.org/ci/job/surefire/./jdk=1.5,label=ubuntu/ws/trunk/surefire-providers/surefire-junit/target/surefire-junit-2.7-SNAPSHOT.jar> to <http://grid.sonatype.org/ci/job/surefire/./jdk=1.5,label=ubuntu/ws/trunk/surefire-integration-tests/target/it-repo/org/apache/maven/surefire/surefire-junit/2.7-SNAPSHOT/surefire-junit-2.7-20100828.151007-9.jar>
[INFO] Installing <http://grid.sonatype.org/ci/job/surefire/./jdk=1.5,label=ubuntu/ws/trunk/surefire-providers/surefire-junit4/pom.xml> to <http://grid.sonatype.org/ci/job/surefire/./jdk=1.5,label=ubuntu/ws/trunk/surefire-integration-tests/target/it-repo/org/apache/maven/surefire/surefire-junit4/2.7-SNAPSHOT/surefire-junit4-2.7-SNAPSHOT.pom>
[INFO] Installing <http://grid.sonatype.org/ci/job/surefire/./jdk=1.5,label=ubuntu/ws/trunk/surefire-providers/surefire-junit4/target/surefire-junit4-2.7-SNAPSHOT.jar> to <http://grid.sonatype.org/ci/job/surefire/./jdk=1.5,label=ubuntu/ws/trunk/surefire-integration-tests/target/it-repo/org/apache/maven/surefire/surefire-junit4/2.7-SNAPSHOT/surefire-junit4-2.7-20100828.151007-9.jar>
[INFO] Installing <http://grid.sonatype.org/ci/job/surefire/./jdk=1.5,label=ubuntu/ws/trunk/surefire-providers/surefire-junit47/pom.xml> to <http://grid.sonatype.org/ci/job/surefire/./jdk=1.5,label=ubuntu/ws/trunk/surefire-integration-tests/target/it-repo/org/apache/maven/surefire/surefire-junit47/2.7-SNAPSHOT/surefire-junit47-2.7-SNAPSHOT.pom>
[INFO] Installing <http://grid.sonatype.org/ci/job/surefire/./jdk=1.5,label=ubuntu/ws/trunk/surefire-providers/surefire-junit47/target/surefire-junit47-2.7-SNAPSHOT.jar> to <http://grid.sonatype.org/ci/job/surefire/./jdk=1.5,label=ubuntu/ws/trunk/surefire-integration-tests/target/it-repo/org/apache/maven/surefire/surefire-junit47/2.7-SNAPSHOT/surefire-junit47-2.7-20100828.151007-9.jar>
[INFO] Installing <http://grid.sonatype.org/ci/job/surefire/./jdk=1.5,label=ubuntu/ws/trunk/surefire-integration-tests/pom.xml> to <http://grid.sonatype.org/ci/job/surefire/./jdk=1.5,label=ubuntu/ws/trunk/surefire-integration-tests/target/it-repo/org/apache/maven/surefire/surefire-integration-tests/2.7-SNAPSHOT/surefire-integration-tests-2.7-SNAPSHOT.pom>
[INFO] Installing <http://grid.sonatype.org/ci/job/surefire/./jdk=1.5,label=ubuntu/ws/trunk/surefire-integration-tests/target/surefire-integration-tests-2.7-SNAPSHOT.jar> to <http://grid.sonatype.org/ci/job/surefire/./jdk=1.5,label=ubuntu/ws/trunk/surefire-integration-tests/target/it-repo/org/apache/maven/surefire/surefire-integration-tests/2.7-SNAPSHOT/surefire-integration-tests-2.7-SNAPSHOT.jar>
[WARNING] DEPRECATED [systemProperties]: Use systemPropertyVariables instead.
[INFO] [failsafe:integration-test {execution: default}]
[INFO] Failsafe report directory: <http://grid.sonatype.org/ci/job/surefire/./jdk=1.5,label=ubuntu/ws/trunk/surefire-integration-tests/target/failsafe-reports>
-------------------------------------------------------
T E S T S
-------------------------------------------------------
Running org.apache.maven.surefire.its.TwoTestCasesIT
Tests run: 4, Failures: 0, Errors: 0, Skipped: 0, Time elapsed: 101.244 sec
Running org.apache.maven.surefire.its.UseIsolatedClassLoaderIT
Tests run: 1, Failures: 0, Errors: 0, Skipped: 0, Time elapsed: 10.727 sec
Running org.apache.maven.surefire.its.AdditionalClasspathIT
Tests run: 1, Failures: 0, Errors: 0, Skipped: 0, Time elapsed: 8.852 sec
Running org.apache.maven.surefire.its.PlexusConflictIT
Tests run: 2, Failures: 0, Errors: 0, Skipped: 0, Time elapsed: 17.375 sec
Running org.apache.maven.surefire.its.CheckTestNgBeforeMethodFailureIT
Tests run: 1, Failures: 0, Errors: 0, Skipped: 0, Time elapsed: 8.798 sec
Running org.apache.maven.surefire.its.CheckSingleTestIT
Tests run: 4, Failures: 0, Errors: 0, Skipped: 0, Time elapsed: 39.723 sec
Running org.apache.maven.surefire.its.Surefire44InnerClassTestIT
Tests run: 1, Failures: 0, Errors: 0, Skipped: 0, Time elapsed: 8.848 sec
Running org.apache.maven.surefire.its.WorkingDirectoryIT
Tests run: 4, Failures: 0, Errors: 0, Skipped: 0, Time elapsed: 22.929 sec
Running org.apache.maven.surefire.its.CheckTestNgSuiteXmlIT
Tests run: 2, Failures: 0, Errors: 0, Skipped: 0, Time elapsed: 16.483 sec
Running org.apache.maven.surefire.its.ClasspathFilteringIT
Tests run: 1, Failures: 0, Errors: 0, Skipped: 0, Time elapsed: 8.634 sec
Running org.apache.maven.surefire.its.PlainOldJavaClasspathIT
Tests run: 1, Failures: 0, Errors: 0, Skipped: 0, Time elapsed: 7.822 sec
Running org.apache.maven.surefire.its.Surefire42NotExtendingTestCaseIT
Tests run: 1, Failures: 0, Errors: 0, Skipped: 0, Time elapsed: 7.919 sec
Running org.apache.maven.surefire.its.CheckTestFailIfNoTestsForkModeIT
Tests run: 6, Failures: 0, Errors: 0, Skipped: 0, Time elapsed: 37.974 sec
Running org.apache.maven.surefire.its.CheckTestNgJdk14IT
Tests run: 1, Failures: 0, Errors: 0, Skipped: 0, Time elapsed: 5.582 sec
Running org.apache.maven.surefire.its.ForkModeIT
Tests run: 5, Failures: 0, Errors: 0, Skipped: 0, Time elapsed: 29.361 sec
Running org.apache.maven.surefire.its.Junit4VersionsIT
Tests run: 9, Failures: 0, Errors: 0, Skipped: 0, Time elapsed: 52.472 sec
Running org.apache.maven.surefire.its.Surefire621TestCountingJunit3InParallelIT
Tests run: 1, Failures: 0, Errors: 0, Skipped: 0, Time elapsed: 7.406 sec
Running org.apache.maven.surefire.its.PojoSimpleIT
Tests run: 1, Failures: 0, Errors: 0, Skipped: 0, Time elapsed: 5.394 sec
Running org.apache.maven.surefire.its.Surefire162CharsetProviderIT
Tests run: 1, Failures: 0, Errors: 0, Skipped: 0, Time elapsed: 5.327 sec
Running org.apache.maven.surefire.its.CheckTestNgBeforeMethodIT
Tests run: 1, Failures: 0, Errors: 0, Skipped: 0, Time elapsed: 9.064 sec
Running org.apache.maven.surefire.its.CheckTestNgPathWithSpacesIT
Tests run: 1, Failures: 0, Errors: 0, Skipped: 0, Time elapsed: 5.694 sec
Running org.apache.maven.surefire.its.CheckTestNgListenerReporterIT
Tests run: 1, Failures: 0, Errors: 0, Skipped: 0, Time elapsed: 5.97 sec
Running org.apache.maven.surefire.its.EnvironmentVariableIT
Tests run: 1, Failures: 0, Errors: 0, Skipped: 0, Time elapsed: 5.747 sec
Running org.apache.maven.surefire.its.CheckTestFailIfNoTestsIT
Tests run: 2, Failures: 0, Errors: 0, Skipped: 0, Time elapsed: 9.485 sec
Running org.apache.maven.surefire.its.IncludesExcludesIT
Tests run: 1, Failures: 0, Errors: 0, Skipped: 0, Time elapsed: 5.458 sec
Running org.apache.maven.surefire.its.JUnit44HamcrestIT
Tests run: 1, Failures: 0, Errors: 0, Skipped: 0, Time elapsed: 5.502 sec
Running org.apache.maven.surefire.its.AbstractTestCaseIT
Tests run: 1, Failures: 0, Errors: 0, Skipped: 0, Time elapsed: 5.365 sec
Running org.apache.maven.surefire.its.ArgLineIT
Tests run: 1, Failures: 0, Errors: 0, Skipped: 0, Time elapsed: 5.419 sec
Running org.apache.maven.surefire.its.Surefire628ConsoleOutputBeforeAndAfterClassIT
Tests run: 1, Failures: 0, Errors: 0, Skipped: 0, Time elapsed: 5.289 sec
Running org.apache.maven.surefire.its.JUnit4ForkAlwaysStaticInitPollutionIT
Tests run: 1, Failures: 0, Errors: 0, Skipped: 0, Time elapsed: 5.839 sec
Running org.apache.maven.surefire.its.Surefire377TestNgAndJUnitTogetherIT
Tests run: 1, Failures: 0, Errors: 0, Skipped: 0, Time elapsed: 7.061 sec
Running org.apache.maven.surefire.its.DefaultConfigurationIT
Tests run: 1, Failures: 0, Errors: 0, Skipped: 0, Time elapsed: 5.378 sec
Running org.apache.maven.surefire.its.ClassPathOrderIT
Tests run: 1, Failures: 0, Errors: 0, Skipped: 0, Time elapsed: 7.056 sec
Running org.apache.maven.surefire.its.Junit4IgnoreIT
Tests run: 1, Failures: 0, Errors: 0, Skipped: 0, Time elapsed: 5.296 sec
Running org.apache.maven.surefire.its.CheckTestNgExecuteErrorIT
Tests run: 1, Failures: 0, Errors: 0, Skipped: 0, Time elapsed: 5.399 sec
Running org.apache.maven.surefire.its.TimeoutForkedTestIT
Tests run: 1, Failures: 0, Errors: 0, Skipped: 0, Time elapsed: 8.638 sec
Running org.apache.maven.surefire.its.Surefire146ForkPerTestNoSetupIT
Tests run: 1, Failures: 0, Errors: 0, Skipped: 0, Time elapsed: 8.249 sec
Running org.apache.maven.surefire.its.SystemPropertiesTestIT
Tests run: 2, Failures: 0, Errors: 0, Skipped: 0, Time elapsed: 14.106 sec
Running org.apache.maven.surefire.its.CheckTestNgGroupThreadParallelIT
Tests run: 1, Failures: 0, Errors: 0, Skipped: 0, Time elapsed: 5.434 sec
Running org.apache.maven.surefire.its.Surefire613TestCountInParallelIT
Tests run: 1, Failures: 0, Errors: 0, Skipped: 0, Time elapsed: 8.097 sec
Running org.apache.maven.surefire.its.Junit47concurrencyIT
Tests run: 1, Failures: 0, Errors: 0, Skipped: 0, Time elapsed: 5.147 sec
Running org.apache.maven.surefire.its.SiblingAggregatorIT
Tests run: 1, Failures: 0, Errors: 0, Skipped: 0, Time elapsed: 4.236 sec
Running org.apache.maven.surefire.its.AggregateReportIT
Tests run: 1, Failures: 0, Errors: 1, Skipped: 0, Time elapsed: 4.421 sec <<< FAILURE!
Running org.apache.maven.surefire.its.CheckTestNgReportTestIT
Tests run: 1, Failures: 0, Errors: 0, Skipped: 0, Time elapsed: 7.918 sec
Running org.apache.maven.surefire.its.CheckTestNgSuiteXmlSingleIT
Tests run: 1, Failures: 0, Errors: 0, Skipped: 0, Time elapsed: 5.443 sec
Running org.apache.maven.surefire.its.CheckTestNgVersionsIT
Tests run: 6, Failures: 0, Errors: 0, Skipped: 0, Time elapsed: 38.595 sec
Running org.apache.maven.surefire.its.Surefire224WellFormedXmlFailuresIT
Tests run: 1, Failures: 0, Errors: 0, Skipped: 0, Time elapsed: 5.212 sec
Running org.apache.maven.surefire.its.ClasspathScopeFilteringIT
Tests run: 1, Failures: 0, Errors: 0, Skipped: 0, Time elapsed: 5.472 sec
Running org.apache.maven.surefire.its.WorkingDirectoryMissingIT
Tests run: 1, Failures: 0, Errors: 0, Skipped: 0, Time elapsed: 5.575 sec
Running org.apache.maven.surefire.its.UmlautDirIT
Tests run: 2, Failures: 0, Errors: 0, Skipped: 0, Time elapsed: 11.072 sec
Results :
Tests in error:
testAggregateReport(org.apache.maven.surefire.its.AggregateReportIT)
Tests run: 86, Failures: 0, Errors: 1, Skipped: 0
[INFO] [failsafe:verify {execution: default}]
[INFO] Failsafe report directory: <http://grid.sonatype.org/ci/job/surefire/./jdk=1.5,label=ubuntu/ws/trunk/surefire-integration-tests/target/failsafe-reports>
[INFO] ------------------------------------------------------------------------
[ERROR] BUILD FAILURE
[INFO] ------------------------------------------------------------------------
[INFO] There are test failures.
Please refer to <http://grid.sonatype.org/ci/job/surefire/./jdk=1.5,label=ubuntu/ws/trunk/surefire-integration-tests/target/failsafe-reports> for the individual test results.
[INFO] ------------------------------------------------------------------------
[INFO] Trace
org.apache.maven.BuildFailureException: There are test failures.
Please refer to <http://grid.sonatype.org/ci/job/surefire/./jdk=1.5,label=ubuntu/ws/trunk/surefire-integration-tests/target/failsafe-reports> for the individual test results.
at org.apache.maven.lifecycle.DefaultLifecycleExecutor.executeGoals(DefaultLifecycleExecutor.java:715)
at org.apache.maven.lifecycle.DefaultLifecycleExecutor.executeGoalWithLifecycle(DefaultLifecycleExecutor.java:556)
at org.apache.maven.lifecycle.DefaultLifecycleExecutor.executeGoal(DefaultLifecycleExecutor.java:535)
at org.apache.maven.lifecycle.DefaultLifecycleExecutor.executeGoalAndHandleFailures(DefaultLifecycleExecutor.java:387)
at org.apache.maven.lifecycle.DefaultLifecycleExecutor.executeTaskSegments(DefaultLifecycleExecutor.java:348)
at org.apache.maven.lifecycle.DefaultLifecycleExecutor.execute(DefaultLifecycleExecutor.java:180)
at org.apache.maven.DefaultMaven.doExecute(DefaultMaven.java:328)
at org.apache.maven.DefaultMaven.execute(DefaultMaven.java:138)
at org.apache.maven.cli.MavenCli.main(MavenCli.java:362)
at org.apache.maven.cli.compat.CompatibleMain.main(CompatibleMain.java:60)
at sun.reflect.NativeMethodAccessorImpl.invoke0(Native Method)
at sun.reflect.NativeMethodAccessorImpl.invoke(NativeMethodAccessorImpl.java:39)
at sun.reflect.DelegatingMethodAccessorImpl.invoke(DelegatingMethodAccessorImpl.java:25)
at java.lang.reflect.Method.invoke(Method.java:597)
at org.codehaus.classworlds.Launcher.launchEnhanced(Launcher.java:315)
at org.codehaus.classworlds.Launcher.launch(Launcher.java:255)
at org.codehaus.classworlds.Launcher.mainWithExitCode(Launcher.java:430)
at org.codehaus.classworlds.Launcher.main(Launcher.java:375)
Caused by: org.apache.maven.plugin.MojoFailureException: There are test failures.
Please refer to <http://grid.sonatype.org/ci/job/surefire/./jdk=1.5,label=ubuntu/ws/trunk/surefire-integration-tests/target/failsafe-reports> for the individual test results.
at org.apache.maven.plugin.failsafe.VerifyMojo.execute(VerifyMojo.java:217)
at org.apache.maven.plugin.DefaultPluginManager.executeMojo(DefaultPluginManager.java:490)
at org.apache.maven.lifecycle.DefaultLifecycleExecutor.executeGoals(DefaultLifecycleExecutor.java:694)
... 17 more
[INFO] ------------------------------------------------------------------------
[INFO] Total time: 20 minutes 10 seconds
[INFO] Finished at: Sat Aug 28 10:28:21 CDT 2010
[INFO] Final Memory: 44M/127M
[INFO] ------------------------------------------------------------------------