You are viewing a plain text version of this content. The canonical link for it is here.
Posted to dev@lucene.apache.org by Apache Jenkins Server <je...@builds.apache.org> on 2017/02/02 12:22:48 UTC

[JENKINS] Lucene-Solr-Tests-6.x - Build # 702 - Unstable

Build: https://builds.apache.org/job/Lucene-Solr-Tests-6.x/702/

4 tests failed.
FAILED:  junit.framework.TestSuite.org.apache.solr.core.TestCoreDiscovery

Error Message:
ObjectTracker found 5 object(s) that were not released!!! [MockDirectoryWrapper, MockDirectoryWrapper, SolrCore, MDCAwareThreadPoolExecutor, MockDirectoryWrapper] org.apache.solr.common.util.ObjectReleaseTracker$ObjectTrackerException  at org.apache.solr.common.util.ObjectReleaseTracker.track(ObjectReleaseTracker.java:43)  at org.apache.solr.core.CachingDirectoryFactory.get(CachingDirectoryFactory.java:347)  at org.apache.solr.core.MetricsDirectoryFactory.get(MetricsDirectoryFactory.java:201)  at org.apache.solr.update.SolrIndexWriter.create(SolrIndexWriter.java:97)  at org.apache.solr.core.SolrCore.initIndex(SolrCore.java:705)  at org.apache.solr.core.SolrCore.<init>(SolrCore.java:890)  at org.apache.solr.core.SolrCore.<init>(SolrCore.java:807)  at org.apache.solr.core.CoreContainer.create(CoreContainer.java:904)  at org.apache.solr.core.CoreContainer.getCore(CoreContainer.java:1271)  at org.apache.solr.core.TestCoreDiscovery.testTooManyTransientCores(TestCoreDiscovery.java:211)  at sun.reflect.NativeMethodAccessorImpl.invoke0(Native Method)  at sun.reflect.NativeMethodAccessorImpl.invoke(NativeMethodAccessorImpl.java:62)  at sun.reflect.DelegatingMethodAccessorImpl.invoke(DelegatingMethodAccessorImpl.java:43)  at java.lang.reflect.Method.invoke(Method.java:498)  at com.carrotsearch.randomizedtesting.RandomizedRunner.invoke(RandomizedRunner.java:1713)  at com.carrotsearch.randomizedtesting.RandomizedRunner$8.evaluate(RandomizedRunner.java:907)  at com.carrotsearch.randomizedtesting.RandomizedRunner$9.evaluate(RandomizedRunner.java:943)  at com.carrotsearch.randomizedtesting.RandomizedRunner$10.evaluate(RandomizedRunner.java:957)  at com.carrotsearch.randomizedtesting.rules.SystemPropertiesRestoreRule$1.evaluate(SystemPropertiesRestoreRule.java:57)  at org.apache.lucene.util.TestRuleSetupTeardownChained$1.evaluate(TestRuleSetupTeardownChained.java:49)  at org.apache.lucene.util.AbstractBeforeAfterRule$1.evaluate(AbstractBeforeAfterRule.java:45)  at org.apache.lucene.util.TestRuleThreadAndTestName$1.evaluate(TestRuleThreadAndTestName.java:48)  at org.apache.lucene.util.TestRuleIgnoreAfterMaxFailures$1.evaluate(TestRuleIgnoreAfterMaxFailures.java:64)  at org.apache.lucene.util.TestRuleMarkFailure$1.evaluate(TestRuleMarkFailure.java:47)  at com.carrotsearch.randomizedtesting.rules.StatementAdapter.evaluate(StatementAdapter.java:36)  at com.carrotsearch.randomizedtesting.ThreadLeakControl$StatementRunner.run(ThreadLeakControl.java:368)  at com.carrotsearch.randomizedtesting.ThreadLeakControl.forkTimeoutingTask(ThreadLeakControl.java:817)  at com.carrotsearch.randomizedtesting.ThreadLeakControl$3.evaluate(ThreadLeakControl.java:468)  at com.carrotsearch.randomizedtesting.RandomizedRunner.runSingleTest(RandomizedRunner.java:916)  at com.carrotsearch.randomizedtesting.RandomizedRunner$5.evaluate(RandomizedRunner.java:802)  at com.carrotsearch.randomizedtesting.RandomizedRunner$6.evaluate(RandomizedRunner.java:852)  at com.carrotsearch.randomizedtesting.RandomizedRunner$7.evaluate(RandomizedRunner.java:863)  at com.carrotsearch.randomizedtesting.rules.StatementAdapter.evaluate(StatementAdapter.java:36)  at com.carrotsearch.randomizedtesting.rules.SystemPropertiesRestoreRule$1.evaluate(SystemPropertiesRestoreRule.java:57)  at org.apache.lucene.util.AbstractBeforeAfterRule$1.evaluate(AbstractBeforeAfterRule.java:45)  at com.carrotsearch.randomizedtesting.rules.StatementAdapter.evaluate(StatementAdapter.java:36)  at org.apache.lucene.util.TestRuleStoreClassName$1.evaluate(TestRuleStoreClassName.java:41)  at com.carrotsearch.randomizedtesting.rules.NoShadowingOrOverridesOnMethodsRule$1.evaluate(NoShadowingOrOverridesOnMethodsRule.java:40)  at com.carrotsearch.randomizedtesting.rules.NoShadowingOrOverridesOnMethodsRule$1.evaluate(NoShadowingOrOverridesOnMethodsRule.java:40)  at com.carrotsearch.randomizedtesting.rules.StatementAdapter.evaluate(StatementAdapter.java:36)  at com.carrotsearch.randomizedtesting.rules.StatementAdapter.evaluate(StatementAdapter.java:36)  at com.carrotsearch.randomizedtesting.rules.StatementAdapter.evaluate(StatementAdapter.java:36)  at org.apache.lucene.util.TestRuleAssertionsRequired$1.evaluate(TestRuleAssertionsRequired.java:53)  at org.apache.lucene.util.TestRuleMarkFailure$1.evaluate(TestRuleMarkFailure.java:47)  at org.apache.lucene.util.TestRuleIgnoreAfterMaxFailures$1.evaluate(TestRuleIgnoreAfterMaxFailures.java:64)  at org.apache.lucene.util.TestRuleIgnoreTestSuites$1.evaluate(TestRuleIgnoreTestSuites.java:54)  at com.carrotsearch.randomizedtesting.rules.StatementAdapter.evaluate(StatementAdapter.java:36)  at com.carrotsearch.randomizedtesting.ThreadLeakControl$StatementRunner.run(ThreadLeakControl.java:368)  at java.lang.Thread.run(Thread.java:745)  org.apache.solr.common.util.ObjectReleaseTracker$ObjectTrackerException  at org.apache.solr.common.util.ObjectReleaseTracker.track(ObjectReleaseTracker.java:43)  at org.apache.solr.core.CachingDirectoryFactory.get(CachingDirectoryFactory.java:347)  at org.apache.solr.core.MetricsDirectoryFactory.get(MetricsDirectoryFactory.java:201)  at org.apache.solr.core.SolrCore.initSnapshotMetaDataManager(SolrCore.java:479)  at org.apache.solr.core.SolrCore.<init>(SolrCore.java:884)  at org.apache.solr.core.SolrCore.<init>(SolrCore.java:807)  at org.apache.solr.core.CoreContainer.create(CoreContainer.java:904)  at org.apache.solr.core.CoreContainer.getCore(CoreContainer.java:1271)  at org.apache.solr.core.TestCoreDiscovery.testTooManyTransientCores(TestCoreDiscovery.java:211)  at sun.reflect.NativeMethodAccessorImpl.invoke0(Native Method)  at sun.reflect.NativeMethodAccessorImpl.invoke(NativeMethodAccessorImpl.java:62)  at sun.reflect.DelegatingMethodAccessorImpl.invoke(DelegatingMethodAccessorImpl.java:43)  at java.lang.reflect.Method.invoke(Method.java:498)  at com.carrotsearch.randomizedtesting.RandomizedRunner.invoke(RandomizedRunner.java:1713)  at com.carrotsearch.randomizedtesting.RandomizedRunner$8.evaluate(RandomizedRunner.java:907)  at com.carrotsearch.randomizedtesting.RandomizedRunner$9.evaluate(RandomizedRunner.java:943)  at com.carrotsearch.randomizedtesting.RandomizedRunner$10.evaluate(RandomizedRunner.java:957)  at com.carrotsearch.randomizedtesting.rules.SystemPropertiesRestoreRule$1.evaluate(SystemPropertiesRestoreRule.java:57)  at org.apache.lucene.util.TestRuleSetupTeardownChained$1.evaluate(TestRuleSetupTeardownChained.java:49)  at org.apache.lucene.util.AbstractBeforeAfterRule$1.evaluate(AbstractBeforeAfterRule.java:45)  at org.apache.lucene.util.TestRuleThreadAndTestName$1.evaluate(TestRuleThreadAndTestName.java:48)  at org.apache.lucene.util.TestRuleIgnoreAfterMaxFailures$1.evaluate(TestRuleIgnoreAfterMaxFailures.java:64)  at org.apache.lucene.util.TestRuleMarkFailure$1.evaluate(TestRuleMarkFailure.java:47)  at com.carrotsearch.randomizedtesting.rules.StatementAdapter.evaluate(StatementAdapter.java:36)  at com.carrotsearch.randomizedtesting.ThreadLeakControl$StatementRunner.run(ThreadLeakControl.java:368)  at com.carrotsearch.randomizedtesting.ThreadLeakControl.forkTimeoutingTask(ThreadLeakControl.java:817)  at com.carrotsearch.randomizedtesting.ThreadLeakControl$3.evaluate(ThreadLeakControl.java:468)  at com.carrotsearch.randomizedtesting.RandomizedRunner.runSingleTest(RandomizedRunner.java:916)  at com.carrotsearch.randomizedtesting.RandomizedRunner$5.evaluate(RandomizedRunner.java:802)  at com.carrotsearch.randomizedtesting.RandomizedRunner$6.evaluate(RandomizedRunner.java:852)  at com.carrotsearch.randomizedtesting.RandomizedRunner$7.evaluate(RandomizedRunner.java:863)  at com.carrotsearch.randomizedtesting.rules.StatementAdapter.evaluate(StatementAdapter.java:36)  at com.carrotsearch.randomizedtesting.rules.SystemPropertiesRestoreRule$1.evaluate(SystemPropertiesRestoreRule.java:57)  at org.apache.lucene.util.AbstractBeforeAfterRule$1.evaluate(AbstractBeforeAfterRule.java:45)  at com.carrotsearch.randomizedtesting.rules.StatementAdapter.evaluate(StatementAdapter.java:36)  at org.apache.lucene.util.TestRuleStoreClassName$1.evaluate(TestRuleStoreClassName.java:41)  at com.carrotsearch.randomizedtesting.rules.NoShadowingOrOverridesOnMethodsRule$1.evaluate(NoShadowingOrOverridesOnMethodsRule.java:40)  at com.carrotsearch.randomizedtesting.rules.NoShadowingOrOverridesOnMethodsRule$1.evaluate(NoShadowingOrOverridesOnMethodsRule.java:40)  at com.carrotsearch.randomizedtesting.rules.StatementAdapter.evaluate(StatementAdapter.java:36)  at com.carrotsearch.randomizedtesting.rules.StatementAdapter.evaluate(StatementAdapter.java:36)  at com.carrotsearch.randomizedtesting.rules.StatementAdapter.evaluate(StatementAdapter.java:36)  at org.apache.lucene.util.TestRuleAssertionsRequired$1.evaluate(TestRuleAssertionsRequired.java:53)  at org.apache.lucene.util.TestRuleMarkFailure$1.evaluate(TestRuleMarkFailure.java:47)  at org.apache.lucene.util.TestRuleIgnoreAfterMaxFailures$1.evaluate(TestRuleIgnoreAfterMaxFailures.java:64)  at org.apache.lucene.util.TestRuleIgnoreTestSuites$1.evaluate(TestRuleIgnoreTestSuites.java:54)  at com.carrotsearch.randomizedtesting.rules.StatementAdapter.evaluate(StatementAdapter.java:36)  at com.carrotsearch.randomizedtesting.ThreadLeakControl$StatementRunner.run(ThreadLeakControl.java:368)  at java.lang.Thread.run(Thread.java:745)  org.apache.solr.common.util.ObjectReleaseTracker$ObjectTrackerException  at org.apache.solr.common.util.ObjectReleaseTracker.track(ObjectReleaseTracker.java:43)  at org.apache.solr.core.SolrCore.<init>(SolrCore.java:980)  at org.apache.solr.core.SolrCore.<init>(SolrCore.java:807)  at org.apache.solr.core.CoreContainer.create(CoreContainer.java:904)  at org.apache.solr.core.CoreContainer.getCore(CoreContainer.java:1271)  at org.apache.solr.core.TestCoreDiscovery.testTooManyTransientCores(TestCoreDiscovery.java:211)  at sun.reflect.NativeMethodAccessorImpl.invoke0(Native Method)  at sun.reflect.NativeMethodAccessorImpl.invoke(NativeMethodAccessorImpl.java:62)  at sun.reflect.DelegatingMethodAccessorImpl.invoke(DelegatingMethodAccessorImpl.java:43)  at java.lang.reflect.Method.invoke(Method.java:498)  at com.carrotsearch.randomizedtesting.RandomizedRunner.invoke(RandomizedRunner.java:1713)  at com.carrotsearch.randomizedtesting.RandomizedRunner$8.evaluate(RandomizedRunner.java:907)  at com.carrotsearch.randomizedtesting.RandomizedRunner$9.evaluate(RandomizedRunner.java:943)  at com.carrotsearch.randomizedtesting.RandomizedRunner$10.evaluate(RandomizedRunner.java:957)  at com.carrotsearch.randomizedtesting.rules.SystemPropertiesRestoreRule$1.evaluate(SystemPropertiesRestoreRule.java:57)  at org.apache.lucene.util.TestRuleSetupTeardownChained$1.evaluate(TestRuleSetupTeardownChained.java:49)  at org.apache.lucene.util.AbstractBeforeAfterRule$1.evaluate(AbstractBeforeAfterRule.java:45)  at org.apache.lucene.util.TestRuleThreadAndTestName$1.evaluate(TestRuleThreadAndTestName.java:48)  at org.apache.lucene.util.TestRuleIgnoreAfterMaxFailures$1.evaluate(TestRuleIgnoreAfterMaxFailures.java:64)  at org.apache.lucene.util.TestRuleMarkFailure$1.evaluate(TestRuleMarkFailure.java:47)  at com.carrotsearch.randomizedtesting.rules.StatementAdapter.evaluate(StatementAdapter.java:36)  at com.carrotsearch.randomizedtesting.ThreadLeakControl$StatementRunner.run(ThreadLeakControl.java:368)  at com.carrotsearch.randomizedtesting.ThreadLeakControl.forkTimeoutingTask(ThreadLeakControl.java:817)  at com.carrotsearch.randomizedtesting.ThreadLeakControl$3.evaluate(ThreadLeakControl.java:468)  at com.carrotsearch.randomizedtesting.RandomizedRunner.runSingleTest(RandomizedRunner.java:916)  at com.carrotsearch.randomizedtesting.RandomizedRunner$5.evaluate(RandomizedRunner.java:802)  at com.carrotsearch.randomizedtesting.RandomizedRunner$6.evaluate(RandomizedRunner.java:852)  at com.carrotsearch.randomizedtesting.RandomizedRunner$7.evaluate(RandomizedRunner.java:863)  at com.carrotsearch.randomizedtesting.rules.StatementAdapter.evaluate(StatementAdapter.java:36)  at com.carrotsearch.randomizedtesting.rules.SystemPropertiesRestoreRule$1.evaluate(SystemPropertiesRestoreRule.java:57)  at org.apache.lucene.util.AbstractBeforeAfterRule$1.evaluate(AbstractBeforeAfterRule.java:45)  at com.carrotsearch.randomizedtesting.rules.StatementAdapter.evaluate(StatementAdapter.java:36)  at org.apache.lucene.util.TestRuleStoreClassName$1.evaluate(TestRuleStoreClassName.java:41)  at com.carrotsearch.randomizedtesting.rules.NoShadowingOrOverridesOnMethodsRule$1.evaluate(NoShadowingOrOverridesOnMethodsRule.java:40)  at com.carrotsearch.randomizedtesting.rules.NoShadowingOrOverridesOnMethodsRule$1.evaluate(NoShadowingOrOverridesOnMethodsRule.java:40)  at com.carrotsearch.randomizedtesting.rules.StatementAdapter.evaluate(StatementAdapter.java:36)  at com.carrotsearch.randomizedtesting.rules.StatementAdapter.evaluate(StatementAdapter.java:36)  at com.carrotsearch.randomizedtesting.rules.StatementAdapter.evaluate(StatementAdapter.java:36)  at org.apache.lucene.util.TestRuleAssertionsRequired$1.evaluate(TestRuleAssertionsRequired.java:53)  at org.apache.lucene.util.TestRuleMarkFailure$1.evaluate(TestRuleMarkFailure.java:47)  at org.apache.lucene.util.TestRuleIgnoreAfterMaxFailures$1.evaluate(TestRuleIgnoreAfterMaxFailures.java:64)  at org.apache.lucene.util.TestRuleIgnoreTestSuites$1.evaluate(TestRuleIgnoreTestSuites.java:54)  at com.carrotsearch.randomizedtesting.rules.StatementAdapter.evaluate(StatementAdapter.java:36)  at com.carrotsearch.randomizedtesting.ThreadLeakControl$StatementRunner.run(ThreadLeakControl.java:368)  at java.lang.Thread.run(Thread.java:745)  org.apache.solr.common.util.ObjectReleaseTracker$ObjectTrackerException  at org.apache.solr.common.util.ObjectReleaseTracker.track(ObjectReleaseTracker.java:43)  at org.apache.solr.core.SolrCore.<init>(SolrCore.java:830)  at org.apache.solr.core.SolrCore.<init>(SolrCore.java:807)  at org.apache.solr.core.CoreContainer.create(CoreContainer.java:904)  at org.apache.solr.core.CoreContainer.getCore(CoreContainer.java:1271)  at org.apache.solr.core.TestCoreDiscovery.testTooManyTransientCores(TestCoreDiscovery.java:211)  at sun.reflect.NativeMethodAccessorImpl.invoke0(Native Method)  at sun.reflect.NativeMethodAccessorImpl.invoke(NativeMethodAccessorImpl.java:62)  at sun.reflect.DelegatingMethodAccessorImpl.invoke(DelegatingMethodAccessorImpl.java:43)  at java.lang.reflect.Method.invoke(Method.java:498)  at com.carrotsearch.randomizedtesting.RandomizedRunner.invoke(RandomizedRunner.java:1713)  at com.carrotsearch.randomizedtesting.RandomizedRunner$8.evaluate(RandomizedRunner.java:907)  at com.carrotsearch.randomizedtesting.RandomizedRunner$9.evaluate(RandomizedRunner.java:943)  at com.carrotsearch.randomizedtesting.RandomizedRunner$10.evaluate(RandomizedRunner.java:957)  at com.carrotsearch.randomizedtesting.rules.SystemPropertiesRestoreRule$1.evaluate(SystemPropertiesRestoreRule.java:57)  at org.apache.lucene.util.TestRuleSetupTeardownChained$1.evaluate(TestRuleSetupTeardownChained.java:49)  at org.apache.lucene.util.AbstractBeforeAfterRule$1.evaluate(AbstractBeforeAfterRule.java:45)  at org.apache.lucene.util.TestRuleThreadAndTestName$1.evaluate(TestRuleThreadAndTestName.java:48)  at org.apache.lucene.util.TestRuleIgnoreAfterMaxFailures$1.evaluate(TestRuleIgnoreAfterMaxFailures.java:64)  at org.apache.lucene.util.TestRuleMarkFailure$1.evaluate(TestRuleMarkFailure.java:47)  at com.carrotsearch.randomizedtesting.rules.StatementAdapter.evaluate(StatementAdapter.java:36)  at com.carrotsearch.randomizedtesting.ThreadLeakControl$StatementRunner.run(ThreadLeakControl.java:368)  at com.carrotsearch.randomizedtesting.ThreadLeakControl.forkTimeoutingTask(ThreadLeakControl.java:817)  at com.carrotsearch.randomizedtesting.ThreadLeakControl$3.evaluate(ThreadLeakControl.java:468)  at com.carrotsearch.randomizedtesting.RandomizedRunner.runSingleTest(RandomizedRunner.java:916)  at com.carrotsearch.randomizedtesting.RandomizedRunner$5.evaluate(RandomizedRunner.java:802)  at com.carrotsearch.randomizedtesting.RandomizedRunner$6.evaluate(RandomizedRunner.java:852)  at com.carrotsearch.randomizedtesting.RandomizedRunner$7.evaluate(RandomizedRunner.java:863)  at com.carrotsearch.randomizedtesting.rules.StatementAdapter.evaluate(StatementAdapter.java:36)  at com.carrotsearch.randomizedtesting.rules.SystemPropertiesRestoreRule$1.evaluate(SystemPropertiesRestoreRule.java:57)  at org.apache.lucene.util.AbstractBeforeAfterRule$1.evaluate(AbstractBeforeAfterRule.java:45)  at com.carrotsearch.randomizedtesting.rules.StatementAdapter.evaluate(StatementAdapter.java:36)  at org.apache.lucene.util.TestRuleStoreClassName$1.evaluate(TestRuleStoreClassName.java:41)  at com.carrotsearch.randomizedtesting.rules.NoShadowingOrOverridesOnMethodsRule$1.evaluate(NoShadowingOrOverridesOnMethodsRule.java:40)  at com.carrotsearch.randomizedtesting.rules.NoShadowingOrOverridesOnMethodsRule$1.evaluate(NoShadowingOrOverridesOnMethodsRule.java:40)  at com.carrotsearch.randomizedtesting.rules.StatementAdapter.evaluate(StatementAdapter.java:36)  at com.carrotsearch.randomizedtesting.rules.StatementAdapter.evaluate(StatementAdapter.java:36)  at com.carrotsearch.randomizedtesting.rules.StatementAdapter.evaluate(StatementAdapter.java:36)  at org.apache.lucene.util.TestRuleAssertionsRequired$1.evaluate(TestRuleAssertionsRequired.java:53)  at org.apache.lucene.util.TestRuleMarkFailure$1.evaluate(TestRuleMarkFailure.java:47)  at org.apache.lucene.util.TestRuleIgnoreAfterMaxFailures$1.evaluate(TestRuleIgnoreAfterMaxFailures.java:64)  at org.apache.lucene.util.TestRuleIgnoreTestSuites$1.evaluate(TestRuleIgnoreTestSuites.java:54)  at com.carrotsearch.randomizedtesting.rules.StatementAdapter.evaluate(StatementAdapter.java:36)  at com.carrotsearch.randomizedtesting.ThreadLeakControl$StatementRunner.run(ThreadLeakControl.java:368)  at java.lang.Thread.run(Thread.java:745)  org.apache.solr.common.util.ObjectReleaseTracker$ObjectTrackerException  at org.apache.solr.common.util.ObjectReleaseTracker.track(ObjectReleaseTracker.java:43)  at org.apache.solr.core.CachingDirectoryFactory.get(CachingDirectoryFactory.java:347)  at org.apache.solr.core.MetricsDirectoryFactory.get(MetricsDirectoryFactory.java:201)  at org.apache.solr.core.SolrCore.getNewIndexDir(SolrCore.java:348)  at org.apache.solr.core.SolrCore.initIndex(SolrCore.java:673)  at org.apache.solr.core.SolrCore.<init>(SolrCore.java:890)  at org.apache.solr.core.SolrCore.<init>(SolrCore.java:807)  at org.apache.solr.core.CoreContainer.create(CoreContainer.java:904)  at org.apache.solr.core.CoreContainer.getCore(CoreContainer.java:1271)  at org.apache.solr.core.TestCoreDiscovery.testTooManyTransientCores(TestCoreDiscovery.java:211)  at sun.reflect.NativeMethodAccessorImpl.invoke0(Native Method)  at sun.reflect.NativeMethodAccessorImpl.invoke(NativeMethodAccessorImpl.java:62)  at sun.reflect.DelegatingMethodAccessorImpl.invoke(DelegatingMethodAccessorImpl.java:43)  at java.lang.reflect.Method.invoke(Method.java:498)  at com.carrotsearch.randomizedtesting.RandomizedRunner.invoke(RandomizedRunner.java:1713)  at com.carrotsearch.randomizedtesting.RandomizedRunner$8.evaluate(RandomizedRunner.java:907)  at com.carrotsearch.randomizedtesting.RandomizedRunner$9.evaluate(RandomizedRunner.java:943)  at com.carrotsearch.randomizedtesting.RandomizedRunner$10.evaluate(RandomizedRunner.java:957)  at com.carrotsearch.randomizedtesting.rules.SystemPropertiesRestoreRule$1.evaluate(SystemPropertiesRestoreRule.java:57)  at org.apache.lucene.util.TestRuleSetupTeardownChained$1.evaluate(TestRuleSetupTeardownChained.java:49)  at org.apache.lucene.util.AbstractBeforeAfterRule$1.evaluate(AbstractBeforeAfterRule.java:45)  at org.apache.lucene.util.TestRuleThreadAndTestName$1.evaluate(TestRuleThreadAndTestName.java:48)  at org.apache.lucene.util.TestRuleIgnoreAfterMaxFailures$1.evaluate(TestRuleIgnoreAfterMaxFailures.java:64)  at org.apache.lucene.util.TestRuleMarkFailure$1.evaluate(TestRuleMarkFailure.java:47)  at com.carrotsearch.randomizedtesting.rules.StatementAdapter.evaluate(StatementAdapter.java:36)  at com.carrotsearch.randomizedtesting.ThreadLeakControl$StatementRunner.run(ThreadLeakControl.java:368)  at com.carrotsearch.randomizedtesting.ThreadLeakControl.forkTimeoutingTask(ThreadLeakControl.java:817)  at com.carrotsearch.randomizedtesting.ThreadLeakControl$3.evaluate(ThreadLeakControl.java:468)  at com.carrotsearch.randomizedtesting.RandomizedRunner.runSingleTest(RandomizedRunner.java:916)  at com.carrotsearch.randomizedtesting.RandomizedRunner$5.evaluate(RandomizedRunner.java:802)  at com.carrotsearch.randomizedtesting.RandomizedRunner$6.evaluate(RandomizedRunner.java:852)  at com.carrotsearch.randomizedtesting.RandomizedRunner$7.evaluate(RandomizedRunner.java:863)  at com.carrotsearch.randomizedtesting.rules.StatementAdapter.evaluate(StatementAdapter.java:36)  at com.carrotsearch.randomizedtesting.rules.SystemPropertiesRestoreRule$1.evaluate(SystemPropertiesRestoreRule.java:57)  at org.apache.lucene.util.AbstractBeforeAfterRule$1.evaluate(AbstractBeforeAfterRule.java:45)  at com.carrotsearch.randomizedtesting.rules.StatementAdapter.evaluate(StatementAdapter.java:36)  at org.apache.lucene.util.TestRuleStoreClassName$1.evaluate(TestRuleStoreClassName.java:41)  at com.carrotsearch.randomizedtesting.rules.NoShadowingOrOverridesOnMethodsRule$1.evaluate(NoShadowingOrOverridesOnMethodsRule.java:40)  at com.carrotsearch.randomizedtesting.rules.NoShadowingOrOverridesOnMethodsRule$1.evaluate(NoShadowingOrOverridesOnMethodsRule.java:40)  at com.carrotsearch.randomizedtesting.rules.StatementAdapter.evaluate(StatementAdapter.java:36)  at com.carrotsearch.randomizedtesting.rules.StatementAdapter.evaluate(StatementAdapter.java:36)  at com.carrotsearch.randomizedtesting.rules.StatementAdapter.evaluate(StatementAdapter.java:36)  at org.apache.lucene.util.TestRuleAssertionsRequired$1.evaluate(TestRuleAssertionsRequired.java:53)  at org.apache.lucene.util.TestRuleMarkFailure$1.evaluate(TestRuleMarkFailure.java:47)  at org.apache.lucene.util.TestRuleIgnoreAfterMaxFailures$1.evaluate(TestRuleIgnoreAfterMaxFailures.java:64)  at org.apache.lucene.util.TestRuleIgnoreTestSuites$1.evaluate(TestRuleIgnoreTestSuites.java:54)  at com.carrotsearch.randomizedtesting.rules.StatementAdapter.evaluate(StatementAdapter.java:36)  at com.carrotsearch.randomizedtesting.ThreadLeakControl$StatementRunner.run(ThreadLeakControl.java:368)  at java.lang.Thread.run(Thread.java:745)  

Stack Trace:
java.lang.AssertionError: ObjectTracker found 5 object(s) that were not released!!! [MockDirectoryWrapper, MockDirectoryWrapper, SolrCore, MDCAwareThreadPoolExecutor, MockDirectoryWrapper]
org.apache.solr.common.util.ObjectReleaseTracker$ObjectTrackerException
	at org.apache.solr.common.util.ObjectReleaseTracker.track(ObjectReleaseTracker.java:43)
	at org.apache.solr.core.CachingDirectoryFactory.get(CachingDirectoryFactory.java:347)
	at org.apache.solr.core.MetricsDirectoryFactory.get(MetricsDirectoryFactory.java:201)
	at org.apache.solr.update.SolrIndexWriter.create(SolrIndexWriter.java:97)
	at org.apache.solr.core.SolrCore.initIndex(SolrCore.java:705)
	at org.apache.solr.core.SolrCore.<init>(SolrCore.java:890)
	at org.apache.solr.core.SolrCore.<init>(SolrCore.java:807)
	at org.apache.solr.core.CoreContainer.create(CoreContainer.java:904)
	at org.apache.solr.core.CoreContainer.getCore(CoreContainer.java:1271)
	at org.apache.solr.core.TestCoreDiscovery.testTooManyTransientCores(TestCoreDiscovery.java:211)
	at sun.reflect.NativeMethodAccessorImpl.invoke0(Native Method)
	at sun.reflect.NativeMethodAccessorImpl.invoke(NativeMethodAccessorImpl.java:62)
	at sun.reflect.DelegatingMethodAccessorImpl.invoke(DelegatingMethodAccessorImpl.java:43)
	at java.lang.reflect.Method.invoke(Method.java:498)
	at com.carrotsearch.randomizedtesting.RandomizedRunner.invoke(RandomizedRunner.java:1713)
	at com.carrotsearch.randomizedtesting.RandomizedRunner$8.evaluate(RandomizedRunner.java:907)
	at com.carrotsearch.randomizedtesting.RandomizedRunner$9.evaluate(RandomizedRunner.java:943)
	at com.carrotsearch.randomizedtesting.RandomizedRunner$10.evaluate(RandomizedRunner.java:957)
	at com.carrotsearch.randomizedtesting.rules.SystemPropertiesRestoreRule$1.evaluate(SystemPropertiesRestoreRule.java:57)
	at org.apache.lucene.util.TestRuleSetupTeardownChained$1.evaluate(TestRuleSetupTeardownChained.java:49)
	at org.apache.lucene.util.AbstractBeforeAfterRule$1.evaluate(AbstractBeforeAfterRule.java:45)
	at org.apache.lucene.util.TestRuleThreadAndTestName$1.evaluate(TestRuleThreadAndTestName.java:48)
	at org.apache.lucene.util.TestRuleIgnoreAfterMaxFailures$1.evaluate(TestRuleIgnoreAfterMaxFailures.java:64)
	at org.apache.lucene.util.TestRuleMarkFailure$1.evaluate(TestRuleMarkFailure.java:47)
	at com.carrotsearch.randomizedtesting.rules.StatementAdapter.evaluate(StatementAdapter.java:36)
	at com.carrotsearch.randomizedtesting.ThreadLeakControl$StatementRunner.run(ThreadLeakControl.java:368)
	at com.carrotsearch.randomizedtesting.ThreadLeakControl.forkTimeoutingTask(ThreadLeakControl.java:817)
	at com.carrotsearch.randomizedtesting.ThreadLeakControl$3.evaluate(ThreadLeakControl.java:468)
	at com.carrotsearch.randomizedtesting.RandomizedRunner.runSingleTest(RandomizedRunner.java:916)
	at com.carrotsearch.randomizedtesting.RandomizedRunner$5.evaluate(RandomizedRunner.java:802)
	at com.carrotsearch.randomizedtesting.RandomizedRunner$6.evaluate(RandomizedRunner.java:852)
	at com.carrotsearch.randomizedtesting.RandomizedRunner$7.evaluate(RandomizedRunner.java:863)
	at com.carrotsearch.randomizedtesting.rules.StatementAdapter.evaluate(StatementAdapter.java:36)
	at com.carrotsearch.randomizedtesting.rules.SystemPropertiesRestoreRule$1.evaluate(SystemPropertiesRestoreRule.java:57)
	at org.apache.lucene.util.AbstractBeforeAfterRule$1.evaluate(AbstractBeforeAfterRule.java:45)
	at com.carrotsearch.randomizedtesting.rules.StatementAdapter.evaluate(StatementAdapter.java:36)
	at org.apache.lucene.util.TestRuleStoreClassName$1.evaluate(TestRuleStoreClassName.java:41)
	at com.carrotsearch.randomizedtesting.rules.NoShadowingOrOverridesOnMethodsRule$1.evaluate(NoShadowingOrOverridesOnMethodsRule.java:40)
	at com.carrotsearch.randomizedtesting.rules.NoShadowingOrOverridesOnMethodsRule$1.evaluate(NoShadowingOrOverridesOnMethodsRule.java:40)
	at com.carrotsearch.randomizedtesting.rules.StatementAdapter.evaluate(StatementAdapter.java:36)
	at com.carrotsearch.randomizedtesting.rules.StatementAdapter.evaluate(StatementAdapter.java:36)
	at com.carrotsearch.randomizedtesting.rules.StatementAdapter.evaluate(StatementAdapter.java:36)
	at org.apache.lucene.util.TestRuleAssertionsRequired$1.evaluate(TestRuleAssertionsRequired.java:53)
	at org.apache.lucene.util.TestRuleMarkFailure$1.evaluate(TestRuleMarkFailure.java:47)
	at org.apache.lucene.util.TestRuleIgnoreAfterMaxFailures$1.evaluate(TestRuleIgnoreAfterMaxFailures.java:64)
	at org.apache.lucene.util.TestRuleIgnoreTestSuites$1.evaluate(TestRuleIgnoreTestSuites.java:54)
	at com.carrotsearch.randomizedtesting.rules.StatementAdapter.evaluate(StatementAdapter.java:36)
	at com.carrotsearch.randomizedtesting.ThreadLeakControl$StatementRunner.run(ThreadLeakControl.java:368)
	at java.lang.Thread.run(Thread.java:745)

org.apache.solr.common.util.ObjectReleaseTracker$ObjectTrackerException
	at org.apache.solr.common.util.ObjectReleaseTracker.track(ObjectReleaseTracker.java:43)
	at org.apache.solr.core.CachingDirectoryFactory.get(CachingDirectoryFactory.java:347)
	at org.apache.solr.core.MetricsDirectoryFactory.get(MetricsDirectoryFactory.java:201)
	at org.apache.solr.core.SolrCore.initSnapshotMetaDataManager(SolrCore.java:479)
	at org.apache.solr.core.SolrCore.<init>(SolrCore.java:884)
	at org.apache.solr.core.SolrCore.<init>(SolrCore.java:807)
	at org.apache.solr.core.CoreContainer.create(CoreContainer.java:904)
	at org.apache.solr.core.CoreContainer.getCore(CoreContainer.java:1271)
	at org.apache.solr.core.TestCoreDiscovery.testTooManyTransientCores(TestCoreDiscovery.java:211)
	at sun.reflect.NativeMethodAccessorImpl.invoke0(Native Method)
	at sun.reflect.NativeMethodAccessorImpl.invoke(NativeMethodAccessorImpl.java:62)
	at sun.reflect.DelegatingMethodAccessorImpl.invoke(DelegatingMethodAccessorImpl.java:43)
	at java.lang.reflect.Method.invoke(Method.java:498)
	at com.carrotsearch.randomizedtesting.RandomizedRunner.invoke(RandomizedRunner.java:1713)
	at com.carrotsearch.randomizedtesting.RandomizedRunner$8.evaluate(RandomizedRunner.java:907)
	at com.carrotsearch.randomizedtesting.RandomizedRunner$9.evaluate(RandomizedRunner.java:943)
	at com.carrotsearch.randomizedtesting.RandomizedRunner$10.evaluate(RandomizedRunner.java:957)
	at com.carrotsearch.randomizedtesting.rules.SystemPropertiesRestoreRule$1.evaluate(SystemPropertiesRestoreRule.java:57)
	at org.apache.lucene.util.TestRuleSetupTeardownChained$1.evaluate(TestRuleSetupTeardownChained.java:49)
	at org.apache.lucene.util.AbstractBeforeAfterRule$1.evaluate(AbstractBeforeAfterRule.java:45)
	at org.apache.lucene.util.TestRuleThreadAndTestName$1.evaluate(TestRuleThreadAndTestName.java:48)
	at org.apache.lucene.util.TestRuleIgnoreAfterMaxFailures$1.evaluate(TestRuleIgnoreAfterMaxFailures.java:64)
	at org.apache.lucene.util.TestRuleMarkFailure$1.evaluate(TestRuleMarkFailure.java:47)
	at com.carrotsearch.randomizedtesting.rules.StatementAdapter.evaluate(StatementAdapter.java:36)
	at com.carrotsearch.randomizedtesting.ThreadLeakControl$StatementRunner.run(ThreadLeakControl.java:368)
	at com.carrotsearch.randomizedtesting.ThreadLeakControl.forkTimeoutingTask(ThreadLeakControl.java:817)
	at com.carrotsearch.randomizedtesting.ThreadLeakControl$3.evaluate(ThreadLeakControl.java:468)
	at com.carrotsearch.randomizedtesting.RandomizedRunner.runSingleTest(RandomizedRunner.java:916)
	at com.carrotsearch.randomizedtesting.RandomizedRunner$5.evaluate(RandomizedRunner.java:802)
	at com.carrotsearch.randomizedtesting.RandomizedRunner$6.evaluate(RandomizedRunner.java:852)
	at com.carrotsearch.randomizedtesting.RandomizedRunner$7.evaluate(RandomizedRunner.java:863)
	at com.carrotsearch.randomizedtesting.rules.StatementAdapter.evaluate(StatementAdapter.java:36)
	at com.carrotsearch.randomizedtesting.rules.SystemPropertiesRestoreRule$1.evaluate(SystemPropertiesRestoreRule.java:57)
	at org.apache.lucene.util.AbstractBeforeAfterRule$1.evaluate(AbstractBeforeAfterRule.java:45)
	at com.carrotsearch.randomizedtesting.rules.StatementAdapter.evaluate(StatementAdapter.java:36)
	at org.apache.lucene.util.TestRuleStoreClassName$1.evaluate(TestRuleStoreClassName.java:41)
	at com.carrotsearch.randomizedtesting.rules.NoShadowingOrOverridesOnMethodsRule$1.evaluate(NoShadowingOrOverridesOnMethodsRule.java:40)
	at com.carrotsearch.randomizedtesting.rules.NoShadowingOrOverridesOnMethodsRule$1.evaluate(NoShadowingOrOverridesOnMethodsRule.java:40)
	at com.carrotsearch.randomizedtesting.rules.StatementAdapter.evaluate(StatementAdapter.java:36)
	at com.carrotsearch.randomizedtesting.rules.StatementAdapter.evaluate(StatementAdapter.java:36)
	at com.carrotsearch.randomizedtesting.rules.StatementAdapter.evaluate(StatementAdapter.java:36)
	at org.apache.lucene.util.TestRuleAssertionsRequired$1.evaluate(TestRuleAssertionsRequired.java:53)
	at org.apache.lucene.util.TestRuleMarkFailure$1.evaluate(TestRuleMarkFailure.java:47)
	at org.apache.lucene.util.TestRuleIgnoreAfterMaxFailures$1.evaluate(TestRuleIgnoreAfterMaxFailures.java:64)
	at org.apache.lucene.util.TestRuleIgnoreTestSuites$1.evaluate(TestRuleIgnoreTestSuites.java:54)
	at com.carrotsearch.randomizedtesting.rules.StatementAdapter.evaluate(StatementAdapter.java:36)
	at com.carrotsearch.randomizedtesting.ThreadLeakControl$StatementRunner.run(ThreadLeakControl.java:368)
	at java.lang.Thread.run(Thread.java:745)

org.apache.solr.common.util.ObjectReleaseTracker$ObjectTrackerException
	at org.apache.solr.common.util.ObjectReleaseTracker.track(ObjectReleaseTracker.java:43)
	at org.apache.solr.core.SolrCore.<init>(SolrCore.java:980)
	at org.apache.solr.core.SolrCore.<init>(SolrCore.java:807)
	at org.apache.solr.core.CoreContainer.create(CoreContainer.java:904)
	at org.apache.solr.core.CoreContainer.getCore(CoreContainer.java:1271)
	at org.apache.solr.core.TestCoreDiscovery.testTooManyTransientCores(TestCoreDiscovery.java:211)
	at sun.reflect.NativeMethodAccessorImpl.invoke0(Native Method)
	at sun.reflect.NativeMethodAccessorImpl.invoke(NativeMethodAccessorImpl.java:62)
	at sun.reflect.DelegatingMethodAccessorImpl.invoke(DelegatingMethodAccessorImpl.java:43)
	at java.lang.reflect.Method.invoke(Method.java:498)
	at com.carrotsearch.randomizedtesting.RandomizedRunner.invoke(RandomizedRunner.java:1713)
	at com.carrotsearch.randomizedtesting.RandomizedRunner$8.evaluate(RandomizedRunner.java:907)
	at com.carrotsearch.randomizedtesting.RandomizedRunner$9.evaluate(RandomizedRunner.java:943)
	at com.carrotsearch.randomizedtesting.RandomizedRunner$10.evaluate(RandomizedRunner.java:957)
	at com.carrotsearch.randomizedtesting.rules.SystemPropertiesRestoreRule$1.evaluate(SystemPropertiesRestoreRule.java:57)
	at org.apache.lucene.util.TestRuleSetupTeardownChained$1.evaluate(TestRuleSetupTeardownChained.java:49)
	at org.apache.lucene.util.AbstractBeforeAfterRule$1.evaluate(AbstractBeforeAfterRule.java:45)
	at org.apache.lucene.util.TestRuleThreadAndTestName$1.evaluate(TestRuleThreadAndTestName.java:48)
	at org.apache.lucene.util.TestRuleIgnoreAfterMaxFailures$1.evaluate(TestRuleIgnoreAfterMaxFailures.java:64)
	at org.apache.lucene.util.TestRuleMarkFailure$1.evaluate(TestRuleMarkFailure.java:47)
	at com.carrotsearch.randomizedtesting.rules.StatementAdapter.evaluate(StatementAdapter.java:36)
	at com.carrotsearch.randomizedtesting.ThreadLeakControl$StatementRunner.run(ThreadLeakControl.java:368)
	at com.carrotsearch.randomizedtesting.ThreadLeakControl.forkTimeoutingTask(ThreadLeakControl.java:817)
	at com.carrotsearch.randomizedtesting.ThreadLeakControl$3.evaluate(ThreadLeakControl.java:468)
	at com.carrotsearch.randomizedtesting.RandomizedRunner.runSingleTest(RandomizedRunner.java:916)
	at com.carrotsearch.randomizedtesting.RandomizedRunner$5.evaluate(RandomizedRunner.java:802)
	at com.carrotsearch.randomizedtesting.RandomizedRunner$6.evaluate(RandomizedRunner.java:852)
	at com.carrotsearch.randomizedtesting.RandomizedRunner$7.evaluate(RandomizedRunner.java:863)
	at com.carrotsearch.randomizedtesting.rules.StatementAdapter.evaluate(StatementAdapter.java:36)
	at com.carrotsearch.randomizedtesting.rules.SystemPropertiesRestoreRule$1.evaluate(SystemPropertiesRestoreRule.java:57)
	at org.apache.lucene.util.AbstractBeforeAfterRule$1.evaluate(AbstractBeforeAfterRule.java:45)
	at com.carrotsearch.randomizedtesting.rules.StatementAdapter.evaluate(StatementAdapter.java:36)
	at org.apache.lucene.util.TestRuleStoreClassName$1.evaluate(TestRuleStoreClassName.java:41)
	at com.carrotsearch.randomizedtesting.rules.NoShadowingOrOverridesOnMethodsRule$1.evaluate(NoShadowingOrOverridesOnMethodsRule.java:40)
	at com.carrotsearch.randomizedtesting.rules.NoShadowingOrOverridesOnMethodsRule$1.evaluate(NoShadowingOrOverridesOnMethodsRule.java:40)
	at com.carrotsearch.randomizedtesting.rules.StatementAdapter.evaluate(StatementAdapter.java:36)
	at com.carrotsearch.randomizedtesting.rules.StatementAdapter.evaluate(StatementAdapter.java:36)
	at com.carrotsearch.randomizedtesting.rules.StatementAdapter.evaluate(StatementAdapter.java:36)
	at org.apache.lucene.util.TestRuleAssertionsRequired$1.evaluate(TestRuleAssertionsRequired.java:53)
	at org.apache.lucene.util.TestRuleMarkFailure$1.evaluate(TestRuleMarkFailure.java:47)
	at org.apache.lucene.util.TestRuleIgnoreAfterMaxFailures$1.evaluate(TestRuleIgnoreAfterMaxFailures.java:64)
	at org.apache.lucene.util.TestRuleIgnoreTestSuites$1.evaluate(TestRuleIgnoreTestSuites.java:54)
	at com.carrotsearch.randomizedtesting.rules.StatementAdapter.evaluate(StatementAdapter.java:36)
	at com.carrotsearch.randomizedtesting.ThreadLeakControl$StatementRunner.run(ThreadLeakControl.java:368)
	at java.lang.Thread.run(Thread.java:745)

org.apache.solr.common.util.ObjectReleaseTracker$ObjectTrackerException
	at org.apache.solr.common.util.ObjectReleaseTracker.track(ObjectReleaseTracker.java:43)
	at org.apache.solr.core.SolrCore.<init>(SolrCore.java:830)
	at org.apache.solr.core.SolrCore.<init>(SolrCore.java:807)
	at org.apache.solr.core.CoreContainer.create(CoreContainer.java:904)
	at org.apache.solr.core.CoreContainer.getCore(CoreContainer.java:1271)
	at org.apache.solr.core.TestCoreDiscovery.testTooManyTransientCores(TestCoreDiscovery.java:211)
	at sun.reflect.NativeMethodAccessorImpl.invoke0(Native Method)
	at sun.reflect.NativeMethodAccessorImpl.invoke(NativeMethodAccessorImpl.java:62)
	at sun.reflect.DelegatingMethodAccessorImpl.invoke(DelegatingMethodAccessorImpl.java:43)
	at java.lang.reflect.Method.invoke(Method.java:498)
	at com.carrotsearch.randomizedtesting.RandomizedRunner.invoke(RandomizedRunner.java:1713)
	at com.carrotsearch.randomizedtesting.RandomizedRunner$8.evaluate(RandomizedRunner.java:907)
	at com.carrotsearch.randomizedtesting.RandomizedRunner$9.evaluate(RandomizedRunner.java:943)
	at com.carrotsearch.randomizedtesting.RandomizedRunner$10.evaluate(RandomizedRunner.java:957)
	at com.carrotsearch.randomizedtesting.rules.SystemPropertiesRestoreRule$1.evaluate(SystemPropertiesRestoreRule.java:57)
	at org.apache.lucene.util.TestRuleSetupTeardownChained$1.evaluate(TestRuleSetupTeardownChained.java:49)
	at org.apache.lucene.util.AbstractBeforeAfterRule$1.evaluate(AbstractBeforeAfterRule.java:45)
	at org.apache.lucene.util.TestRuleThreadAndTestName$1.evaluate(TestRuleThreadAndTestName.java:48)
	at org.apache.lucene.util.TestRuleIgnoreAfterMaxFailures$1.evaluate(TestRuleIgnoreAfterMaxFailures.java:64)
	at org.apache.lucene.util.TestRuleMarkFailure$1.evaluate(TestRuleMarkFailure.java:47)
	at com.carrotsearch.randomizedtesting.rules.StatementAdapter.evaluate(StatementAdapter.java:36)
	at com.carrotsearch.randomizedtesting.ThreadLeakControl$StatementRunner.run(ThreadLeakControl.java:368)
	at com.carrotsearch.randomizedtesting.ThreadLeakControl.forkTimeoutingTask(ThreadLeakControl.java:817)
	at com.carrotsearch.randomizedtesting.ThreadLeakControl$3.evaluate(ThreadLeakControl.java:468)
	at com.carrotsearch.randomizedtesting.RandomizedRunner.runSingleTest(RandomizedRunner.java:916)
	at com.carrotsearch.randomizedtesting.RandomizedRunner$5.evaluate(RandomizedRunner.java:802)
	at com.carrotsearch.randomizedtesting.RandomizedRunner$6.evaluate(RandomizedRunner.java:852)
	at com.carrotsearch.randomizedtesting.RandomizedRunner$7.evaluate(RandomizedRunner.java:863)
	at com.carrotsearch.randomizedtesting.rules.StatementAdapter.evaluate(StatementAdapter.java:36)
	at com.carrotsearch.randomizedtesting.rules.SystemPropertiesRestoreRule$1.evaluate(SystemPropertiesRestoreRule.java:57)
	at org.apache.lucene.util.AbstractBeforeAfterRule$1.evaluate(AbstractBeforeAfterRule.java:45)
	at com.carrotsearch.randomizedtesting.rules.StatementAdapter.evaluate(StatementAdapter.java:36)
	at org.apache.lucene.util.TestRuleStoreClassName$1.evaluate(TestRuleStoreClassName.java:41)
	at com.carrotsearch.randomizedtesting.rules.NoShadowingOrOverridesOnMethodsRule$1.evaluate(NoShadowingOrOverridesOnMethodsRule.java:40)
	at com.carrotsearch.randomizedtesting.rules.NoShadowingOrOverridesOnMethodsRule$1.evaluate(NoShadowingOrOverridesOnMethodsRule.java:40)
	at com.carrotsearch.randomizedtesting.rules.StatementAdapter.evaluate(StatementAdapter.java:36)
	at com.carrotsearch.randomizedtesting.rules.StatementAdapter.evaluate(StatementAdapter.java:36)
	at com.carrotsearch.randomizedtesting.rules.StatementAdapter.evaluate(StatementAdapter.java:36)
	at org.apache.lucene.util.TestRuleAssertionsRequired$1.evaluate(TestRuleAssertionsRequired.java:53)
	at org.apache.lucene.util.TestRuleMarkFailure$1.evaluate(TestRuleMarkFailure.java:47)
	at org.apache.lucene.util.TestRuleIgnoreAfterMaxFailures$1.evaluate(TestRuleIgnoreAfterMaxFailures.java:64)
	at org.apache.lucene.util.TestRuleIgnoreTestSuites$1.evaluate(TestRuleIgnoreTestSuites.java:54)
	at com.carrotsearch.randomizedtesting.rules.StatementAdapter.evaluate(StatementAdapter.java:36)
	at com.carrotsearch.randomizedtesting.ThreadLeakControl$StatementRunner.run(ThreadLeakControl.java:368)
	at java.lang.Thread.run(Thread.java:745)

org.apache.solr.common.util.ObjectReleaseTracker$ObjectTrackerException
	at org.apache.solr.common.util.ObjectReleaseTracker.track(ObjectReleaseTracker.java:43)
	at org.apache.solr.core.CachingDirectoryFactory.get(CachingDirectoryFactory.java:347)
	at org.apache.solr.core.MetricsDirectoryFactory.get(MetricsDirectoryFactory.java:201)
	at org.apache.solr.core.SolrCore.getNewIndexDir(SolrCore.java:348)
	at org.apache.solr.core.SolrCore.initIndex(SolrCore.java:673)
	at org.apache.solr.core.SolrCore.<init>(SolrCore.java:890)
	at org.apache.solr.core.SolrCore.<init>(SolrCore.java:807)
	at org.apache.solr.core.CoreContainer.create(CoreContainer.java:904)
	at org.apache.solr.core.CoreContainer.getCore(CoreContainer.java:1271)
	at org.apache.solr.core.TestCoreDiscovery.testTooManyTransientCores(TestCoreDiscovery.java:211)
	at sun.reflect.NativeMethodAccessorImpl.invoke0(Native Method)
	at sun.reflect.NativeMethodAccessorImpl.invoke(NativeMethodAccessorImpl.java:62)
	at sun.reflect.DelegatingMethodAccessorImpl.invoke(DelegatingMethodAccessorImpl.java:43)
	at java.lang.reflect.Method.invoke(Method.java:498)
	at com.carrotsearch.randomizedtesting.RandomizedRunner.invoke(RandomizedRunner.java:1713)
	at com.carrotsearch.randomizedtesting.RandomizedRunner$8.evaluate(RandomizedRunner.java:907)
	at com.carrotsearch.randomizedtesting.RandomizedRunner$9.evaluate(RandomizedRunner.java:943)
	at com.carrotsearch.randomizedtesting.RandomizedRunner$10.evaluate(RandomizedRunner.java:957)
	at com.carrotsearch.randomizedtesting.rules.SystemPropertiesRestoreRule$1.evaluate(SystemPropertiesRestoreRule.java:57)
	at org.apache.lucene.util.TestRuleSetupTeardownChained$1.evaluate(TestRuleSetupTeardownChained.java:49)
	at org.apache.lucene.util.AbstractBeforeAfterRule$1.evaluate(AbstractBeforeAfterRule.java:45)
	at org.apache.lucene.util.TestRuleThreadAndTestName$1.evaluate(TestRuleThreadAndTestName.java:48)
	at org.apache.lucene.util.TestRuleIgnoreAfterMaxFailures$1.evaluate(TestRuleIgnoreAfterMaxFailures.java:64)
	at org.apache.lucene.util.TestRuleMarkFailure$1.evaluate(TestRuleMarkFailure.java:47)
	at com.carrotsearch.randomizedtesting.rules.StatementAdapter.evaluate(StatementAdapter.java:36)
	at com.carrotsearch.randomizedtesting.ThreadLeakControl$StatementRunner.run(ThreadLeakControl.java:368)
	at com.carrotsearch.randomizedtesting.ThreadLeakControl.forkTimeoutingTask(ThreadLeakControl.java:817)
	at com.carrotsearch.randomizedtesting.ThreadLeakControl$3.evaluate(ThreadLeakControl.java:468)
	at com.carrotsearch.randomizedtesting.RandomizedRunner.runSingleTest(RandomizedRunner.java:916)
	at com.carrotsearch.randomizedtesting.RandomizedRunner$5.evaluate(RandomizedRunner.java:802)
	at com.carrotsearch.randomizedtesting.RandomizedRunner$6.evaluate(RandomizedRunner.java:852)
	at com.carrotsearch.randomizedtesting.RandomizedRunner$7.evaluate(RandomizedRunner.java:863)
	at com.carrotsearch.randomizedtesting.rules.StatementAdapter.evaluate(StatementAdapter.java:36)
	at com.carrotsearch.randomizedtesting.rules.SystemPropertiesRestoreRule$1.evaluate(SystemPropertiesRestoreRule.java:57)
	at org.apache.lucene.util.AbstractBeforeAfterRule$1.evaluate(AbstractBeforeAfterRule.java:45)
	at com.carrotsearch.randomizedtesting.rules.StatementAdapter.evaluate(StatementAdapter.java:36)
	at org.apache.lucene.util.TestRuleStoreClassName$1.evaluate(TestRuleStoreClassName.java:41)
	at com.carrotsearch.randomizedtesting.rules.NoShadowingOrOverridesOnMethodsRule$1.evaluate(NoShadowingOrOverridesOnMethodsRule.java:40)
	at com.carrotsearch.randomizedtesting.rules.NoShadowingOrOverridesOnMethodsRule$1.evaluate(NoShadowingOrOverridesOnMethodsRule.java:40)
	at com.carrotsearch.randomizedtesting.rules.StatementAdapter.evaluate(StatementAdapter.java:36)
	at com.carrotsearch.randomizedtesting.rules.StatementAdapter.evaluate(StatementAdapter.java:36)
	at com.carrotsearch.randomizedtesting.rules.StatementAdapter.evaluate(StatementAdapter.java:36)
	at org.apache.lucene.util.TestRuleAssertionsRequired$1.evaluate(TestRuleAssertionsRequired.java:53)
	at org.apache.lucene.util.TestRuleMarkFailure$1.evaluate(TestRuleMarkFailure.java:47)
	at org.apache.lucene.util.TestRuleIgnoreAfterMaxFailures$1.evaluate(TestRuleIgnoreAfterMaxFailures.java:64)
	at org.apache.lucene.util.TestRuleIgnoreTestSuites$1.evaluate(TestRuleIgnoreTestSuites.java:54)
	at com.carrotsearch.randomizedtesting.rules.StatementAdapter.evaluate(StatementAdapter.java:36)
	at com.carrotsearch.randomizedtesting.ThreadLeakControl$StatementRunner.run(ThreadLeakControl.java:368)
	at java.lang.Thread.run(Thread.java:745)


	at __randomizedtesting.SeedInfo.seed([BE5D71744DEF9AAC]:0)
	at org.junit.Assert.fail(Assert.java:93)
	at org.junit.Assert.assertTrue(Assert.java:43)
	at org.junit.Assert.assertNull(Assert.java:551)
	at org.apache.solr.SolrTestCaseJ4.teardownTestCases(SolrTestCaseJ4.java:269)
	at sun.reflect.GeneratedMethodAccessor27.invoke(Unknown Source)
	at sun.reflect.DelegatingMethodAccessorImpl.invoke(DelegatingMethodAccessorImpl.java:43)
	at java.lang.reflect.Method.invoke(Method.java:498)
	at com.carrotsearch.randomizedtesting.RandomizedRunner.invoke(RandomizedRunner.java:1713)
	at com.carrotsearch.randomizedtesting.RandomizedRunner$7.evaluate(RandomizedRunner.java:870)
	at com.carrotsearch.randomizedtesting.rules.StatementAdapter.evaluate(StatementAdapter.java:36)
	at com.carrotsearch.randomizedtesting.rules.SystemPropertiesRestoreRule$1.evaluate(SystemPropertiesRestoreRule.java:57)
	at org.apache.lucene.util.AbstractBeforeAfterRule$1.evaluate(AbstractBeforeAfterRule.java:45)
	at com.carrotsearch.randomizedtesting.rules.StatementAdapter.evaluate(StatementAdapter.java:36)
	at org.apache.lucene.util.TestRuleStoreClassName$1.evaluate(TestRuleStoreClassName.java:41)
	at com.carrotsearch.randomizedtesting.rules.NoShadowingOrOverridesOnMethodsRule$1.evaluate(NoShadowingOrOverridesOnMethodsRule.java:40)
	at com.carrotsearch.randomizedtesting.rules.NoShadowingOrOverridesOnMethodsRule$1.evaluate(NoShadowingOrOverridesOnMethodsRule.java:40)
	at com.carrotsearch.randomizedtesting.rules.StatementAdapter.evaluate(StatementAdapter.java:36)
	at com.carrotsearch.randomizedtesting.rules.StatementAdapter.evaluate(StatementAdapter.java:36)
	at com.carrotsearch.randomizedtesting.rules.StatementAdapter.evaluate(StatementAdapter.java:36)
	at org.apache.lucene.util.TestRuleAssertionsRequired$1.evaluate(TestRuleAssertionsRequired.java:53)
	at org.apache.lucene.util.TestRuleMarkFailure$1.evaluate(TestRuleMarkFailure.java:47)
	at org.apache.lucene.util.TestRuleIgnoreAfterMaxFailures$1.evaluate(TestRuleIgnoreAfterMaxFailures.java:64)
	at org.apache.lucene.util.TestRuleIgnoreTestSuites$1.evaluate(TestRuleIgnoreTestSuites.java:54)
	at com.carrotsearch.randomizedtesting.rules.StatementAdapter.evaluate(StatementAdapter.java:36)
	at com.carrotsearch.randomizedtesting.ThreadLeakControl$StatementRunner.run(ThreadLeakControl.java:368)
	at java.lang.Thread.run(Thread.java:745)


FAILED:  junit.framework.TestSuite.org.apache.solr.core.TestCoreDiscovery

Error Message:
1 thread leaked from SUITE scope at org.apache.solr.core.TestCoreDiscovery:     1) Thread[id=1931, name=searcherExecutor-732-thread-1, state=WAITING, group=TGRP-TestCoreDiscovery]         at sun.misc.Unsafe.park(Native Method)         at java.util.concurrent.locks.LockSupport.park(LockSupport.java:175)         at java.util.concurrent.locks.AbstractQueuedSynchronizer$ConditionObject.await(AbstractQueuedSynchronizer.java:2039)         at java.util.concurrent.LinkedBlockingQueue.take(LinkedBlockingQueue.java:442)         at java.util.concurrent.ThreadPoolExecutor.getTask(ThreadPoolExecutor.java:1067)         at java.util.concurrent.ThreadPoolExecutor.runWorker(ThreadPoolExecutor.java:1127)         at java.util.concurrent.ThreadPoolExecutor$Worker.run(ThreadPoolExecutor.java:617)         at java.lang.Thread.run(Thread.java:745)

Stack Trace:
com.carrotsearch.randomizedtesting.ThreadLeakError: 1 thread leaked from SUITE scope at org.apache.solr.core.TestCoreDiscovery: 
   1) Thread[id=1931, name=searcherExecutor-732-thread-1, state=WAITING, group=TGRP-TestCoreDiscovery]
        at sun.misc.Unsafe.park(Native Method)
        at java.util.concurrent.locks.LockSupport.park(LockSupport.java:175)
        at java.util.concurrent.locks.AbstractQueuedSynchronizer$ConditionObject.await(AbstractQueuedSynchronizer.java:2039)
        at java.util.concurrent.LinkedBlockingQueue.take(LinkedBlockingQueue.java:442)
        at java.util.concurrent.ThreadPoolExecutor.getTask(ThreadPoolExecutor.java:1067)
        at java.util.concurrent.ThreadPoolExecutor.runWorker(ThreadPoolExecutor.java:1127)
        at java.util.concurrent.ThreadPoolExecutor$Worker.run(ThreadPoolExecutor.java:617)
        at java.lang.Thread.run(Thread.java:745)
	at __randomizedtesting.SeedInfo.seed([BE5D71744DEF9AAC]:0)


FAILED:  junit.framework.TestSuite.org.apache.solr.core.TestCoreDiscovery

Error Message:
There are still zombie threads that couldn't be terminated:    1) Thread[id=1931, name=searcherExecutor-732-thread-1, state=WAITING, group=TGRP-TestCoreDiscovery]         at sun.misc.Unsafe.park(Native Method)         at java.util.concurrent.locks.LockSupport.park(LockSupport.java:175)         at java.util.concurrent.locks.AbstractQueuedSynchronizer$ConditionObject.await(AbstractQueuedSynchronizer.java:2039)         at java.util.concurrent.LinkedBlockingQueue.take(LinkedBlockingQueue.java:442)         at java.util.concurrent.ThreadPoolExecutor.getTask(ThreadPoolExecutor.java:1067)         at java.util.concurrent.ThreadPoolExecutor.runWorker(ThreadPoolExecutor.java:1127)         at java.util.concurrent.ThreadPoolExecutor$Worker.run(ThreadPoolExecutor.java:617)         at java.lang.Thread.run(Thread.java:745)

Stack Trace:
com.carrotsearch.randomizedtesting.ThreadLeakError: There are still zombie threads that couldn't be terminated:
   1) Thread[id=1931, name=searcherExecutor-732-thread-1, state=WAITING, group=TGRP-TestCoreDiscovery]
        at sun.misc.Unsafe.park(Native Method)
        at java.util.concurrent.locks.LockSupport.park(LockSupport.java:175)
        at java.util.concurrent.locks.AbstractQueuedSynchronizer$ConditionObject.await(AbstractQueuedSynchronizer.java:2039)
        at java.util.concurrent.LinkedBlockingQueue.take(LinkedBlockingQueue.java:442)
        at java.util.concurrent.ThreadPoolExecutor.getTask(ThreadPoolExecutor.java:1067)
        at java.util.concurrent.ThreadPoolExecutor.runWorker(ThreadPoolExecutor.java:1127)
        at java.util.concurrent.ThreadPoolExecutor$Worker.run(ThreadPoolExecutor.java:617)
        at java.lang.Thread.run(Thread.java:745)
	at __randomizedtesting.SeedInfo.seed([BE5D71744DEF9AAC]:0)


FAILED:  org.apache.solr.handler.component.TestDistributedStatsComponentCardinality.test

Error Message:
int_i: goodEst=13931, poorEst=13970, real=13960, p=q=id:[276+TO+14235]&rows=0&stats=true&stats.field={!cardinality%3D0.01839004745517031+key%3Dlow_int_i}int_i&stats.field={!cardinality%3D0.01839004745517031+key%3Dlow_int_i_prehashed_l+hllPreHashed%3Dtrue}int_i_prehashed_l&stats.field={!cardinality%3D0.5183900474551704+key%3Dhigh_int_i}int_i&stats.field={!cardinality%3D0.5183900474551704+key%3Dhigh_int_i_prehashed_l+hllPreHashed%3Dtrue}int_i_prehashed_l&stats.field={!cardinality%3D0.01839004745517031+key%3Dlow_long_l}long_l&stats.field={!cardinality%3D0.01839004745517031+key%3Dlow_long_l_prehashed_l+hllPreHashed%3Dtrue}long_l_prehashed_l&stats.field={!cardinality%3D0.5183900474551704+key%3Dhigh_long_l}long_l&stats.field={!cardinality%3D0.5183900474551704+key%3Dhigh_long_l_prehashed_l+hllPreHashed%3Dtrue}long_l_prehashed_l&stats.field={!cardinality%3D0.01839004745517031+key%3Dlow_string_s}string_s&stats.field={!cardinality%3D0.01839004745517031+key%3Dlow_string_s_prehashed_l+hllPreHashed%3Dtrue}string_s_prehashed_l&stats.field={!cardinality%3D0.5183900474551704+key%3Dhigh_string_s}string_s&stats.field={!cardinality%3D0.5183900474551704+key%3Dhigh_string_s_prehashed_l+hllPreHashed%3Dtrue}string_s_prehashed_l

Stack Trace:
java.lang.AssertionError: int_i: goodEst=13931, poorEst=13970, real=13960, p=q=id:[276+TO+14235]&rows=0&stats=true&stats.field={!cardinality%3D0.01839004745517031+key%3Dlow_int_i}int_i&stats.field={!cardinality%3D0.01839004745517031+key%3Dlow_int_i_prehashed_l+hllPreHashed%3Dtrue}int_i_prehashed_l&stats.field={!cardinality%3D0.5183900474551704+key%3Dhigh_int_i}int_i&stats.field={!cardinality%3D0.5183900474551704+key%3Dhigh_int_i_prehashed_l+hllPreHashed%3Dtrue}int_i_prehashed_l&stats.field={!cardinality%3D0.01839004745517031+key%3Dlow_long_l}long_l&stats.field={!cardinality%3D0.01839004745517031+key%3Dlow_long_l_prehashed_l+hllPreHashed%3Dtrue}long_l_prehashed_l&stats.field={!cardinality%3D0.5183900474551704+key%3Dhigh_long_l}long_l&stats.field={!cardinality%3D0.5183900474551704+key%3Dhigh_long_l_prehashed_l+hllPreHashed%3Dtrue}long_l_prehashed_l&stats.field={!cardinality%3D0.01839004745517031+key%3Dlow_string_s}string_s&stats.field={!cardinality%3D0.01839004745517031+key%3Dlow_string_s_prehashed_l+hllPreHashed%3Dtrue}string_s_prehashed_l&stats.field={!cardinality%3D0.5183900474551704+key%3Dhigh_string_s}string_s&stats.field={!cardinality%3D0.5183900474551704+key%3Dhigh_string_s_prehashed_l+hllPreHashed%3Dtrue}string_s_prehashed_l
	at __randomizedtesting.SeedInfo.seed([BE5D71744DEF9AAC:36094EAEE313F754]:0)
	at org.junit.Assert.fail(Assert.java:93)
	at org.junit.Assert.assertTrue(Assert.java:43)
	at org.apache.solr.handler.component.TestDistributedStatsComponentCardinality.test(TestDistributedStatsComponentCardinality.java:217)
	at sun.reflect.NativeMethodAccessorImpl.invoke0(Native Method)
	at sun.reflect.NativeMethodAccessorImpl.invoke(NativeMethodAccessorImpl.java:62)
	at sun.reflect.DelegatingMethodAccessorImpl.invoke(DelegatingMethodAccessorImpl.java:43)
	at java.lang.reflect.Method.invoke(Method.java:498)
	at com.carrotsearch.randomizedtesting.RandomizedRunner.invoke(RandomizedRunner.java:1713)
	at com.carrotsearch.randomizedtesting.RandomizedRunner$8.evaluate(RandomizedRunner.java:907)
	at com.carrotsearch.randomizedtesting.RandomizedRunner$9.evaluate(RandomizedRunner.java:943)
	at com.carrotsearch.randomizedtesting.RandomizedRunner$10.evaluate(RandomizedRunner.java:957)
	at org.apache.solr.BaseDistributedSearchTestCase$ShardsRepeatRule$ShardsFixedStatement.callStatement(BaseDistributedSearchTestCase.java:992)
	at org.apache.solr.BaseDistributedSearchTestCase$ShardsRepeatRule$ShardsStatement.evaluate(BaseDistributedSearchTestCase.java:967)
	at com.carrotsearch.randomizedtesting.rules.SystemPropertiesRestoreRule$1.evaluate(SystemPropertiesRestoreRule.java:57)
	at org.apache.lucene.util.TestRuleSetupTeardownChained$1.evaluate(TestRuleSetupTeardownChained.java:49)
	at org.apache.lucene.util.AbstractBeforeAfterRule$1.evaluate(AbstractBeforeAfterRule.java:45)
	at org.apache.lucene.util.TestRuleThreadAndTestName$1.evaluate(TestRuleThreadAndTestName.java:48)
	at org.apache.lucene.util.TestRuleIgnoreAfterMaxFailures$1.evaluate(TestRuleIgnoreAfterMaxFailures.java:64)
	at org.apache.lucene.util.TestRuleMarkFailure$1.evaluate(TestRuleMarkFailure.java:47)
	at com.carrotsearch.randomizedtesting.rules.StatementAdapter.evaluate(StatementAdapter.java:36)
	at com.carrotsearch.randomizedtesting.ThreadLeakControl$StatementRunner.run(ThreadLeakControl.java:368)
	at com.carrotsearch.randomizedtesting.ThreadLeakControl.forkTimeoutingTask(ThreadLeakControl.java:817)
	at com.carrotsearch.randomizedtesting.ThreadLeakControl$3.evaluate(ThreadLeakControl.java:468)
	at com.carrotsearch.randomizedtesting.RandomizedRunner.runSingleTest(RandomizedRunner.java:916)
	at com.carrotsearch.randomizedtesting.RandomizedRunner$5.evaluate(RandomizedRunner.java:802)
	at com.carrotsearch.randomizedtesting.RandomizedRunner$6.evaluate(RandomizedRunner.java:852)
	at com.carrotsearch.randomizedtesting.RandomizedRunner$7.evaluate(RandomizedRunner.java:863)
	at com.carrotsearch.randomizedtesting.rules.StatementAdapter.evaluate(StatementAdapter.java:36)
	at com.carrotsearch.randomizedtesting.rules.SystemPropertiesRestoreRule$1.evaluate(SystemPropertiesRestoreRule.java:57)
	at org.apache.lucene.util.AbstractBeforeAfterRule$1.evaluate(AbstractBeforeAfterRule.java:45)
	at com.carrotsearch.randomizedtesting.rules.StatementAdapter.evaluate(StatementAdapter.java:36)
	at org.apache.lucene.util.TestRuleStoreClassName$1.evaluate(TestRuleStoreClassName.java:41)
	at com.carrotsearch.randomizedtesting.rules.NoShadowingOrOverridesOnMethodsRule$1.evaluate(NoShadowingOrOverridesOnMethodsRule.java:40)
	at com.carrotsearch.randomizedtesting.rules.NoShadowingOrOverridesOnMethodsRule$1.evaluate(NoShadowingOrOverridesOnMethodsRule.java:40)
	at com.carrotsearch.randomizedtesting.rules.StatementAdapter.evaluate(StatementAdapter.java:36)
	at com.carrotsearch.randomizedtesting.rules.StatementAdapter.evaluate(StatementAdapter.java:36)
	at com.carrotsearch.randomizedtesting.rules.StatementAdapter.evaluate(StatementAdapter.java:36)
	at org.apache.lucene.util.TestRuleAssertionsRequired$1.evaluate(TestRuleAssertionsRequired.java:53)
	at org.apache.lucene.util.TestRuleMarkFailure$1.evaluate(TestRuleMarkFailure.java:47)
	at org.apache.lucene.util.TestRuleIgnoreAfterMaxFailures$1.evaluate(TestRuleIgnoreAfterMaxFailures.java:64)
	at org.apache.lucene.util.TestRuleIgnoreTestSuites$1.evaluate(TestRuleIgnoreTestSuites.java:54)
	at com.carrotsearch.randomizedtesting.rules.StatementAdapter.evaluate(StatementAdapter.java:36)
	at com.carrotsearch.randomizedtesting.ThreadLeakControl$StatementRunner.run(ThreadLeakControl.java:368)
	at java.lang.Thread.run(Thread.java:745)




Build Log:
[...truncated 11212 lines...]
   [junit4] Suite: org.apache.solr.core.TestCoreDiscovery
   [junit4]   2> Creating dataDir: /x1/jenkins/jenkins-slave/workspace/Lucene-Solr-Tests-6.x/solr/build/solr-core/test/J2/temp/solr.core.TestCoreDiscovery_BE5D71744DEF9AAC-001/init-core-data-001
   [junit4]   2> 264046 INFO  (SUITE-TestCoreDiscovery-seed#[BE5D71744DEF9AAC]-worker) [    ] o.a.s.SolrTestCaseJ4 Randomized ssl (true) and clientAuth (true) via: @org.apache.solr.util.RandomizeSSL(reason=, ssl=NaN, value=NaN, clientAuth=NaN)
   [junit4]   2> 264047 INFO  (SUITE-TestCoreDiscovery-seed#[BE5D71744DEF9AAC]-worker) [    ] o.a.s.SolrTestCaseJ4 ####initCore
   [junit4]   2> 264047 INFO  (SUITE-TestCoreDiscovery-seed#[BE5D71744DEF9AAC]-worker) [    ] o.a.s.SolrTestCaseJ4 ####initCore end
   [junit4]   2> 264059 INFO  (TEST-TestCoreDiscovery.testCoreDirCantRead-seed#[BE5D71744DEF9AAC]) [    ] o.a.s.SolrTestCaseJ4 ###Starting testCoreDirCantRead
   [junit4]   2> 264064 INFO  (TEST-TestCoreDiscovery.testCoreDirCantRead-seed#[BE5D71744DEF9AAC]) [    ] o.a.s.c.SolrXmlConfig Loading container configuration from /x1/jenkins/jenkins-slave/workspace/Lucene-Solr-Tests-6.x/solr/build/solr-core/test/J2/temp/solr.core.TestCoreDiscovery_BE5D71744DEF9AAC-001/tempDir-001/solr.xml
   [junit4]   2> 264077 INFO  (TEST-TestCoreDiscovery.testCoreDirCantRead-seed#[BE5D71744DEF9AAC]) [    ] o.a.s.u.UpdateShardHandler Creating UpdateShardHandler HTTP client with params: socketTimeout=600000&connTimeout=60000&retry=true
   [junit4]   2> 264078 INFO  (TEST-TestCoreDiscovery.testCoreDirCantRead-seed#[BE5D71744DEF9AAC]) [    ] o.a.s.c.SolrCores Allocating transient cache for 2 transient cores
   [junit4]   2> 264081 WARN  (TEST-TestCoreDiscovery.testCoreDirCantRead-seed#[BE5D71744DEF9AAC]) [    ] o.a.s.c.CorePropertiesLocator Error visiting /x1/jenkins/jenkins-slave/workspace/Lucene-Solr-Tests-6.x/solr/build/solr-core/test/J2/temp/solr.core.TestCoreDiscovery_BE5D71744DEF9AAC-001/tempDir-001/core1: java.nio.file.AccessDeniedException: /x1/jenkins/jenkins-slave/workspace/Lucene-Solr-Tests-6.x/solr/build/solr-core/test/J2/temp/solr.core.TestCoreDiscovery_BE5D71744DEF9AAC-001/tempDir-001/core1
   [junit4]   2> 264081 INFO  (TEST-TestCoreDiscovery.testCoreDirCantRead-seed#[BE5D71744DEF9AAC]) [    ] o.a.s.c.CorePropertiesLocator Found 1 core definitions underneath /x1/jenkins/jenkins-slave/workspace/Lucene-Solr-Tests-6.x/solr/build/solr-core/test/J2/temp/solr.core.TestCoreDiscovery_BE5D71744DEF9AAC-001/tempDir-001
   [junit4]   2> 264082 INFO  (TEST-TestCoreDiscovery.testCoreDirCantRead-seed#[BE5D71744DEF9AAC]) [    ] o.a.s.c.CorePropertiesLocator Cores are: [core2]
   [junit4]   2> 264101 WARN  (TEST-TestCoreDiscovery.testCoreDirCantRead-seed#[BE5D71744DEF9AAC]) [    x:core2] o.a.s.c.Config Beginning with Solr 5.5, <mergePolicy> is deprecated, use <mergePolicyFactory> instead.
   [junit4]   2> 264102 INFO  (TEST-TestCoreDiscovery.testCoreDirCantRead-seed#[BE5D71744DEF9AAC]) [    x:core2] o.a.s.c.SolrConfig Using Lucene MatchVersion: 6.5.0
   [junit4]   2> 264110 INFO  (TEST-TestCoreDiscovery.testCoreDirCantRead-seed#[BE5D71744DEF9AAC]) [    x:core2] o.a.s.s.IndexSchema [core2] Schema name=tiny
   [junit4]   2> 264114 INFO  (TEST-TestCoreDiscovery.testCoreDirCantRead-seed#[BE5D71744DEF9AAC]) [    x:core2] o.a.s.s.IndexSchema Loaded schema tiny/1.1 with uniqueid field id
   [junit4]   2> 264115 INFO  (TEST-TestCoreDiscovery.testCoreDirCantRead-seed#[BE5D71744DEF9AAC]) [    x:core2] o.a.s.c.CoreContainer Creating SolrCore 'core2' using configuration from instancedir /x1/jenkins/jenkins-slave/workspace/Lucene-Solr-Tests-6.x/solr/build/solr-core/test/J2/temp/solr.core.TestCoreDiscovery_BE5D71744DEF9AAC-001/tempDir-001/core2
   [junit4]   2> 264116 INFO  (TEST-TestCoreDiscovery.testCoreDirCantRead-seed#[BE5D71744DEF9AAC]) [    x:core2] o.a.s.c.SolrCore [[core2] ] Opening new SolrCore at [/x1/jenkins/jenkins-slave/workspace/Lucene-Solr-Tests-6.x/solr/build/solr-core/test/J2/temp/solr.core.TestCoreDiscovery_BE5D71744DEF9AAC-001/tempDir-001/core2], dataDir=[/x1/jenkins/jenkins-slave/workspace/Lucene-Solr-Tests-6.x/solr/build/solr-core/test/J2/temp/solr.core.TestCoreDiscovery_BE5D71744DEF9AAC-001/tempDir-001/core2/core2/]
   [junit4]   2> 264118 INFO  (TEST-TestCoreDiscovery.testCoreDirCantRead-seed#[BE5D71744DEF9AAC]) [    x:core2] o.a.s.u.RandomMergePolicy RandomMergePolicy wrapping class org.apache.lucene.index.TieredMergePolicy: [TieredMergePolicy: maxMergeAtOnce=44, maxMergeAtOnceExplicit=41, maxMergedSegmentMB=47.6611328125, floorSegmentMB=0.671875, forceMergeDeletesPctAllowed=21.485219553602658, segmentsPerTier=41.0, maxCFSSegmentSizeMB=8.796093022207999E12, noCFSRatio=0.0
   [junit4]   2> 264149 INFO  (TEST-TestCoreDiscovery.testCoreDirCantRead-seed#[BE5D71744DEF9AAC]) [    x:core2] o.a.s.u.CommitTracker Hard AutoCommit: disabled
   [junit4]   2> 264149 INFO  (TEST-TestCoreDiscovery.testCoreDirCantRead-seed#[BE5D71744DEF9AAC]) [    x:core2] o.a.s.u.CommitTracker Soft AutoCommit: disabled
   [junit4]   2> 264149 INFO  (TEST-TestCoreDiscovery.testCoreDirCantRead-seed#[BE5D71744DEF9AAC]) [    x:core2] o.a.s.u.RandomMergePolicy RandomMergePolicy wrapping class org.apache.lucene.index.LogDocMergePolicy: [LogDocMergePolicy: minMergeSize=1000, mergeFactor=20, maxMergeSize=9223372036854775807, maxMergeSizeForForcedMerge=9223372036854775807, calibrateSizeByDeletes=false, maxMergeDocs=2147483647, maxCFSSegmentSizeMB=8.796093022207999E12, noCFSRatio=0.34496512065140306]
   [junit4]   2> 264150 INFO  (TEST-TestCoreDiscovery.testCoreDirCantRead-seed#[BE5D71744DEF9AAC]) [    x:core2] o.a.s.s.SolrIndexSearcher Opening [Searcher@42c37262[core2] main]
   [junit4]   2> 264150 INFO  (TEST-TestCoreDiscovery.testCoreDirCantRead-seed#[BE5D71744DEF9AAC]) [    x:core2] o.a.s.r.ManagedResourceStorage File-based storage initialized to use dir: /x1/jenkins/jenkins-slave/workspace/Lucene-Solr-Tests-6.x/solr/build/solr-core/test/J2/temp/solr.core.TestCoreDiscovery_BE5D71744DEF9AAC-001/tempDir-001/core2/conf
   [junit4]   2> 264151 INFO  (TEST-TestCoreDiscovery.testCoreDirCantRead-seed#[BE5D71744DEF9AAC]) [    x:core2] o.a.s.h.ReplicationHandler Commits will be reserved for  10000
   [junit4]   2> 264151 INFO  (TEST-TestCoreDiscovery.testCoreDirCantRead-seed#[BE5D71744DEF9AAC]) [    x:core2] o.a.s.c.CoreContainer Shutting down CoreContainer instance=1139896124
   [junit4]   2> 264151 INFO  (searcherExecutor-664-thread-1-processing-x:core2) [    x:core2] o.a.s.c.SolrCore [core2] Registered new searcher Searcher@42c37262[core2] main{ExitableDirectoryReader(UninvertingDirectoryReader())}
   [junit4]   2> 264152 INFO  (coreCloseExecutor-668-thread-1-processing-x:core2) [    x:core2] o.a.s.c.SolrCore [core2]  CLOSING SolrCore org.apache.solr.core.SolrCore@3899326b
   [junit4]   2> 264154 INFO  (coreCloseExecutor-668-thread-1-processing-x:core2) [    x:core2] o.a.s.m.SolrMetricManager Closing metric reporters for: solr.core.core2
   [junit4]   2> 264154 INFO  (TEST-TestCoreDiscovery.testCoreDirCantRead-seed#[BE5D71744DEF9AAC]) [    x:core2] o.a.s.m.SolrMetricManager Closing metric reporters for: solr.node
   [junit4]   2> 264154 INFO  (TEST-TestCoreDiscovery.testCoreDirCantRead-seed#[BE5D71744DEF9AAC]) [    x:core2] o.a.s.SolrTestCaseJ4 ###Ending testCoreDirCantRead
   [junit4]   2> 264157 INFO  (TEST-TestCoreDiscovery.testAlternateRelativeCoreDir-seed#[BE5D71744DEF9AAC]) [    x:core2] o.a.s.SolrTestCaseJ4 ###Starting testAlternateRelativeCoreDir
   [junit4]   2> 264163 INFO  (TEST-TestCoreDiscovery.testAlternateRelativeCoreDir-seed#[BE5D71744DEF9AAC]) [    x:core2] o.a.s.c.SolrXmlConfig Loading container configuration from /x1/jenkins/jenkins-slave/workspace/Lucene-Solr-Tests-6.x/solr/build/solr-core/test/J2/temp/solr.core.TestCoreDiscovery_BE5D71744DEF9AAC-001/tempDir-002/solr.xml
   [junit4]   2> 264172 INFO  (TEST-TestCoreDiscovery.testAlternateRelativeCoreDir-seed#[BE5D71744DEF9AAC]) [    x:core2] o.a.s.u.UpdateShardHandler Creating UpdateShardHandler HTTP client with params: socketTimeout=600000&connTimeout=60000&retry=true
   [junit4]   2> 264173 INFO  (TEST-TestCoreDiscovery.testAlternateRelativeCoreDir-seed#[BE5D71744DEF9AAC]) [    x:core2] o.a.s.c.SolrCores Allocating transient cache for 2 transient cores
   [junit4]   2> 264176 INFO  (TEST-TestCoreDiscovery.testAlternateRelativeCoreDir-seed#[BE5D71744DEF9AAC]) [    x:core2] o.a.s.c.CorePropertiesLocator Found 2 core definitions underneath /x1/jenkins/jenkins-slave/workspace/Lucene-Solr-Tests-6.x/solr/build/solr-core/test/J2/temp/solr.core.TestCoreDiscovery_BE5D71744DEF9AAC-001/tempDir-002/relativeCoreDir
   [junit4]   2> 264176 INFO  (TEST-TestCoreDiscovery.testAlternateRelativeCoreDir-seed#[BE5D71744DEF9AAC]) [    x:core2] o.a.s.c.CorePropertiesLocator Cores are: [core1, core2]
   [junit4]   2> 264184 WARN  (coreLoadExecutor-675-thread-1-processing-x:core2) [    x:core1] o.a.s.c.Config Beginning with Solr 5.5, <mergePolicy> is deprecated, use <mergePolicyFactory> instead.
   [junit4]   2> 264185 INFO  (coreLoadExecutor-675-thread-1-processing-x:core2) [    x:core1] o.a.s.c.SolrConfig Using Lucene MatchVersion: 6.5.0
   [junit4]   2> 264194 INFO  (coreLoadExecutor-675-thread-1-processing-x:core2) [    x:core1] o.a.s.s.IndexSchema [core1] Schema name=tiny
   [junit4]   2> 264209 INFO  (coreLoadExecutor-675-thread-1-processing-x:core2) [    x:core1] o.a.s.s.IndexSchema Loaded schema tiny/1.1 with uniqueid field id
   [junit4]   2> 264210 INFO  (coreLoadExecutor-675-thread-1-processing-x:core2) [    x:core1] o.a.s.c.CoreContainer Creating SolrCore 'core1' using configuration from instancedir /x1/jenkins/jenkins-slave/workspace/Lucene-Solr-Tests-6.x/solr/build/solr-core/test/J2/temp/solr.core.TestCoreDiscovery_BE5D71744DEF9AAC-001/tempDir-002/relativeCoreDir/core1
   [junit4]   2> 264211 INFO  (coreLoadExecutor-675-thread-1-processing-x:core2) [    x:core1] o.a.s.c.SolrCore [[core1] ] Opening new SolrCore at [/x1/jenkins/jenkins-slave/workspace/Lucene-Solr-Tests-6.x/solr/build/solr-core/test/J2/temp/solr.core.TestCoreDiscovery_BE5D71744DEF9AAC-001/tempDir-002/relativeCoreDir/core1], dataDir=[/x1/jenkins/jenkins-slave/workspace/Lucene-Solr-Tests-6.x/solr/build/solr-core/test/J2/temp/solr.core.TestCoreDiscovery_BE5D71744DEF9AAC-001/tempDir-002/relativeCoreDir/core1/core1/]
   [junit4]   2> 264212 INFO  (coreLoadExecutor-675-thread-1-processing-x:core2) [    x:core1] o.a.s.u.RandomMergePolicy RandomMergePolicy wrapping class org.apache.lucene.index.TieredMergePolicy: [TieredMergePolicy: maxMergeAtOnce=23, maxMergeAtOnceExplicit=35, maxMergedSegmentMB=75.408203125, floorSegmentMB=1.6591796875, forceMergeDeletesPctAllowed=1.2525079230464642, segmentsPerTier=49.0, maxCFSSegmentSizeMB=8.796093022207999E12, noCFSRatio=0.7970109725113841
   [junit4]   2> 264222 INFO  (coreLoadExecutor-675-thread-1-processing-x:core2) [    x:core1] o.a.s.u.CommitTracker Hard AutoCommit: disabled
   [junit4]   2> 264222 INFO  (coreLoadExecutor-675-thread-1-processing-x:core2) [    x:core1] o.a.s.u.CommitTracker Soft AutoCommit: disabled
   [junit4]   2> 264222 INFO  (coreLoadExecutor-675-thread-1-processing-x:core2) [    x:core1] o.a.s.u.RandomMergePolicy RandomMergePolicy wrapping class org.apache.lucene.index.TieredMergePolicy: [TieredMergePolicy: maxMergeAtOnce=37, maxMergeAtOnceExplicit=25, maxMergedSegmentMB=48.6748046875, floorSegmentMB=0.6787109375, forceMergeDeletesPctAllowed=29.959686465742493, segmentsPerTier=47.0, maxCFSSegmentSizeMB=8.796093022207999E12, noCFSRatio=0.0
   [junit4]   2> 264223 INFO  (coreLoadExecutor-675-thread-1-processing-x:core2) [    x:core1] o.a.s.s.SolrIndexSearcher Opening [Searcher@2a60d31e[core1] main]
   [junit4]   2> 264223 INFO  (coreLoadExecutor-675-thread-1-processing-x:core2) [    x:core1] o.a.s.r.ManagedResourceStorage File-based storage initialized to use dir: /x1/jenkins/jenkins-slave/workspace/Lucene-Solr-Tests-6.x/solr/build/solr-core/test/J2/temp/solr.core.TestCoreDiscovery_BE5D71744DEF9AAC-001/tempDir-002/relativeCoreDir/core1/conf
   [junit4]   2> 264223 INFO  (coreLoadExecutor-675-thread-1-processing-x:core2) [    x:core1] o.a.s.h.ReplicationHandler Commits will be reserved for  10000
   [junit4]   2> 264224 INFO  (searcherExecutor-676-thread-1-processing-x:core1) [    x:core1] o.a.s.c.SolrCore [core1] Registered new searcher Searcher@2a60d31e[core1] main{ExitableDirectoryReader(UninvertingDirectoryReader())}
   [junit4]   2> 264232 WARN  (TEST-TestCoreDiscovery.testAlternateRelativeCoreDir-seed#[BE5D71744DEF9AAC]) [    x:core2] o.a.s.c.Config Beginning with Solr 5.5, <mergePolicy> is deprecated, use <mergePolicyFactory> instead.
   [junit4]   2> 264233 INFO  (TEST-TestCoreDiscovery.testAlternateRelativeCoreDir-seed#[BE5D71744DEF9AAC]) [    x:core2] o.a.s.c.SolrConfig Using Lucene MatchVersion: 6.5.0
   [junit4]   2> 264241 INFO  (TEST-TestCoreDiscovery.testAlternateRelativeCoreDir-seed#[BE5D71744DEF9AAC]) [    x:core2] o.a.s.s.IndexSchema [core2] Schema name=tiny
   [junit4]   2> 264244 INFO  (TEST-TestCoreDiscovery.testAlternateRelativeCoreDir-seed#[BE5D71744DEF9AAC]) [    x:core2] o.a.s.s.IndexSchema Loaded schema tiny/1.1 with uniqueid field id
   [junit4]   2> 264245 INFO  (TEST-TestCoreDiscovery.testAlternateRelativeCoreDir-seed#[BE5D71744DEF9AAC]) [    x:core2] o.a.s.c.CoreContainer Creating SolrCore 'core2' using configuration from instancedir /x1/jenkins/jenkins-slave/workspace/Lucene-Solr-Tests-6.x/solr/build/solr-core/test/J2/temp/solr.core.TestCoreDiscovery_BE5D71744DEF9AAC-001/tempDir-002/relativeCoreDir/core2
   [junit4]   2> 264245 INFO  (TEST-TestCoreDiscovery.testAlternateRelativeCoreDir-seed#[BE5D71744DEF9AAC]) [    x:core2] o.a.s.c.SolrCore [[core2] ] Opening new SolrCore at [/x1/jenkins/jenkins-slave/workspace/Lucene-Solr-Tests-6.x/solr/build/solr-core/test/J2/temp/solr.core.TestCoreDiscovery_BE5D71744DEF9AAC-001/tempDir-002/relativeCoreDir/core2], dataDir=[/x1/jenkins/jenkins-slave/workspace/Lucene-Solr-Tests-6.x/solr/build/solr-core/test/J2/temp/solr.core.TestCoreDiscovery_BE5D71744DEF9AAC-001/tempDir-002/relativeCoreDir/core2/core2/]
   [junit4]   2> 264247 INFO  (TEST-TestCoreDiscovery.testAlternateRelativeCoreDir-seed#[BE5D71744DEF9AAC]) [    x:core2] o.a.s.u.RandomMergePolicy RandomMergePolicy wrapping class org.apache.lucene.index.LogByteSizeMergePolicy: [LogByteSizeMergePolicy: minMergeSize=1677721, mergeFactor=31, maxMergeSize=2147483648, maxMergeSizeForForcedMerge=9223372036854775807, calibrateSizeByDeletes=false, maxMergeDocs=2147483647, maxCFSSegmentSizeMB=8.796093022207999E12, noCFSRatio=0.0]
   [junit4]   2> 264258 INFO  (TEST-TestCoreDiscovery.testAlternateRelativeCoreDir-seed#[BE5D71744DEF9AAC]) [    x:core2] o.a.s.u.CommitTracker Hard AutoCommit: disabled
   [junit4]   2> 264258 INFO  (TEST-TestCoreDiscovery.testAlternateRelativeCoreDir-seed#[BE5D71744DEF9AAC]) [    x:core2] o.a.s.u.CommitTracker Soft AutoCommit: disabled
   [junit4]   2> 264259 INFO  (TEST-TestCoreDiscovery.testAlternateRelativeCoreDir-seed#[BE5D71744DEF9AAC]) [    x:core2] o.a.s.u.RandomMergePolicy RandomMergePolicy wrapping class org.apache.lucene.index.LogByteSizeMergePolicy: [LogByteSizeMergePolicy: minMergeSize=1677721, mergeFactor=39, maxMergeSize=2147483648, maxMergeSizeForForcedMerge=9223372036854775807, calibrateSizeByDeletes=false, maxMergeDocs=2147483647, maxCFSSegmentSizeMB=8.796093022207999E12, noCFSRatio=0.4165918118264209]
   [junit4]   2> 264260 INFO  (TEST-TestCoreDiscovery.testAlternateRelativeCoreDir-seed#[BE5D71744DEF9AAC]) [    x:core2] o.a.s.s.SolrIndexSearcher Opening [Searcher@5fc43845[core2] main]
   [junit4]   2> 264260 INFO  (TEST-TestCoreDiscovery.testAlternateRelativeCoreDir-seed#[BE5D71744DEF9AAC]) [    x:core2] o.a.s.r.ManagedResourceStorage File-based storage initialized to use dir: /x1/jenkins/jenkins-slave/workspace/Lucene-Solr-Tests-6.x/solr/build/solr-core/test/J2/temp/solr.core.TestCoreDiscovery_BE5D71744DEF9AAC-001/tempDir-002/relativeCoreDir/core2/conf
   [junit4]   2> 264260 INFO  (TEST-TestCoreDiscovery.testAlternateRelativeCoreDir-seed#[BE5D71744DEF9AAC]) [    x:core2] o.a.s.h.ReplicationHandler Commits will be reserved for  10000
   [junit4]   2> 264265 INFO  (searcherExecutor-680-thread-1-processing-x:core2) [    x:core2] o.a.s.c.SolrCore [core2] Registered new searcher Searcher@5fc43845[core2] main{ExitableDirectoryReader(UninvertingDirectoryReader())}
   [junit4]   2> 264268 INFO  (TEST-TestCoreDiscovery.testAlternateRelativeCoreDir-seed#[BE5D71744DEF9AAC]) [    x:core2] o.a.s.c.SolrConfig Using Lucene MatchVersion: 6.5.0
   [junit4]   2> 264276 INFO  (TEST-TestCoreDiscovery.testAlternateRelativeCoreDir-seed#[BE5D71744DEF9AAC]) [    x:core2] o.a.s.s.IndexSchema [core3] Schema name=minimal
   [junit4]   2> 264277 WARN  (TEST-TestCoreDiscovery.testAlternateRelativeCoreDir-seed#[BE5D71744DEF9AAC]) [    x:core2] o.a.s.s.IndexSchema no uniqueKey specified in schema.
   [junit4]   2> 264277 INFO  (TEST-TestCoreDiscovery.testAlternateRelativeCoreDir-seed#[BE5D71744DEF9AAC]) [    x:core2] o.a.s.s.IndexSchema Loaded schema minimal/1.1 with uniqueid field null
   [junit4]   2> 264278 INFO  (TEST-TestCoreDiscovery.testAlternateRelativeCoreDir-seed#[BE5D71744DEF9AAC]) [    x:core2] o.a.s.c.CoreContainer Creating SolrCore 'core3' using configuration from configset /x1/jenkins/jenkins-slave/workspace/Lucene-Solr-Tests-6.x/solr/core/src/test-files/solr/configsets/minimal
   [junit4]   2> 264279 INFO  (TEST-TestCoreDiscovery.testAlternateRelativeCoreDir-seed#[BE5D71744DEF9AAC]) [    x:core2] o.a.s.c.SolrCore [[core3] ] Opening new SolrCore at [/x1/jenkins/jenkins-slave/workspace/Lucene-Solr-Tests-6.x/solr/core/src/test-files/solr/configsets/minimal], dataDir=[/x1/jenkins/jenkins-slave/workspace/Lucene-Solr-Tests-6.x/solr/build/solr-core/test/J2/temp/solr.core.TestCoreDiscovery_BE5D71744DEF9AAC-001/tempDir-002/relativeCoreDir/core3/data/]
   [junit4]   2> 264292 INFO  (TEST-TestCoreDiscovery.testAlternateRelativeCoreDir-seed#[BE5D71744DEF9AAC]) [    x:core2] o.a.s.u.CommitTracker Hard AutoCommit: disabled
   [junit4]   2> 264292 INFO  (TEST-TestCoreDiscovery.testAlternateRelativeCoreDir-seed#[BE5D71744DEF9AAC]) [    x:core2] o.a.s.u.CommitTracker Soft AutoCommit: disabled
   [junit4]   2> 264293 INFO  (TEST-TestCoreDiscovery.testAlternateRelativeCoreDir-seed#[BE5D71744DEF9AAC]) [    x:core2] o.a.s.s.SolrIndexSearcher Opening [Searcher@753f7f3c[core3] main]
   [junit4]   2> 264293 WARN  (TEST-TestCoreDiscovery.testAlternateRelativeCoreDir-seed#[BE5D71744DEF9AAC]) [    x:core2] o.a.s.r.ManagedResourceStorage Cannot write to config directory /x1/jenkins/jenkins-slave/workspace/Lucene-Solr-Tests-6.x/solr/core/src/test-files/solr/configsets/minimal/conf; switching to use InMemory storage instead.
   [junit4]   2> 264293 INFO  (TEST-TestCoreDiscovery.testAlternateRelativeCoreDir-seed#[BE5D71744DEF9AAC]) [    x:core2] o.a.s.h.ReplicationHandler Commits will be reserved for  10000
   [junit4]   2> 264296 INFO  (searcherExecutor-684-thread-1-processing-x:core2) [    x:core2] o.a.s.c.SolrCore [core3] Registered new searcher Searcher@753f7f3c[core3] main{ExitableDirectoryReader(UninvertingDirectoryReader())}
   [junit4]   2> 264298 INFO  (TEST-TestCoreDiscovery.testAlternateRelativeCoreDir-seed#[BE5D71744DEF9AAC]) [    x:core2] o.a.s.c.CoreContainer Shutting down CoreContainer instance=57912319
   [junit4]   2> 264299 INFO  (coreCloseExecutor-688-thread-1-processing-x:core2) [    x:core1] o.a.s.c.SolrCore [core1]  CLOSING SolrCore org.apache.solr.core.SolrCore@5a3dff21
   [junit4]   2> 264299 INFO  (coreCloseExecutor-688-thread-2-processing-x:core2) [    x:core2] o.a.s.c.SolrCore [core2]  CLOSING SolrCore org.apache.solr.core.SolrCore@1b181ba2
   [junit4]   2> 264299 INFO  (coreCloseExecutor-688-thread-3-processing-x:core2) [    x:core3] o.a.s.c.SolrCore [core3]  CLOSING SolrCore org.apache.solr.core.SolrCore@6fe8dccd
   [junit4]   2> 264306 INFO  (coreCloseExecutor-688-thread-1-processing-x:core2) [    x:core1] o.a.s.m.SolrMetricManager Closing metric reporters for: solr.core.core1
   [junit4]   2> 264307 INFO  (coreCloseExecutor-688-thread-3-processing-x:core2) [    x:core3] o.a.s.m.SolrMetricManager Closing metric reporters for: solr.core.core3
   [junit4]   2> 264308 INFO  (coreCloseExecutor-688-thread-2-processing-x:core2) [    x:core2] o.a.s.m.SolrMetricManager Closing metric reporters for: solr.core.core2
   [junit4]   2> 264308 INFO  (TEST-TestCoreDiscovery.testAlternateRelativeCoreDir-seed#[BE5D71744DEF9AAC]) [    x:core2] o.a.s.m.SolrMetricManager Closing metric reporters for: solr.node
   [junit4]   2> 264308 INFO  (TEST-TestCoreDiscovery.testAlternateRelativeCoreDir-seed#[BE5D71744DEF9AAC]) [    x:core2] o.a.s.SolrTestCaseJ4 ###Ending testAlternateRelativeCoreDir
   [junit4]   2> 264312 INFO  (TEST-TestCoreDiscovery.testTooManyTransientCores-seed#[BE5D71744DEF9AAC]) [    x:core2] o.a.s.SolrTestCaseJ4 ###Starting testTooManyTransientCores
   [junit4]   2> 264323 INFO  (TEST-TestCoreDiscovery.testTooManyTransientCores-seed#[BE5D71744DEF9AAC]) [    x:core2] o.a.s.c.SolrXmlConfig Loading container configuration from /x1/jenkins/jenkins-slave/workspace/Lucene-Solr-Tests-6.x/solr/build/solr-core/test/J2/temp/solr.core.TestCoreDiscovery_BE5D71744DEF9AAC-001/tempDir-003/solr.xml
   [junit4]   2> 264329 INFO  (TEST-TestCoreDiscovery.testTooManyTransientCores-seed#[BE5D71744DEF9AAC]) [    x:core2] o.a.s.u.UpdateShardHandler Creating UpdateShardHandler HTTP client with params: socketTimeout=600000&connTimeout=60000&retry=true
   [junit4]   2> 264330 INFO  (TEST-TestCoreDiscovery.testTooManyTransientCores-seed#[BE5D71744DEF9AAC]) [    x:core2] o.a.s.c.SolrCores Allocating transient cache for 2 transient cores
   [junit4]   2> 264335 INFO  (TEST-TestCoreDiscovery.testTooManyTransientCores-seed#[BE5D71744DEF9AAC]) [    x:core2] o.a.s.c.CorePropertiesLocator Found 7 core definitions underneath /x1/jenkins/jenkins-slave/workspace/Lucene-Solr-Tests-6.x/solr/build/solr-core/test/J2/temp/solr.core.TestCoreDiscovery_BE5D71744DEF9AAC-001/tempDir-003
   [junit4]   2> 264335 INFO  (TEST-TestCoreDiscovery.testTooManyTransientCores-seed#[BE5D71744DEF9AAC]) [    x:core2] o.a.s.c.CorePropertiesLocator Cores are: [coreT1, coreLOS, coreT4, coreT3, coreT2, coreT6, coreT5]
   [junit4]   2> 264345 WARN  (coreLoadExecutor-695-thread-1-processing-x:core2) [    x:coreT1] o.a.s.c.Config Beginning with Solr 5.5, <mergePolicy> is deprecated, use <mergePolicyFactory> instead.
   [junit4]   2> 264348 INFO  (coreLoadExecutor-695-thread-1-processing-x:core2) [    x:coreT1] o.a.s.c.SolrConfig Using Lucene MatchVersion: 6.5.0
   [junit4]   2> 264356 INFO  (coreLoadExecutor-695-thread-1-processing-x:core2) [    x:coreT1] o.a.s.s.IndexSchema [coreT1] Schema name=tiny
   [junit4]   2> 264360 INFO  (coreLoadExecutor-695-thread-1-processing-x:core2) [    x:coreT1] o.a.s.s.IndexSchema Loaded schema tiny/1.1 with uniqueid field id
   [junit4]   2> 264345 WARN  (coreLoadExecutor-695-thread-2-processing-x:core2) [    x:coreLOS] o.a.s.c.Config Beginning with Solr 5.5, <mergePolicy> is deprecated, use <mergePolicyFactory> instead.
   [junit4]   2> 264361 INFO  (coreLoadExecutor-695-thread-1-processing-x:core2) [    x:coreT1] o.a.s.c.CoreContainer Creating SolrCore 'coreT1' using configuration from instancedir /x1/jenkins/jenkins-slave/workspace/Lucene-Solr-Tests-6.x/solr/build/solr-core/test/J2/temp/solr.core.TestCoreDiscovery_BE5D71744DEF9AAC-001/tempDir-003/coreT1
   [junit4]   2> 264363 INFO  (coreLoadExecutor-695-thread-2-processing-x:core2) [    x:coreLOS] o.a.s.c.SolrConfig Using Lucene MatchVersion: 6.5.0
   [junit4]   2> 264368 INFO  (coreLoadExecutor-695-thread-1-processing-x:core2) [    x:coreT1] o.a.s.c.SolrCore [[coreT1] ] Opening new SolrCore at [/x1/jenkins/jenkins-slave/workspace/Lucene-Solr-Tests-6.x/solr/build/solr-core/test/J2/temp/solr.core.TestCoreDiscovery_BE5D71744DEF9AAC-001/tempDir-003/coreT1], dataDir=[/x1/jenkins/jenkins-slave/workspace/Lucene-Solr-Tests-6.x/solr/build/solr-core/test/J2/temp/solr.core.TestCoreDiscovery_BE5D71744DEF9AAC-001/tempDir-003/coreT1/coreT1/]
   [junit4]   2> 264378 INFO  (coreLoadExecutor-695-thread-1-processing-x:core2) [    x:coreT1] o.a.s.u.RandomMergePolicy RandomMergePolicy wrapping class org.apache.lucene.index.TieredMergePolicy: [TieredMergePolicy: maxMergeAtOnce=23, maxMergeAtOnceExplicit=35, maxMergedSegmentMB=75.408203125, floorSegmentMB=1.6591796875, forceMergeDeletesPctAllowed=1.2525079230464642, segmentsPerTier=49.0, maxCFSSegmentSizeMB=8.796093022207999E12, noCFSRatio=0.7970109725113841
   [junit4]   2> 264381 WARN  (coreLoadExecutor-695-thread-3-processing-x:core2) [    x:coreT4] o.a.s.c.Config Beginning with Solr 5.5, <mergePolicy> is deprecated, use <mergePolicyFactory> instead.
   [junit4]   2> 264381 INFO  (coreLoadExecutor-695-thread-3-processing-x:core2) [    x:coreT4] o.a.s.c.SolrConfig Using Lucene MatchVersion: 6.5.0
   [junit4]   2> 264389 INFO  (coreLoadExecutor-695-thread-1-processing-x:core2) [    x:coreT1] o.a.s.u.CommitTracker Hard AutoCommit: disabled
   [junit4]   2> 264389 INFO  (coreLoadExecutor-695-thread-1-processing-x:core2) [    x:coreT1] o.a.s.u.CommitTracker Soft AutoCommit: disabled
   [junit4]   2> 264389 INFO  (coreLoadExecutor-695-thread-1-processing-x:core2) [    x:coreT1] o.a.s.u.RandomMergePolicy RandomMergePolicy wrapping class org.apache.lucene.index.TieredMergePolicy: [TieredMergePolicy: maxMergeAtOnce=37, maxMergeAtOnceExplicit=25, maxMergedSegmentMB=48.6748046875, floorSegmentMB=0.6787109375, forceMergeDeletesPctAllowed=29.959686465742493, segmentsPerTier=47.0, maxCFSSegmentSizeMB=8.796093022207999E12, noCFSRatio=0.0
   [junit4]   2> 264390 INFO  (coreLoadExecutor-695-thread-3-processing-x:core2) [    x:coreT4] o.a.s.s.IndexSchema [coreT4] Schema name=tiny
   [junit4]   2> 264390 INFO  (coreLoadExecutor-695-thread-2-processing-x:core2) [    x:coreLOS] o.a.s.s.IndexSchema [coreLOS] Schema name=tiny
   [junit4]   2> 264390 INFO  (coreLoadExecutor-695-thread-1-processing-x:core2) [    x:coreT1] o.a.s.s.SolrIndexSearcher Opening [Searcher@7a351279[coreT1] main]
   [junit4]   2> 264390 INFO  (coreLoadExecutor-695-thread-1-processing-x:core2) [    x:coreT1] o.a.s.r.ManagedResourceStorage File-based storage initialized to use dir: /x1/jenkins/jenkins-slave/workspace/Lucene-Solr-Tests-6.x/solr/build/solr-core/test/J2/temp/solr.core.TestCoreDiscovery_BE5D71744DEF9AAC-001/tempDir-003/coreT1/conf
   [junit4]   2> 264391 INFO  (coreLoadExecutor-695-thread-1-processing-x:core2) [    x:coreT1] o.a.s.h.ReplicationHandler Commits will be reserved for  10000
   [junit4]   2> 264391 INFO  (coreLoadExecutor-695-thread-1-processing-x:core2) [    x:coreT1] o.a.s.c.SolrCores Opening transient core coreT1
   [junit4]   2> 264392 INFO  (coreLoadExecutor-695-thread-2-processing-x:core2) [    x:coreLOS] o.a.s.s.IndexSchema Loaded schema tiny/1.1 with uniqueid field id
   [junit4]   2> 264393 INFO  (coreLoadExecutor-695-thread-2-processing-x:core2) [    x:coreLOS] o.a.s.c.CoreContainer Creating SolrCore 'coreLOS' using configuration from instancedir /x1/jenkins/jenkins-slave/workspace/Lucene-Solr-Tests-6.x/solr/build/solr-core/test/J2/temp/solr.core.TestCoreDiscovery_BE5D71744DEF9AAC-001/tempDir-003/coreLOS
   [junit4]   2> 264394 INFO  (coreLoadExecutor-695-thread-2-processing-x:core2) [    x:coreLOS] o.a.s.c.SolrCore [[coreLOS] ] Opening new SolrCore at [/x1/jenkins/jenkins-slave/workspace/Lucene-Solr-Tests-6.x/solr/build/solr-core/test/J2/temp/solr.core.TestCoreDiscovery_BE5D71744DEF9AAC-001/tempDir-003/coreLOS], dataDir=[/x1/jenkins/jenkins-slave/workspace/Lucene-Solr-Tests-6.x/solr/build/solr-core/test/J2/temp/solr.core.TestCoreDiscovery_BE5D71744DEF9AAC-001/tempDir-003/coreLOS/coreLOS/]
   [junit4]   2> 264394 INFO  (coreLoadExecutor-695-thread-3-processing-x:core2) [    x:coreT4] o.a.s.s.IndexSchema Loaded schema tiny/1.1 with uniqueid field id
   [junit4]   2> 264395 INFO  (coreLoadExecutor-695-thread-2-processing-x:core2) [    x:coreLOS] o.a.s.u.RandomMergePolicy RandomMergePolicy wrapping class org.apache.lucene.index.TieredMergePolicy: [TieredMergePolicy: maxMergeAtOnce=23, maxMergeAtOnceExplicit=35, maxMergedSegmentMB=75.408203125, floorSegmentMB=1.6591796875, forceMergeDeletesPctAllowed=1.2525079230464642, segmentsPerTier=49.0, maxCFSSegmentSizeMB=8.796093022207999E12, noCFSRatio=0.7970109725113841
   [junit4]   2> 264395 INFO  (coreLoadExecutor-695-thread-3-processing-x:core2) [    x:coreT4] o.a.s.c.CoreContainer Creating SolrCore 'coreT4' using configuration from instancedir /x1/jenkins/jenkins-slave/workspace/Lucene-Solr-Tests-6.x/solr/build/solr-core/test/J2/temp/solr.core.TestCoreDiscovery_BE5D71744DEF9AAC-001/tempDir-003/coreT4
   [junit4]   2> 264395 INFO  (coreLoadExecutor-695-thread-3-processing-x:core2) [    x:coreT4] o.a.s.c.SolrCore [[coreT4] ] Opening new SolrCore at [/x1/jenkins/jenkins-slave/workspace/Lucene-Solr-Tests-6.x/solr/build/solr-core/test/J2/temp/solr.core.TestCoreDiscovery_BE5D71744DEF9AAC-001/tempDir-003/coreT4], dataDir=[/x1/jenkins/jenkins-slave/workspace/Lucene-Solr-Tests-6.x/solr/build/solr-core/test/J2/temp/solr.core.TestCoreDiscovery_BE5D71744DEF9AAC-001/tempDir-003/coreT4/coreT4/]
   [junit4]   2> 264396 INFO  (coreLoadExecutor-695-thread-3-processing-x:core2) [    x:coreT4] o.a.s.u.RandomMergePolicy RandomMergePolicy wrapping class org.apache.lucene.index.TieredMergePolicy: [TieredMergePolicy: maxMergeAtOnce=23, maxMergeAtOnceExplicit=35, maxMergedSegmentMB=75.408203125, floorSegmentMB=1.6591796875, forceMergeDeletesPctAllowed=1.2525079230464642, segmentsPerTier=49.0, maxCFSSegmentSizeMB=8.796093022207999E12, noCFSRatio=0.7970109725113841
   [junit4]   2> 264399 WARN  (coreLoadExecutor-695-thread-1-processing-x:core2) [    x:core2] o.a.s.c.Config Beginning with Solr 5.5, <mergePolicy> is deprecated, use <mergePolicyFactory> instead.
   [junit4]   2> 264399 INFO  (coreLoadExecutor-695-thread-1-processing-x:core2) [    x:core2] o.a.s.c.SolrConfig Using Lucene MatchVersion: 6.5.0
   [junit4]   2> 264400 INFO  (searcherExecutor-696-thread-1-processing-x:coreT1) [    x:coreT1] o.a.s.c.SolrCore [coreT1] Registered new searcher Searcher@7a351279[coreT1] main{ExitableDirectoryReader(UninvertingDirectoryReader())}
   [junit4]   2> 264407 INFO  (coreLoadExecutor-695-thread-1-processing-x:core2) [    x:core2] o.a.s.s.IndexSchema [coreT3] Schema name=tiny
   [junit4]   2> 264410 INFO  (coreLoadExecutor-695-thread-1-processing-x:core2) [    x:core2] o.a.s.s.IndexSchema Loaded schema tiny/1.1 with uniqueid field id
   [junit4]   2> 264411 INFO  (coreLoadExecutor-695-thread-1-processing-x:core2) [    x:core2] o.a.s.c.CoreContainer Creating SolrCore 'coreT3' using configuration from instancedir /x1/jenkins/jenkins-slave/workspace/Lucene-Solr-Tests-6.x/solr/build/solr-core/test/J2/temp/solr.core.TestCoreDiscovery_BE5D71744DEF9AAC-001/tempDir-003/coreT3
   [junit4]   2> 264411 INFO  (coreLoadExecutor-695-thread-1-processing-x:core2) [    x:core2] o.a.s.c.SolrCore [[coreT3] ] Opening new SolrCore at [/x1/jenkins/jenkins-slave/workspace/Lucene-Solr-Tests-6.x/solr/build/solr-core/test/J2/temp/solr.core.TestCoreDiscovery_BE5D71744DEF9AAC-001/tempDir-003/coreT3], dataDir=[/x1/jenkins/jenkins-slave/workspace/Lucene-Solr-Tests-6.x/solr/build/solr-core/test/J2/temp/solr.core.TestCoreDiscovery_BE5D71744DEF9AAC-001/tempDir-003/coreT3/coreT3/]
   [junit4]   2> 264413 INFO  (coreLoadExecutor-695-thread-1-processing-x:core2) [    x:core2] o.a.s.u.RandomMergePolicy RandomMergePolicy wrapping class org.apache.lucene.index.TieredMergePolicy: [TieredMergePolicy: maxMergeAtOnce=12, maxMergeAtOnceExplicit=33, maxMergedSegmentMB=45.482421875, floorSegmentMB=1.5849609375, forceMergeDeletesP

[...truncated too long message...]

o.e.j.s.AbstractConnector Stopped ServerConnector@4f84bcf8{HTTP/1.1,[http/1.1]}{127.0.0.1:0}
   [junit4]   2> 873362 INFO  (TEST-TestDistributedStatsComponentCardinality.test-seed#[BE5D71744DEF9AAC]) [    ] o.a.s.c.CoreContainer Shutting down CoreContainer instance=1079460135
   [junit4]   2> 873363 INFO  (coreCloseExecutor-3627-thread-1) [    x:collection1] o.a.s.c.SolrCore [collection1]  CLOSING SolrCore org.apache.solr.core.SolrCore@7542fa0a
   [junit4]   2> 873430 INFO  (coreCloseExecutor-3627-thread-1) [    x:collection1] o.a.s.m.SolrMetricManager Closing metric reporters for: solr.core.collection1
   [junit4]   2> 874349 INFO  (TEST-TestDistributedStatsComponentCardinality.test-seed#[BE5D71744DEF9AAC]) [    ] o.a.s.m.SolrMetricManager Closing metric reporters for: solr.node
   [junit4]   2> 874349 INFO  (TEST-TestDistributedStatsComponentCardinality.test-seed#[BE5D71744DEF9AAC]) [    ] o.e.j.s.h.ContextHandler Stopped o.e.j.s.ServletContextHandler@56bdd598{/,null,UNAVAILABLE}
   [junit4]   2> 874351 INFO  (TEST-TestDistributedStatsComponentCardinality.test-seed#[BE5D71744DEF9AAC]) [    ] o.e.j.s.AbstractConnector Stopped ServerConnector@e00790c{HTTP/1.1,[http/1.1]}{127.0.0.1:0}
   [junit4]   2> 874351 INFO  (TEST-TestDistributedStatsComponentCardinality.test-seed#[BE5D71744DEF9AAC]) [    ] o.a.s.c.CoreContainer Shutting down CoreContainer instance=444169374
   [junit4]   2> 874351 INFO  (coreCloseExecutor-3629-thread-1) [    x:collection1] o.a.s.c.SolrCore [collection1]  CLOSING SolrCore org.apache.solr.core.SolrCore@2d422c7b
   [junit4]   2> 874396 INFO  (coreCloseExecutor-3629-thread-1) [    x:collection1] o.a.s.m.SolrMetricManager Closing metric reporters for: solr.core.collection1
   [junit4]   2> 874849 INFO  (TEST-TestDistributedStatsComponentCardinality.test-seed#[BE5D71744DEF9AAC]) [    ] o.a.s.m.SolrMetricManager Closing metric reporters for: solr.node
   [junit4]   2> 874849 INFO  (TEST-TestDistributedStatsComponentCardinality.test-seed#[BE5D71744DEF9AAC]) [    ] o.e.j.s.h.ContextHandler Stopped o.e.j.s.ServletContextHandler@5d51781c{/,null,UNAVAILABLE}
   [junit4]   2> 874851 INFO  (TEST-TestDistributedStatsComponentCardinality.test-seed#[BE5D71744DEF9AAC]) [    ] o.e.j.s.AbstractConnector Stopped ServerConnector@31b2a613{HTTP/1.1,[http/1.1]}{127.0.0.1:0}
   [junit4]   2> 874851 INFO  (TEST-TestDistributedStatsComponentCardinality.test-seed#[BE5D71744DEF9AAC]) [    ] o.a.s.c.CoreContainer Shutting down CoreContainer instance=1411351885
   [junit4]   2> 874862 INFO  (coreCloseExecutor-3631-thread-1) [    x:collection1] o.a.s.c.SolrCore [collection1]  CLOSING SolrCore org.apache.solr.core.SolrCore@e0d0d6f
   [junit4]   2> 874891 INFO  (coreCloseExecutor-3631-thread-1) [    x:collection1] o.a.s.m.SolrMetricManager Closing metric reporters for: solr.core.collection1
   [junit4]   2> 875214 INFO  (TEST-TestDistributedStatsComponentCardinality.test-seed#[BE5D71744DEF9AAC]) [    ] o.a.s.m.SolrMetricManager Closing metric reporters for: solr.node
   [junit4]   2> 875214 INFO  (TEST-TestDistributedStatsComponentCardinality.test-seed#[BE5D71744DEF9AAC]) [    ] o.e.j.s.h.ContextHandler Stopped o.e.j.s.ServletContextHandler@1d8efe99{/,null,UNAVAILABLE}
   [junit4]   2> NOTE: reproduce with: ant test  -Dtestcase=TestDistributedStatsComponentCardinality -Dtests.method=test -Dtests.seed=BE5D71744DEF9AAC -Dtests.multiplier=2 -Dtests.slow=true -Dtests.locale=is -Dtests.timezone=America/Porto_Velho -Dtests.asserts=true -Dtests.file.encoding=ISO-8859-1
   [junit4] FAILURE 76.8s J1 | TestDistributedStatsComponentCardinality.test <<<
   [junit4]    > Throwable #1: java.lang.AssertionError: int_i: goodEst=13931, poorEst=13970, real=13960, p=q=id:[276+TO+14235]&rows=0&stats=true&stats.field={!cardinality%3D0.01839004745517031+key%3Dlow_int_i}int_i&stats.field={!cardinality%3D0.01839004745517031+key%3Dlow_int_i_prehashed_l+hllPreHashed%3Dtrue}int_i_prehashed_l&stats.field={!cardinality%3D0.5183900474551704+key%3Dhigh_int_i}int_i&stats.field={!cardinality%3D0.5183900474551704+key%3Dhigh_int_i_prehashed_l+hllPreHashed%3Dtrue}int_i_prehashed_l&stats.field={!cardinality%3D0.01839004745517031+key%3Dlow_long_l}long_l&stats.field={!cardinality%3D0.01839004745517031+key%3Dlow_long_l_prehashed_l+hllPreHashed%3Dtrue}long_l_prehashed_l&stats.field={!cardinality%3D0.5183900474551704+key%3Dhigh_long_l}long_l&stats.field={!cardinality%3D0.5183900474551704+key%3Dhigh_long_l_prehashed_l+hllPreHashed%3Dtrue}long_l_prehashed_l&stats.field={!cardinality%3D0.01839004745517031+key%3Dlow_string_s}string_s&stats.field={!cardinality%3D0.01839004745517031+key%3Dlow_string_s_prehashed_l+hllPreHashed%3Dtrue}string_s_prehashed_l&stats.field={!cardinality%3D0.5183900474551704+key%3Dhigh_string_s}string_s&stats.field={!cardinality%3D0.5183900474551704+key%3Dhigh_string_s_prehashed_l+hllPreHashed%3Dtrue}string_s_prehashed_l
   [junit4]    > 	at __randomizedtesting.SeedInfo.seed([BE5D71744DEF9AAC:36094EAEE313F754]:0)
   [junit4]    > 	at org.apache.solr.handler.component.TestDistributedStatsComponentCardinality.test(TestDistributedStatsComponentCardinality.java:217)
   [junit4]    > 	at org.apache.solr.BaseDistributedSearchTestCase$ShardsRepeatRule$ShardsFixedStatement.callStatement(BaseDistributedSearchTestCase.java:992)
   [junit4]    > 	at org.apache.solr.BaseDistributedSearchTestCase$ShardsRepeatRule$ShardsStatement.evaluate(BaseDistributedSearchTestCase.java:967)
   [junit4]    > 	at java.lang.Thread.run(Thread.java:745)
   [junit4]   2> 875218 INFO  (SUITE-TestDistributedStatsComponentCardinality-seed#[BE5D71744DEF9AAC]-worker) [    ] o.a.s.SolrTestCaseJ4 ###deleteCore
   [junit4]   2> NOTE: leaving temporary files on disk at: /x1/jenkins/jenkins-slave/workspace/Lucene-Solr-Tests-6.x/solr/build/solr-core/test/J1/temp/solr.handler.component.TestDistributedStatsComponentCardinality_BE5D71744DEF9AAC-001
   [junit4]   2> NOTE: test params are: codec=Asserting(Lucene62): {int_i=TestBloomFilteredLucenePostings(BloomFilteringPostingsFormat(Lucene50(blocksize=128))), range_facet_l_dv=PostingsFormat(name=Direct), multiDefault=PostingsFormat(name=Asserting), intDefault=PostingsFormat(name=MockRandom), int_i_prehashed_l=TestBloomFilteredLucenePostings(BloomFilteringPostingsFormat(Lucene50(blocksize=128))), long_l_prehashed_l=TestBloomFilteredLucenePostings(BloomFilteringPostingsFormat(Lucene50(blocksize=128))), range_facet_l=PostingsFormat(name=MockRandom), long_l=PostingsFormat(name=Direct), _version_=PostingsFormat(name=MockRandom), string_s_prehashed_l=PostingsFormat(name=Direct), string_s=TestBloomFilteredLucenePostings(BloomFilteringPostingsFormat(Lucene50(blocksize=128))), id=PostingsFormat(name=Direct), range_facet_i_dv=PostingsFormat(name=MockRandom), timestamp=PostingsFormat(name=MockRandom)}, docValues:{int_i=DocValuesFormat(name=Memory), range_facet_l_dv=DocValuesFormat(name=Lucene54), multiDefault=DocValuesFormat(name=Direct), intDefault=DocValuesFormat(name=Asserting), int_i_prehashed_l=DocValuesFormat(name=Memory), range_facet_l=DocValuesFormat(name=Asserting), long_l_prehashed_l=DocValuesFormat(name=Memory), long_l=DocValuesFormat(name=Lucene54), _version_=DocValuesFormat(name=Asserting), string_s_prehashed_l=DocValuesFormat(name=Lucene54), string_s=DocValuesFormat(name=Memory), range_facet_i_dv=DocValuesFormat(name=Asserting), id=DocValuesFormat(name=Lucene54), timestamp=DocValuesFormat(name=Asserting)}, maxPointsInLeafNode=101, maxMBSortInHeap=7.819690811356944, sim=RandomSimilarity(queryNorm=false,coord=no): {}, locale=is, timezone=America/Porto_Velho
   [junit4]   2> NOTE: Linux 3.13.0-85-generic amd64/Oracle Corporation 1.8.0_102 (64-bit)/cpus=4,threads=1,free=212097968,total=530055168
   [junit4]   2> NOTE: All tests run in this JVM: [TestSolrConfigHandler, TestBM25SimilarityFactory, ShardRoutingTest, TestManagedSynonymFilterFactory, SolrXmlInZkTest, LeaderInitiatedRecoveryOnCommitTest, HdfsCollectionsAPIDistributedZkTest, HdfsWriteToMultipleCollectionsTest, TestSolrQueryParserResource, TestFieldCacheSanityChecker, TestBlobHandler, SystemInfoHandlerTest, URLClassifyProcessorTest, TestDownShardTolerantSearch, SolrIndexSplitterTest, TestLRUCache, UUIDUpdateProcessorFallbackTest, DeleteStatusTest, CoreAdminRequestStatusTest, UtilsToolTest, TestQueryUtils, EnumFieldTest, CopyFieldTest, OverseerRolesTest, TestJsonRequest, ClusterStateUpdateTest, DirectSolrSpellCheckerTest, ZkControllerTest, TestSmileRequest, PKIAuthenticationIntegrationTest, TestOrdValues, TestLocalFSCloudBackupRestore, SpatialHeatmapFacetsTest, TestCharFilters, TestBlendedInfixSuggestions, TestStressVersions, TestSolrCloudWithSecureImpersonation, DirectSolrConnectionTest, HdfsBasicDistributedZkTest, DirectoryFactoryTest, TestUnifiedSolrHighlighter, TestNumericTerms32, SolrInfoMBeanTest, ClassificationUpdateProcessorFactoryTest, TestSearchPerf, TestNRTOpen, CSVRequestHandlerTest, AddBlockUpdateTest, CollectionsAPIDistributedZkTest, TestMaxScoreQueryParser, DistributedFacetExistsSmallTest, ChaosMonkeySafeLeaderTest, TestSchemaVersionResource, TestQuerySenderListener, CheckHdfsIndexTest, IndexSchemaRuntimeFieldTest, DeleteNodeTest, SolrCoreMetricManagerTest, SpatialFilterTest, TestDocTermOrds, TestRandomFlRTGCloud, TestSQLHandler, TestCSVResponseWriter, TestConfigSetImmutable, VersionInfoTest, TestCryptoKeys, DistributedIntervalFacetingTest, TestSweetSpotSimilarityFactory, ConfigSetsAPITest, RollingRestartTest, SortByFunctionTest, ChangedSchemaMergeTest, DistributedQueryComponentCustomSortTest, DocValuesTest, ZkCLITest, SolrIndexConfigTest, TestImpersonationWithHadoopAuth, ReplaceNodeTest, UpdateRequestProcessorFactoryTest, TestBinaryResponseWriter, TestGeoJSONResponseWriter, ZkSolrClientTest, SpatialRPTFieldTypeTest, BasicFunctionalityTest, ZkStateReaderTest, DistributedFacetPivotSmallAdvancedTest, TestTrieFacet, TestDistributedStatsComponentCardinality]
   [junit4] Completed [587/682 (2!)] on J1 in 76.80s, 1 test, 1 failure <<< FAILURES!

[...truncated 62784 lines...]



[JENKINS] Lucene-Solr-Tests-6.x - Build # 703 - Still Unstable

Posted by Apache Jenkins Server <je...@builds.apache.org>.
Build: https://builds.apache.org/job/Lucene-Solr-Tests-6.x/703/

1 tests failed.
FAILED:  org.apache.solr.handler.admin.MBeansHandlerTest.testDiff

Error Message:
expected:<Was: [1, Now: 2], Delta: 1> but was:<Was: [4, Now: 5], Delta: 1>

Stack Trace:
org.junit.ComparisonFailure: expected:<Was: [1, Now: 2], Delta: 1> but was:<Was: [4, Now: 5], Delta: 1>
	at __randomizedtesting.SeedInfo.seed([7FA42FA52D59C4EE:BAB2EB3E3DEFFC8E]:0)
	at org.junit.Assert.assertEquals(Assert.java:125)
	at org.junit.Assert.assertEquals(Assert.java:147)
	at org.apache.solr.handler.admin.MBeansHandlerTest.testDiff(MBeansHandlerTest.java:63)
	at sun.reflect.NativeMethodAccessorImpl.invoke0(Native Method)
	at sun.reflect.NativeMethodAccessorImpl.invoke(NativeMethodAccessorImpl.java:62)
	at sun.reflect.DelegatingMethodAccessorImpl.invoke(DelegatingMethodAccessorImpl.java:43)
	at java.lang.reflect.Method.invoke(Method.java:498)
	at com.carrotsearch.randomizedtesting.RandomizedRunner.invoke(RandomizedRunner.java:1713)
	at com.carrotsearch.randomizedtesting.RandomizedRunner$8.evaluate(RandomizedRunner.java:907)
	at com.carrotsearch.randomizedtesting.RandomizedRunner$9.evaluate(RandomizedRunner.java:943)
	at com.carrotsearch.randomizedtesting.RandomizedRunner$10.evaluate(RandomizedRunner.java:957)
	at com.carrotsearch.randomizedtesting.rules.SystemPropertiesRestoreRule$1.evaluate(SystemPropertiesRestoreRule.java:57)
	at org.apache.lucene.util.TestRuleSetupTeardownChained$1.evaluate(TestRuleSetupTeardownChained.java:49)
	at org.apache.lucene.util.AbstractBeforeAfterRule$1.evaluate(AbstractBeforeAfterRule.java:45)
	at org.apache.lucene.util.TestRuleThreadAndTestName$1.evaluate(TestRuleThreadAndTestName.java:48)
	at org.apache.lucene.util.TestRuleIgnoreAfterMaxFailures$1.evaluate(TestRuleIgnoreAfterMaxFailures.java:64)
	at org.apache.lucene.util.TestRuleMarkFailure$1.evaluate(TestRuleMarkFailure.java:47)
	at com.carrotsearch.randomizedtesting.rules.StatementAdapter.evaluate(StatementAdapter.java:36)
	at com.carrotsearch.randomizedtesting.ThreadLeakControl$StatementRunner.run(ThreadLeakControl.java:368)
	at com.carrotsearch.randomizedtesting.ThreadLeakControl.forkTimeoutingTask(ThreadLeakControl.java:817)
	at com.carrotsearch.randomizedtesting.ThreadLeakControl$3.evaluate(ThreadLeakControl.java:468)
	at com.carrotsearch.randomizedtesting.RandomizedRunner.runSingleTest(RandomizedRunner.java:916)
	at com.carrotsearch.randomizedtesting.RandomizedRunner$5.evaluate(RandomizedRunner.java:802)
	at com.carrotsearch.randomizedtesting.RandomizedRunner$6.evaluate(RandomizedRunner.java:852)
	at com.carrotsearch.randomizedtesting.RandomizedRunner$7.evaluate(RandomizedRunner.java:863)
	at com.carrotsearch.randomizedtesting.rules.StatementAdapter.evaluate(StatementAdapter.java:36)
	at com.carrotsearch.randomizedtesting.rules.SystemPropertiesRestoreRule$1.evaluate(SystemPropertiesRestoreRule.java:57)
	at org.apache.lucene.util.AbstractBeforeAfterRule$1.evaluate(AbstractBeforeAfterRule.java:45)
	at com.carrotsearch.randomizedtesting.rules.StatementAdapter.evaluate(StatementAdapter.java:36)
	at org.apache.lucene.util.TestRuleStoreClassName$1.evaluate(TestRuleStoreClassName.java:41)
	at com.carrotsearch.randomizedtesting.rules.NoShadowingOrOverridesOnMethodsRule$1.evaluate(NoShadowingOrOverridesOnMethodsRule.java:40)
	at com.carrotsearch.randomizedtesting.rules.NoShadowingOrOverridesOnMethodsRule$1.evaluate(NoShadowingOrOverridesOnMethodsRule.java:40)
	at com.carrotsearch.randomizedtesting.rules.StatementAdapter.evaluate(StatementAdapter.java:36)
	at com.carrotsearch.randomizedtesting.rules.StatementAdapter.evaluate(StatementAdapter.java:36)
	at com.carrotsearch.randomizedtesting.rules.StatementAdapter.evaluate(StatementAdapter.java:36)
	at org.apache.lucene.util.TestRuleAssertionsRequired$1.evaluate(TestRuleAssertionsRequired.java:53)
	at org.apache.lucene.util.TestRuleMarkFailure$1.evaluate(TestRuleMarkFailure.java:47)
	at org.apache.lucene.util.TestRuleIgnoreAfterMaxFailures$1.evaluate(TestRuleIgnoreAfterMaxFailures.java:64)
	at org.apache.lucene.util.TestRuleIgnoreTestSuites$1.evaluate(TestRuleIgnoreTestSuites.java:54)
	at com.carrotsearch.randomizedtesting.rules.StatementAdapter.evaluate(StatementAdapter.java:36)
	at com.carrotsearch.randomizedtesting.ThreadLeakControl$StatementRunner.run(ThreadLeakControl.java:368)
	at java.lang.Thread.run(Thread.java:745)




Build Log:
[...truncated 12131 lines...]
   [junit4] Suite: org.apache.solr.handler.admin.MBeansHandlerTest
   [junit4]   2> Creating dataDir: /x1/jenkins/jenkins-slave/workspace/Lucene-Solr-Tests-6.x/solr/build/solr-core/test/J0/temp/solr.handler.admin.MBeansHandlerTest_7FA42FA52D59C4EE-001/init-core-data-001
   [junit4]   2> 1499114 INFO  (SUITE-MBeansHandlerTest-seed#[7FA42FA52D59C4EE]-worker) [    ] o.a.s.SolrTestCaseJ4 Randomized ssl (true) and clientAuth (false) via: @org.apache.solr.util.RandomizeSSL(reason=, ssl=NaN, value=NaN, clientAuth=NaN)
   [junit4]   2> 1499115 INFO  (SUITE-MBeansHandlerTest-seed#[7FA42FA52D59C4EE]-worker) [    ] o.a.s.SolrTestCaseJ4 ####initCore
   [junit4]   2> 1499116 INFO  (SUITE-MBeansHandlerTest-seed#[7FA42FA52D59C4EE]-worker) [    ] o.a.s.c.SolrResourceLoader [null] Added 2 libs to classloader, from paths: [/x1/jenkins/jenkins-slave/workspace/Lucene-Solr-Tests-6.x/solr/core/src/test-files/solr/collection1/lib, /x1/jenkins/jenkins-slave/workspace/Lucene-Solr-Tests-6.x/solr/core/src/test-files/solr/collection1/lib/classes]
   [junit4]   2> 1499216 WARN  (SUITE-MBeansHandlerTest-seed#[7FA42FA52D59C4EE]-worker) [    ] o.a.s.c.Config Beginning with Solr 5.5, <mergePolicy> is deprecated, use <mergePolicyFactory> instead.
   [junit4]   2> 1499217 INFO  (SUITE-MBeansHandlerTest-seed#[7FA42FA52D59C4EE]-worker) [    ] o.a.s.c.SolrConfig Using Lucene MatchVersion: 6.5.0
   [junit4]   2> 1499241 INFO  (SUITE-MBeansHandlerTest-seed#[7FA42FA52D59C4EE]-worker) [    ] o.a.s.s.IndexSchema [null] Schema name=test
   [junit4]   2> 1499431 WARN  (SUITE-MBeansHandlerTest-seed#[7FA42FA52D59C4EE]-worker) [    ] o.a.s.s.IndexSchema [null] default search field in schema is text. WARNING: Deprecated, please use 'df' on request instead.
   [junit4]   2> 1499435 INFO  (SUITE-MBeansHandlerTest-seed#[7FA42FA52D59C4EE]-worker) [    ] o.a.s.s.IndexSchema Loaded schema test/1.0 with uniqueid field id
   [junit4]   2> 1499446 INFO  (SUITE-MBeansHandlerTest-seed#[7FA42FA52D59C4EE]-worker) [    ] o.a.s.u.UpdateShardHandler Creating UpdateShardHandler HTTP client with params: socketTimeout=30000&connTimeout=30000&retry=true
   [junit4]   2> 1499448 WARN  (SUITE-MBeansHandlerTest-seed#[7FA42FA52D59C4EE]-worker) [    ] o.a.s.m.r.SolrJmxReporter No serviceUrl or agentId was configured, using first MBeanServer.
   [junit4]   2> 1499450 INFO  (SUITE-MBeansHandlerTest-seed#[7FA42FA52D59C4EE]-worker) [    ] o.a.s.m.r.SolrJmxReporter JMX monitoring enabled at server: com.sun.jmx.mbeanserver.JmxMBeanServer@809b01c
   [junit4]   2> 1499451 WARN  (SUITE-MBeansHandlerTest-seed#[7FA42FA52D59C4EE]-worker) [    ] o.a.s.m.r.SolrJmxReporter No serviceUrl or agentId was configured, using first MBeanServer.
   [junit4]   2> 1499455 INFO  (SUITE-MBeansHandlerTest-seed#[7FA42FA52D59C4EE]-worker) [    ] o.a.s.m.r.SolrJmxReporter JMX monitoring enabled at server: com.sun.jmx.mbeanserver.JmxMBeanServer@809b01c
   [junit4]   2> 1499455 WARN  (SUITE-MBeansHandlerTest-seed#[7FA42FA52D59C4EE]-worker) [    ] o.a.s.m.r.SolrJmxReporter No serviceUrl or agentId was configured, using first MBeanServer.
   [junit4]   2> 1499455 INFO  (SUITE-MBeansHandlerTest-seed#[7FA42FA52D59C4EE]-worker) [    ] o.a.s.m.r.SolrJmxReporter JMX monitoring enabled at server: com.sun.jmx.mbeanserver.JmxMBeanServer@809b01c
   [junit4]   2> 1499456 INFO  (coreLoadExecutor-5148-thread-1) [    x:collection1] o.a.s.c.SolrResourceLoader [null] Added 2 libs to classloader, from paths: [/x1/jenkins/jenkins-slave/workspace/Lucene-Solr-Tests-6.x/solr/core/src/test-files/solr/collection1/lib, /x1/jenkins/jenkins-slave/workspace/Lucene-Solr-Tests-6.x/solr/core/src/test-files/solr/collection1/lib/classes]
   [junit4]   2> 1499490 WARN  (coreLoadExecutor-5148-thread-1) [    x:collection1] o.a.s.c.Config Beginning with Solr 5.5, <mergePolicy> is deprecated, use <mergePolicyFactory> instead.
   [junit4]   2> 1499492 INFO  (coreLoadExecutor-5148-thread-1) [    x:collection1] o.a.s.c.SolrConfig Using Lucene MatchVersion: 6.5.0
   [junit4]   2> 1499516 INFO  (coreLoadExecutor-5148-thread-1) [    x:collection1] o.a.s.s.IndexSchema [collection1] Schema name=test
   [junit4]   2> 1499605 WARN  (coreLoadExecutor-5148-thread-1) [    x:collection1] o.a.s.s.IndexSchema [collection1] default search field in schema is text. WARNING: Deprecated, please use 'df' on request instead.
   [junit4]   2> 1499608 INFO  (coreLoadExecutor-5148-thread-1) [    x:collection1] o.a.s.s.IndexSchema Loaded schema test/1.0 with uniqueid field id
   [junit4]   2> 1499614 INFO  (coreLoadExecutor-5148-thread-1) [    x:collection1] o.a.s.c.CoreContainer Creating SolrCore 'collection1' using configuration from instancedir /x1/jenkins/jenkins-slave/workspace/Lucene-Solr-Tests-6.x/solr/core/src/test-files/solr/collection1
   [junit4]   2> 1499614 WARN  (coreLoadExecutor-5148-thread-1) [    x:collection1] o.a.s.m.r.SolrJmxReporter No serviceUrl or agentId was configured, using first MBeanServer.
   [junit4]   2> 1499614 INFO  (coreLoadExecutor-5148-thread-1) [    x:collection1] o.a.s.m.r.SolrJmxReporter JMX monitoring enabled at server: com.sun.jmx.mbeanserver.JmxMBeanServer@809b01c
   [junit4]   2> 1499614 INFO  (coreLoadExecutor-5148-thread-1) [    x:collection1] o.a.s.c.SolrCore [[collection1] ] Opening new SolrCore at [/x1/jenkins/jenkins-slave/workspace/Lucene-Solr-Tests-6.x/solr/core/src/test-files/solr/collection1], dataDir=[/x1/jenkins/jenkins-slave/workspace/Lucene-Solr-Tests-6.x/solr/build/solr-core/test/J0/temp/solr.handler.admin.MBeansHandlerTest_7FA42FA52D59C4EE-001/init-core-data-001/]
   [junit4]   2> 1499615 INFO  (coreLoadExecutor-5148-thread-1) [    x:collection1] o.a.s.c.JmxMonitoredMap JMX monitoring is enabled. Adding Solr mbeans to JMX Server: com.sun.jmx.mbeanserver.JmxMBeanServer@809b01c
   [junit4]   2> 1499616 INFO  (coreLoadExecutor-5148-thread-1) [    x:collection1] o.a.s.u.RandomMergePolicy RandomMergePolicy wrapping class org.apache.lucene.index.LogByteSizeMergePolicy: [LogByteSizeMergePolicy: minMergeSize=1677721, mergeFactor=43, maxMergeSize=2147483648, maxMergeSizeForForcedMerge=9223372036854775807, calibrateSizeByDeletes=true, maxMergeDocs=2147483647, maxCFSSegmentSizeMB=8.796093022207999E12, noCFSRatio=1.0]
   [junit4]   2> 1499646 INFO  (coreLoadExecutor-5148-thread-1) [    x:collection1] o.a.s.u.UpdateHandler Using UpdateLog implementation: org.apache.solr.update.UpdateLog
   [junit4]   2> 1499646 INFO  (coreLoadExecutor-5148-thread-1) [    x:collection1] o.a.s.u.UpdateLog Initializing UpdateLog: dataDir= defaultSyncLevel=FLUSH numRecordsToKeep=100 maxNumLogsToKeep=10 numVersionBuckets=65536
   [junit4]   2> 1499647 INFO  (coreLoadExecutor-5148-thread-1) [    x:collection1] o.a.s.u.CommitTracker Hard AutoCommit: disabled
   [junit4]   2> 1499647 INFO  (coreLoadExecutor-5148-thread-1) [    x:collection1] o.a.s.u.CommitTracker Soft AutoCommit: disabled
   [junit4]   2> 1499647 INFO  (coreLoadExecutor-5148-thread-1) [    x:collection1] o.a.s.u.RandomMergePolicy RandomMergePolicy wrapping class org.apache.lucene.index.TieredMergePolicy: [TieredMergePolicy: maxMergeAtOnce=50, maxMergeAtOnceExplicit=31, maxMergedSegmentMB=49.7900390625, floorSegmentMB=1.166015625, forceMergeDeletesPctAllowed=20.351083618260905, segmentsPerTier=37.0, maxCFSSegmentSizeMB=8.796093022207999E12, noCFSRatio=1.0
   [junit4]   2> 1499648 INFO  (coreLoadExecutor-5148-thread-1) [    x:collection1] o.a.s.s.SolrIndexSearcher Opening [Searcher@2db3d43b[collection1] main]
   [junit4]   2> 1499649 INFO  (coreLoadExecutor-5148-thread-1) [    x:collection1] o.a.s.h.c.SpellCheckComponent Initializing spell checkers
   [junit4]   2> 1499655 INFO  (coreLoadExecutor-5148-thread-1) [    x:collection1] o.a.s.s.DirectSolrSpellChecker init: {name=direct,classname=DirectSolrSpellChecker,field=lowerfilt,minQueryLength=3}
   [junit4]   2> 1499697 INFO  (coreLoadExecutor-5148-thread-1) [    x:collection1] o.a.s.h.ReplicationHandler Commits will be reserved for  10000
   [junit4]   2> 1499697 INFO  (searcherExecutor-5149-thread-1-processing-x:collection1) [    x:collection1] o.a.s.h.c.SpellCheckComponent Loading spell index for spellchecker: default
   [junit4]   2> 1499698 INFO  (searcherExecutor-5149-thread-1-processing-x:collection1) [    x:collection1] o.a.s.h.c.SpellCheckComponent Loading spell index for spellchecker: direct
   [junit4]   2> 1499698 INFO  (searcherExecutor-5149-thread-1-processing-x:collection1) [    x:collection1] o.a.s.h.c.SpellCheckComponent Loading spell index for spellchecker: wordbreak
   [junit4]   2> 1499698 INFO  (searcherExecutor-5149-thread-1-processing-x:collection1) [    x:collection1] o.a.s.h.c.SpellCheckComponent Loading spell index for spellchecker: multipleFields
   [junit4]   2> 1499698 INFO  (searcherExecutor-5149-thread-1-processing-x:collection1) [    x:collection1] o.a.s.h.c.SpellCheckComponent Loading spell index for spellchecker: jarowinkler
   [junit4]   2> 1499698 INFO  (searcherExecutor-5149-thread-1-processing-x:collection1) [    x:collection1] o.a.s.h.c.SpellCheckComponent Loading spell index for spellchecker: external
   [junit4]   2> 1499699 INFO  (searcherExecutor-5149-thread-1-processing-x:collection1) [    x:collection1] o.a.s.h.c.SpellCheckComponent Loading spell index for spellchecker: freq
   [junit4]   2> 1499699 INFO  (searcherExecutor-5149-thread-1-processing-x:collection1) [    x:collection1] o.a.s.h.c.SpellCheckComponent Loading spell index for spellchecker: fqcn
   [junit4]   2> 1499699 INFO  (coreLoadExecutor-5148-thread-1) [    x:collection1] o.a.s.u.UpdateLog Could not find max version in index or recent updates, using new clock 1558312276729004032
   [junit4]   2> 1499699 INFO  (searcherExecutor-5149-thread-1-processing-x:collection1) [    x:collection1] o.a.s.h.c.SpellCheckComponent Loading spell index for spellchecker: perDict
   [junit4]   2> 1499700 INFO  (searcherExecutor-5149-thread-1-processing-x:collection1) [    x:collection1] o.a.s.c.SolrCore [collection1] Registered new searcher Searcher@2db3d43b[collection1] main{ExitableDirectoryReader(UninvertingDirectoryReader())}
   [junit4]   2> 1499702 INFO  (SUITE-MBeansHandlerTest-seed#[7FA42FA52D59C4EE]-worker) [    ] o.a.s.SolrTestCaseJ4 ####initCore end
   [junit4]   2> 1499704 INFO  (TEST-MBeansHandlerTest.testBackCompatNames-seed#[7FA42FA52D59C4EE]) [    ] o.a.s.SolrTestCaseJ4 ###Starting testBackCompatNames
   [junit4]   2> 1499705 INFO  (TEST-MBeansHandlerTest.testBackCompatNames-seed#[7FA42FA52D59C4EE]) [    ] o.a.s.c.S.Request [collection1]  webapp=null path=null params={qt=/admin/mbeans&wt=xml} status=0 QTime=1
   [junit4]   2> 1499716 INFO  (TEST-MBeansHandlerTest.testBackCompatNames-seed#[7FA42FA52D59C4EE]) [    ] o.a.s.c.S.Request [collection1]  webapp=null path=null params={qt=/admin/mbeans&cat=QUERYHANDLER&wt=xml} status=0 QTime=0
   [junit4]   2> 1499734 INFO  (TEST-MBeansHandlerTest.testBackCompatNames-seed#[7FA42FA52D59C4EE]) [    ] o.a.s.c.S.Request [collection1]  webapp=null path=null params={qt=/admin/mbeans&cat=UPDATE&wt=xml} status=0 QTime=0
   [junit4]   2> 1499734 INFO  (TEST-MBeansHandlerTest.testBackCompatNames-seed#[7FA42FA52D59C4EE]) [    ] o.a.s.SolrTestCaseJ4 ###Ending testBackCompatNames
   [junit4]   2> 1499737 INFO  (TEST-MBeansHandlerTest.testDiff-seed#[7FA42FA52D59C4EE]) [    ] o.a.s.SolrTestCaseJ4 ###Starting testDiff
   [junit4]   2> 1499744 INFO  (TEST-MBeansHandlerTest.testDiff-seed#[7FA42FA52D59C4EE]) [    ] o.a.s.c.S.Request [collection1]  webapp=null path=null params={qt=/admin/mbeans&stats=true&wt=xml} status=0 QTime=7
   [junit4]   2> 1499835 INFO  (TEST-MBeansHandlerTest.testDiff-seed#[7FA42FA52D59C4EE]) [    ] o.a.s.c.S.Request [collection1]  webapp=null path=null params={qt=/admin/mbeans&stats=true&diff=true&wt=xml} status=0 QTime=81
   [junit4]   2> 1499866 INFO  (TEST-MBeansHandlerTest.testDiff-seed#[7FA42FA52D59C4EE]) [    ] o.a.s.SolrTestCaseJ4 ###Ending testDiff
   [junit4]   2> NOTE: reproduce with: ant test  -Dtestcase=MBeansHandlerTest -Dtests.method=testDiff -Dtests.seed=7FA42FA52D59C4EE -Dtests.multiplier=2 -Dtests.slow=true -Dtests.locale=it-CH -Dtests.timezone=Australia/Canberra -Dtests.asserts=true -Dtests.file.encoding=UTF-8
   [junit4] FAILURE 0.13s J0 | MBeansHandlerTest.testDiff <<<
   [junit4]    > Throwable #1: org.junit.ComparisonFailure: expected:<Was: [1, Now: 2], Delta: 1> but was:<Was: [4, Now: 5], Delta: 1>
   [junit4]    > 	at __randomizedtesting.SeedInfo.seed([7FA42FA52D59C4EE:BAB2EB3E3DEFFC8E]:0)
   [junit4]    > 	at org.apache.solr.handler.admin.MBeansHandlerTest.testDiff(MBeansHandlerTest.java:63)
   [junit4]    > 	at java.lang.Thread.run(Thread.java:745)
   [junit4]   2> 1499948 INFO  (TEST-MBeansHandlerTest.testXMLDiffWithExternalEntity-seed#[7FA42FA52D59C4EE]) [    ] o.a.s.SolrTestCaseJ4 ###Starting testXMLDiffWithExternalEntity
   [junit4]   2> 1500004 INFO  (TEST-MBeansHandlerTest.testXMLDiffWithExternalEntity-seed#[7FA42FA52D59C4EE]) [    ] o.a.s.SolrTestCaseJ4 ###Ending testXMLDiffWithExternalEntity
   [junit4]   2> 1500005 INFO  (SUITE-MBeansHandlerTest-seed#[7FA42FA52D59C4EE]-worker) [    ] o.a.s.SolrTestCaseJ4 ###deleteCore
   [junit4]   2> 1500005 INFO  (SUITE-MBeansHandlerTest-seed#[7FA42FA52D59C4EE]-worker) [    ] o.a.s.c.CoreContainer Shutting down CoreContainer instance=130016839
   [junit4]   2> 1500006 INFO  (coreCloseExecutor-5154-thread-1) [    x:collection1] o.a.s.c.SolrCore [collection1]  CLOSING SolrCore org.apache.solr.core.SolrCore@691d5c7
   [junit4]   2> 1500035 INFO  (coreCloseExecutor-5154-thread-1) [    x:collection1] o.a.s.m.SolrMetricManager Closing metric reporters for: solr.core.collection1
   [junit4]   2> 1500038 INFO  (SUITE-MBeansHandlerTest-seed#[7FA42FA52D59C4EE]-worker) [    ] o.a.s.m.SolrMetricManager Closing metric reporters for: solr.node
   [junit4]   2> NOTE: leaving temporary files on disk at: /x1/jenkins/jenkins-slave/workspace/Lucene-Solr-Tests-6.x/solr/build/solr-core/test/J0/temp/solr.handler.admin.MBeansHandlerTest_7FA42FA52D59C4EE-001
   [junit4]   2> Feb 03, 2017 11:46:35 AM com.carrotsearch.randomizedtesting.ThreadLeakControl checkThreadLeaks
   [junit4]   2> WARNING: Will linger awaiting termination of 1 leaked thread(s).
   [junit4]   2> NOTE: test params are: codec=Asserting(Lucene62): {}, docValues:{}, maxPointsInLeafNode=1532, maxMBSortInHeap=6.394962643630455, sim=RandomSimilarity(queryNorm=false,coord=yes): {}, locale=it-CH, timezone=Australia/Canberra
   [junit4]   2> NOTE: Linux 3.13.0-85-generic amd64/Oracle Corporation 1.8.0_102 (64-bit)/cpus=4,threads=1,free=311641544,total=531103744
   [junit4]   2> NOTE: All tests run in this JVM: [CdcrUpdateLogTest, TestPHPSerializedResponseWriter, TestCloudManagedSchema, AnalyticsQueryTest, TestInitQParser, TestPerFieldSimilarity, DefaultValueUpdateProcessorTest, StandardRequestHandlerTest, TestCollectionAPI, ClassificationUpdateProcessorTest, NotRequiredUniqueKeyTest, TestLegacyFieldCache, TestFastWriter, TestMiniSolrCloudCluster, HttpPartitionTest, LeaderElectionIntegrationTest, TestSolrCloudWithKerberosAlt, TestHdfsBackupRestoreCore, BlockDirectoryTest, SignatureUpdateProcessorFactoryTest, ConcurrentDeleteAndCreateCollectionTest, TestManagedStopFilterFactory, TestFunctionQuery, TestStressLiveNodes, TestSolrCoreParser, TestBulkSchemaAPI, TestObjectReleaseTracker, PreAnalyzedFieldManagedSchemaCloudTest, TestFastLRUCache, TestNoOpRegenerator, TestExactSharedStatsCache, ChaosMonkeyNothingIsSafeTest, RankQueryTest, TestFilteredDocIdSet, TestRandomFaceting, HdfsChaosMonkeySafeLeaderTest, DistributedFacetPivotWhiteBoxTest, ScriptEngineTest, TestSimpleQParserPlugin, TestSolr4Spatial, TestClusterStateMutator, TestIBSimilarityFactory, TestFieldCacheSortRandom, HttpSolrCallGetCoreTest, SynonymTokenizerTest, SolrGraphiteReporterTest, FullHLLTest, TestManagedResource, TestHdfsUpdateLog, TestFieldCacheReopen, TestCodecSupport, TestSolrConfigHandlerCloud, TestUninvertingReader, TestPseudoReturnFields, TestComponentsName, TestBinaryResponseWriter, TestPivotHelperCode, TestShardHandlerFactory, TestStressRecovery, CloudExitableDirectoryReaderTest, HdfsDirectoryFactoryTest, TestMacroExpander, TestBadConfig, QueryElevationComponentTest, UUIDFieldTest, MigrateRouteKeyTest, HdfsLockFactoryTest, TestFieldCollectionResource, TestSolrDeletionPolicy2, OverseerTaskQueueTest, DistributedSuggestComponentTest, BasicAuthIntegrationTest, NumericFieldsTest, TestValueSourceCache, TestPKIAuthenticationPlugin, TestOnReconnectListenerSupport, TestSubQueryTransformer, DocumentAnalysisRequestHandlerTest, DeleteShardTest, CursorPagingTest, HdfsRecoverLeaseTest, DocValuesMissingTest, TestNonDefinedSimilarityFactory, TestInitParams, TestSolrQueryParserDefaultOperatorResource, TestRangeQuery, RequestLoggingTest, TestSolrCoreProperties, TestQuerySenderNoQuery, IgnoreCommitOptimizeUpdateProcessorFactoryTest, JvmMetricsTest, BigEndianAscendingWordSerializerTest, AnalysisAfterCoreReloadTest, InfoHandlerTest, BooleanFieldTest, TestStressLucene, BlockJoinFacetSimpleTest, CdcrVersionReplicationTest, TestCollationFieldDocValues, CollectionTooManyReplicasTest, SuggestComponentTest, DistribDocExpirationUpdateProcessorTest, TestRestoreCore, LeaderFailureAfterFreshStartTest, SolrIndexMetricsTest, TestOmitPositions, HdfsSyncSliceTest, DistributedQueryElevationComponentTest, BasicDistributedZkTest, SyncSliceTest, ZkCLITest, ShardRoutingCustomTest, AutoCommitTest, TestFaceting, TestRecovery, DistributedSpellCheckComponentTest, ZkControllerTest, TestRealTimeGet, TestJoin, SpellCheckComponentTest, PeerSyncTest, DirectUpdateHandlerTest, TestIndexSearcher, SoftAutoCommitTest, SpatialFilterTest, PolyFieldTest, TestAtomicUpdateErrorCases, QueryEqualityTest, TestRemoteStreaming, SolrInfoMBeanTest, XsltUpdateRequestHandlerTest, TestSurroundQueryParser, TestWriterPerf, DocumentBuilderTest, TermVectorComponentTest, FastVectorHighlighterTest, RegexBoostProcessorTest, MBeansHandlerTest]
   [junit4] Completed [411/682 (1!)] on J0 in 1.23s, 3 tests, 1 failure <<< FAILURES!

[...truncated 63313 lines...]