You are viewing a plain text version of this content. The canonical link for it is here.
Posted to dev@curator.apache.org by Apache Jenkins Server <je...@builds.apache.org> on 2015/08/25 19:58:41 UTC

Build failed in Jenkins: Curator-3.0 #3

See <https://builds.apache.org/job/Curator-3.0/3/>

------------------------------------------
Started by user mdrob
[EnvInject] - Loading node environment variables.
Building remotely on ubuntu-1 (docker Ubuntu ubuntu ubuntu1) in workspace <https://builds.apache.org/job/Curator-3.0/ws/>
Wiping out workspace first.
Cloning the remote Git repository
Cloning repository https://git-wip-us.apache.org/repos/asf/curator.git
 > git init <https://builds.apache.org/job/Curator-3.0/ws/> # timeout=10
Fetching upstream changes from https://git-wip-us.apache.org/repos/asf/curator.git
 > git --version # timeout=10
 > git fetch --tags --progress https://git-wip-us.apache.org/repos/asf/curator.git +refs/heads/*:refs/remotes/origin/*
 > git config remote.origin.url https://git-wip-us.apache.org/repos/asf/curator.git # timeout=10
 > git config remote.origin.fetch +refs/heads/*:refs/remotes/origin/* # timeout=10
 > git config remote.origin.url https://git-wip-us.apache.org/repos/asf/curator.git # timeout=10
Fetching upstream changes from https://git-wip-us.apache.org/repos/asf/curator.git
 > git fetch --tags --progress https://git-wip-us.apache.org/repos/asf/curator.git +refs/heads/*:refs/remotes/origin/*
 > git rev-parse refs/remotes/origin/CURATOR-3.0^{commit} # timeout=10
 > git rev-parse refs/remotes/origin/origin/CURATOR-3.0^{commit} # timeout=10
Checking out Revision f9af0ce81408f7a4cb4343fb0770e9e6ef545fda (refs/remotes/origin/CURATOR-3.0)
 > git config core.sparsecheckout # timeout=10
 > git checkout -f f9af0ce81408f7a4cb4343fb0770e9e6ef545fda
 > git rev-list f9af0ce81408f7a4cb4343fb0770e9e6ef545fda # timeout=10
Parsing POMs
Modules changed, recalculating dependency graph
maven31-agent.jar already up to date
maven31-interceptor.jar already up to date
maven3-interceptor-commons.jar already up to date
[Curator-3.0] $ /home/jenkins/tools/java/latest1.6/bin/java -Xmx2g -Xms256m -XX:MaxPermSize=512m -cp /home/jenkins/jenkins-slave/maven31-agent.jar:/home/jenkins/jenkins-slave/tools/hudson.tasks.Maven_MavenInstallation/maven-3.3.3/boot/plexus-classworlds-2.5.2.jar:/home/jenkins/jenkins-slave/tools/hudson.tasks.Maven_MavenInstallation/maven-3.3.3/conf/logging jenkins.maven3.agent.Maven31Main /home/jenkins/jenkins-slave/tools/hudson.tasks.Maven_MavenInstallation/maven-3.3.3 /home/jenkins/jenkins-slave/slave.jar /home/jenkins/jenkins-slave/maven31-interceptor.jar /home/jenkins/jenkins-slave/maven3-interceptor-commons.jar 55707
<===[JENKINS REMOTING CAPACITY]===>   channel started
channel stopped
ERROR: Failed to parse POMs
java.io.IOException: Remote call on Channel to Maven [/home/jenkins/tools/java/latest1.6/bin/java, -Xmx2g, -Xms256m, -XX:MaxPermSize=512m, -cp, /home/jenkins/jenkins-slave/maven31-agent.jar:/home/jenkins/jenkins-slave/tools/hudson.tasks.Maven_MavenInstallation/maven-3.3.3/boot/plexus-classworlds-2.5.2.jar:/home/jenkins/jenkins-slave/tools/hudson.tasks.Maven_MavenInstallation/maven-3.3.3/conf/logging, jenkins.maven3.agent.Maven31Main, /home/jenkins/jenkins-slave/tools/hudson.tasks.Maven_MavenInstallation/maven-3.3.3, /home/jenkins/jenkins-slave/slave.jar, /home/jenkins/jenkins-slave/maven31-interceptor.jar, /home/jenkins/jenkins-slave/maven3-interceptor-commons.jar, 55707] failed
	at hudson.remoting.Channel.call(Channel.java:751)
	at hudson.maven.ProcessCache$MavenProcess.call(ProcessCache.java:161)
	at hudson.maven.MavenModuleSetBuild$MavenModuleSetBuildExecution.doRun(MavenModuleSetBuild.java:840)
	at hudson.model.AbstractBuild$AbstractBuildExecution.run(AbstractBuild.java:529)
	at hudson.model.Run.execute(Run.java:1706)
	at hudson.maven.MavenModuleSetBuild.run(MavenModuleSetBuild.java:529)
	at hudson.model.ResourceController.execute(ResourceController.java:88)
	at hudson.model.Executor.run(Executor.java:232)
Caused by: java.lang.ClassFormatError: Failed to load hudson.maven.Maven3Builder$JenkinsEventSpy
	at hudson.remoting.RemoteClassLoader.loadClassFile(RemoteClassLoader.java:324)
	at hudson.remoting.RemoteClassLoader.findClass(RemoteClassLoader.java:236)
	at java.lang.ClassLoader.loadClass(ClassLoader.java:306)
	at java.lang.ClassLoader.loadClass(ClassLoader.java:247)
	at java.lang.Class.getDeclaredFields0(Native Method)
	at java.lang.Class.privateGetDeclaredFields(Class.java:2300)
	at java.lang.Class.getDeclaredField(Class.java:1882)
	at java.io.ObjectStreamClass.getDeclaredSUID(ObjectStreamClass.java:1605)
	at java.io.ObjectStreamClass.access$700(ObjectStreamClass.java:50)
	at java.io.ObjectStreamClass$2.run(ObjectStreamClass.java:423)
	at java.security.AccessController.doPrivileged(Native Method)
	at java.io.ObjectStreamClass.<init>(ObjectStreamClass.java:411)
	at java.io.ObjectStreamClass.lookup(ObjectStreamClass.java:308)
	at java.io.ObjectStreamClass.initNonProxy(ObjectStreamClass.java:545)
	at java.io.ObjectInputStream.readNonProxyDesc(ObjectInputStream.java:1599)
	at java.io.ObjectInputStream.readClassDesc(ObjectInputStream.java:1494)
	at java.io.ObjectInputStream.readOrdinaryObject(ObjectInputStream.java:1748)
	at java.io.ObjectInputStream.readObject0(ObjectInputStream.java:1327)
	at java.io.ObjectInputStream.readObject(ObjectInputStream.java:349)
	at hudson.remoting.UserRequest.deserialize(UserRequest.java:182)
	at hudson.remoting.UserRequest.perform(UserRequest.java:98)
	at hudson.remoting.UserRequest.perform(UserRequest.java:48)
	at hudson.remoting.Request$2.run(Request.java:328)
	at hudson.remoting.InterceptingExecutorService$1.call(InterceptingExecutorService.java:72)
	at java.util.concurrent.FutureTask$Sync.innerRun(FutureTask.java:303)
	at java.util.concurrent.FutureTask.run(FutureTask.java:138)
	at java.util.concurrent.ThreadPoolExecutor$Worker.runTask(ThreadPoolExecutor.java:895)
	at java.util.concurrent.ThreadPoolExecutor$Worker.run(ThreadPoolExecutor.java:918)
	at java.lang.Thread.run(Thread.java:662)
Caused by: java.lang.UnsupportedClassVersionError: org/apache/maven/eventspy/EventSpy : Unsupported major.minor version 51.0
	at java.lang.ClassLoader.defineClass1(Native Method)
	at java.lang.ClassLoader.defineClassCond(ClassLoader.java:631)
	at java.lang.ClassLoader.defineClass(ClassLoader.java:615)
	at java.security.SecureClassLoader.defineClass(SecureClassLoader.java:141)
	at java.net.URLClassLoader.defineClass(URLClassLoader.java:283)
	at java.net.URLClassLoader.access$000(URLClassLoader.java:58)
	at java.net.URLClassLoader$1.run(URLClassLoader.java:197)
	at java.security.AccessController.doPrivileged(Native Method)
	at java.net.URLClassLoader.findClass(URLClassLoader.java:190)
	at org.codehaus.plexus.classworlds.realm.ClassRealm.loadClassFromSelf(ClassRealm.java:401)
	at org.codehaus.plexus.classworlds.strategy.SelfFirstStrategy.loadClass(SelfFirstStrategy.java:42)
	at org.codehaus.plexus.classworlds.realm.ClassRealm.unsynchronizedLoadClass(ClassRealm.java:271)
	at org.codehaus.plexus.classworlds.realm.ClassRealm.loadClass(ClassRealm.java:254)
	at org.codehaus.plexus.classworlds.realm.ClassRealm.loadClass(ClassRealm.java:239)
	at org.codehaus.plexus.classworlds.realm.ClassRealm.loadClassFromParent(ClassRealm.java:445)
	at org.codehaus.plexus.classworlds.strategy.SelfFirstStrategy.loadClass(SelfFirstStrategy.java:46)
	at org.codehaus.plexus.classworlds.realm.ClassRealm.unsynchronizedLoadClass(ClassRealm.java:271)
	at org.codehaus.plexus.classworlds.realm.ClassRealm.loadClass(ClassRealm.java:254)
	at java.lang.ClassLoader.loadClass(ClassLoader.java:295)
	at java.lang.ClassLoader.loadClass(ClassLoader.java:247)
	at java.lang.ClassLoader.defineClass1(Native Method)
	at java.lang.ClassLoader.defineClassCond(ClassLoader.java:631)
	at java.lang.ClassLoader.defineClass(ClassLoader.java:615)
	at java.lang.ClassLoader.defineClass(ClassLoader.java:465)
	at hudson.remoting.RemoteClassLoader.loadClassFile(RemoteClassLoader.java:322)
	... 28 more

Jenkins build is back to normal : Curator-3.0 #6

Posted by Apache Jenkins Server <je...@builds.apache.org>.
See <https://builds.apache.org/job/Curator-3.0/6/changes>


Build failed in Jenkins: Curator-3.0 #5

Posted by Apache Jenkins Server <je...@builds.apache.org>.
See <https://builds.apache.org/job/Curator-3.0/5/>

------------------------------------------
[...truncated 1667 lines...]
Tests run: 3, Failures: 0, Errors: 0, Skipped: 0, Time elapsed: 7.146 sec - in org.apache.curator.ensemble.exhibitor.TestExhibitorEnsembleProvider
Running org.apache.curator.TestSessionFailRetryLoop
Tests run: 4, Failures: 0, Errors: 0, Skipped: 0, Time elapsed: 12.239 sec - in org.apache.curator.TestSessionFailRetryLoop

Results :

Tests run: 21, Failures: 0, Errors: 0, Skipped: 0

[JENKINS] Recording test results
log4j:WARN No appenders could be found for logger (org.apache.commons.beanutils.converters.BooleanConverter).
log4j:WARN Please initialize the log4j system properly.
[INFO] 
[INFO] --- maven-bundle-plugin:2.3.7:bundle (default-bundle) @ curator-client ---
[INFO] 
[INFO] --- maven-site-plugin:3.4:attach-descriptor (attach-descriptor) @ curator-client ---
[INFO] 
[INFO] --- maven-license-plugin:1.9.0:check (license) @ curator-client ---
[INFO] Checking licenses...
[CHECKSTYLE] No report found for mojo check
[INFO]                                                                         
[INFO] ------------------------------------------------------------------------
[INFO] Building Curator Framework 3.0.0-SNAPSHOT
[INFO] ------------------------------------------------------------------------
[INFO] Downloading: https://repo.maven.apache.org/maven2/log4j/log4j/1.2.17/log4j-1.2.17.jar
[INFO] Downloaded: https://repo.maven.apache.org/maven2/log4j/log4j/1.2.17/log4j-1.2.17.jar (479 KB at 9200.0 KB/sec)
[INFO] 
[INFO] --- maven-clean-plugin:2.5:clean (default-clean) @ curator-framework ---
[INFO] 
[INFO] --- maven-remote-resources-plugin:1.5:process (default) @ curator-framework ---
[INFO] 
[INFO] --- maven-resources-plugin:2.6:resources (default-resources) @ curator-framework ---
[INFO] Using 'UTF-8' encoding to copy filtered resources.
[INFO] Copying 2 resources to META-INF
[INFO] Copying 3 resources
[INFO] 
[INFO] --- maven-compiler-plugin:3.1:compile (default-compile) @ curator-framework ---
[INFO] Changes detected - recompiling the module!
[INFO] Compiling 144 source files to <https://builds.apache.org/job/Curator-3.0/ws/curator-framework/target/classes>
[WARNING] <https://builds.apache.org/job/Curator-3.0/ws/curator-framework/src/main/java/org/apache/curator/framework/imps/WatcherRemovalFacade.java>: Some input files use or override a deprecated API.
[WARNING] <https://builds.apache.org/job/Curator-3.0/ws/curator-framework/src/main/java/org/apache/curator/framework/imps/WatcherRemovalFacade.java>: Recompile with -Xlint:deprecation for details.
[INFO] 
[INFO] >>> clirr-maven-plugin:2.6.1:check (default) > compile @ curator-framework >>>
[INFO] 
[INFO] --- maven-remote-resources-plugin:1.5:process (default) @ curator-framework ---
[INFO] 
[INFO] --- maven-resources-plugin:2.6:resources (default-resources) @ curator-framework ---
[INFO] Using 'UTF-8' encoding to copy filtered resources.
[INFO] Copying 2 resources to META-INF
[INFO] Copying 3 resources
[INFO] Copying 3 resources
[INFO] 
[INFO] --- maven-compiler-plugin:3.1:compile (default-compile) @ curator-framework ---
[INFO] Nothing to compile - all classes are up to date
[WARNING] Failed to getClass for org.codehaus.mojo.clirr.ClirrCheckMojo
[CHECKSTYLE] No report found for mojo check
[INFO] 
[INFO] <<< clirr-maven-plugin:2.6.1:check (default) < compile @ curator-framework <<<
[INFO] 
[INFO] --- clirr-maven-plugin:2.6.1:check (default) @ curator-framework ---
[INFO] artifact org.apache.curator:curator-framework: checking for updates from Nexus
[INFO] artifact org.apache.curator:curator-framework: checking for updates from central
[INFO] Comparing to version: 2.8.0
[INFO] Downloading: https://repo.maven.apache.org/maven2/org/apache/curator/curator-framework/2.8.0/curator-framework-2.8.0.jar
[INFO] Downloaded: https://repo.maven.apache.org/maven2/org/apache/curator/curator-framework/2.8.0/curator-framework-2.8.0.jar (183 KB at 10112.6 KB/sec)
[INFO] Downloading: https://repo.maven.apache.org/maven2/org/apache/curator/curator-framework/2.8.0/curator-framework-2.8.0.pom
[INFO] Downloaded: https://repo.maven.apache.org/maven2/org/apache/curator/curator-framework/2.8.0/curator-framework-2.8.0.pom (3 KB at 264.2 KB/sec)
[ERROR] 7012: org.apache.curator.framework.CuratorFramework: Method 'public void createContainers(java.lang.String)' has been added to an interface
[ERROR] 7012: org.apache.curator.framework.CuratorFramework: Method 'public org.apache.curator.framework.api.GetConfigBuilder getConfig()' has been added to an interface
[ERROR] 7012: org.apache.curator.framework.CuratorFramework: Method 'public org.apache.curator.framework.WatcherRemoveCuratorFramework newWatcherRemoveCuratorFramework()' has been added to an interface
[ERROR] 7012: org.apache.curator.framework.CuratorFramework: Method 'public org.apache.curator.framework.api.ReconfigBuilder reconfig()' has been added to an interface
[ERROR] 7012: org.apache.curator.framework.CuratorFramework: Method 'public org.apache.curator.framework.api.transaction.CuratorMultiTransaction transaction()' has been added to an interface
[ERROR] 7012: org.apache.curator.framework.CuratorFramework: Method 'public org.apache.curator.framework.api.transaction.TransactionOp transactionOp()' has been added to an interface
[ERROR] 7012: org.apache.curator.framework.CuratorFramework: Method 'public org.apache.curator.framework.api.RemoveWatchesBuilder watches()' has been added to an interface
[ERROR] 7012: org.apache.curator.framework.api.CreateBackgroundModeACLable: Method 'public org.apache.curator.framework.api.ACLCreateModePathAndBytesable creatingParentContainersIfNeeded()' has been added to an interface
[ERROR] 7012: org.apache.curator.framework.api.CreateBuilder: Method 'public org.apache.curator.framework.api.ProtectACLCreateModePathAndBytesable creatingParentContainersIfNeeded()' has been added to an interface
[ERROR] 7012: org.apache.curator.framework.api.CuratorEvent: Method 'public java.util.List getOpResults()' has been added to an interface
[ERROR] 7012: org.apache.curator.framework.api.ExistsBuilder: Method 'public org.apache.curator.framework.api.ExistsBuilderMain creatingParentContainersIfNeeded()' has been added to an interface
[ERROR] 4001: org.apache.curator.framework.api.Guaranteeable: Removed org.apache.curator.framework.api.BackgroundPathable from the set of implemented interfaces
[ERROR] 4001: org.apache.curator.framework.api.Guaranteeable: Removed org.apache.curator.framework.api.BackgroundVersionable from the set of implemented interfaces
[ERROR] 4001: org.apache.curator.framework.api.Guaranteeable: Removed org.apache.curator.framework.api.Backgroundable from the set of implemented interfaces
[ERROR] 4001: org.apache.curator.framework.api.Guaranteeable: Removed org.apache.curator.framework.api.Pathable from the set of implemented interfaces
[ERROR] 4001: org.apache.curator.framework.api.Guaranteeable: Removed org.apache.curator.framework.api.Versionable from the set of implemented interfaces
[ERROR] 7006: org.apache.curator.framework.api.Guaranteeable: Return type of method 'public org.apache.curator.framework.api.ChildrenDeletable guaranteed()' has been changed to java.lang.Object
[INFO] Succeeded with 17 errors; 0 warnings; and 0 other changes.
[CHECKSTYLE] No report found for mojo check[INFO] 

[INFO] --- maven-bundle-plugin:2.3.7:manifest (bundle-manifest) @ curator-framework ---
[INFO] 
[INFO] --- maven-resources-plugin:2.6:testResources (default-testResources) @ curator-framework ---
[INFO] Using 'UTF-8' encoding to copy filtered resources.
[INFO] Copying 1 resource
[INFO] Copying 3 resources
[INFO] 
[INFO] --- maven-compiler-plugin:3.1:testCompile (default-testCompile) @ curator-framework ---
[INFO] Changes detected - recompiling the module!
[INFO] Compiling 20 source files to <https://builds.apache.org/job/Curator-3.0/ws/curator-framework/target/test-classes>
[WARNING] <https://builds.apache.org/job/Curator-3.0/ws/curator-framework/src/test/java/org/apache/curator/framework/imps/TestFramework.java>: <https://builds.apache.org/job/Curator-3.0/ws/curator-framework/src/test/java/org/apache/curator/framework/imps/TestFramework.java> uses or overrides a deprecated API.
[WARNING] <https://builds.apache.org/job/Curator-3.0/ws/curator-framework/src/test/java/org/apache/curator/framework/imps/TestFramework.java>: Recompile with -Xlint:deprecation for details.
[INFO] 
[INFO] --- maven-surefire-plugin:2.17:test (default-test) @ curator-framework ---
[INFO] Surefire report directory: <https://builds.apache.org/job/Curator-3.0/ws/curator-framework/target/surefire-reports>

-------------------------------------------------------
 T E S T S
-------------------------------------------------------

-------------------------------------------------------
 T E S T S
-------------------------------------------------------
Running org.apache.curator.framework.imps.TestWithCluster
Tests run: 2, Failures: 0, Errors: 0, Skipped: 0, Time elapsed: 199.005 sec - in org.apache.curator.framework.imps.TestWithCluster
Running org.apache.curator.framework.imps.TestFailedDeleteManager
Tests run: 6, Failures: 0, Errors: 0, Skipped: 0, Time elapsed: 344.402 sec - in org.apache.curator.framework.imps.TestFailedDeleteManager
Running org.apache.curator.framework.imps.TestMultiClient
Tests run: 1, Failures: 0, Errors: 0, Skipped: 0, Time elapsed: 2.087 sec - in org.apache.curator.framework.imps.TestMultiClient
Running org.apache.curator.framework.imps.TestCompressionInTransactionOld
Tests run: 4, Failures: 0, Errors: 0, Skipped: 0, Time elapsed: 5.213 sec - in org.apache.curator.framework.imps.TestCompressionInTransactionOld
Running org.apache.curator.framework.imps.TestFramework
Tests run: 29, Failures: 0, Errors: 0, Skipped: 0, Time elapsed: 86.664 sec - in org.apache.curator.framework.imps.TestFramework
Running org.apache.curator.framework.imps.TestNamespaceFacade
Tests run: 8, Failures: 0, Errors: 0, Skipped: 0, Time elapsed: 9.417 sec - in org.apache.curator.framework.imps.TestNamespaceFacade
Running org.apache.curator.framework.imps.TestFrameworkEdges
Tests run: 13, Failures: 0, Errors: 0, Skipped: 0, Time elapsed: 146.988 sec - in org.apache.curator.framework.imps.TestFrameworkEdges
Running org.apache.curator.framework.imps.TestWatcherIdentity
Tests run: 4, Failures: 0, Errors: 0, Skipped: 0, Time elapsed: 40.312 sec - in org.apache.curator.framework.imps.TestWatcherIdentity
Running org.apache.curator.framework.imps.TestTransactionsOld
Tests run: 3, Failures: 0, Errors: 0, Skipped: 0, Time elapsed: 4.182 sec - in org.apache.curator.framework.imps.TestTransactionsOld
Running org.apache.curator.framework.imps.TestReconfiguration
Tests run: 4, Failures: 0, Errors: 0, Skipped: 0, Time elapsed: 9.551 sec - in org.apache.curator.framework.imps.TestReconfiguration
Running org.apache.curator.framework.imps.TestCompressionInTransactionNew
Tests run: 4, Failures: 0, Errors: 0, Skipped: 0, Time elapsed: 5.216 sec - in org.apache.curator.framework.imps.TestCompressionInTransactionNew
Running org.apache.curator.framework.imps.TestNeverConnected
Tests run: 1, Failures: 0, Errors: 0, Skipped: 0, Time elapsed: 3.493 sec - in org.apache.curator.framework.imps.TestNeverConnected
Running org.apache.curator.framework.imps.TestCompression
Tests run: 3, Failures: 0, Errors: 0, Skipped: 0, Time elapsed: 4.187 sec - in org.apache.curator.framework.imps.TestCompression
Running org.apache.curator.framework.imps.TestReadOnly
Tests run: 2, Failures: 0, Errors: 0, Skipped: 0, Time elapsed: 50.056 sec - in org.apache.curator.framework.imps.TestReadOnly
Running org.apache.curator.framework.imps.TestTransactionsNew
Tests run: 5, Failures: 0, Errors: 0, Skipped: 0, Time elapsed: 7.25 sec - in org.apache.curator.framework.imps.TestTransactionsNew
Running org.apache.curator.framework.imps.TestTempFramework
Tests run: 2, Failures: 0, Errors: 0, Skipped: 0, Time elapsed: 5.101 sec - in org.apache.curator.framework.imps.TestTempFramework
Running org.apache.curator.framework.imps.TestFrameworkBackground
Tests run: 5, Failures: 0, Errors: 0, Skipped: 0, Time elapsed: 30.392 sec - in org.apache.curator.framework.imps.TestFrameworkBackground
Running org.apache.curator.framework.imps.TestRemoveWatches
Tests run: 14, Failures: 0, Errors: 0, Skipped: 0, Time elapsed: 65.482 sec - in org.apache.curator.framework.imps.TestRemoveWatches
Running org.apache.curator.framework.imps.TestBlockUntilConnected
Tests run: 6, Failures: 0, Errors: 0, Skipped: 0, Time elapsed: 32.649 sec - in org.apache.curator.framework.imps.TestBlockUntilConnected
Running org.apache.curator.framework.imps.TestWatcherRemovalManager
Tests run: 7, Failures: 0, Errors: 0, Skipped: 0, Time elapsed: 8.315 sec - in org.apache.curator.framework.imps.TestWatcherRemovalManager

Results :

Tests run: 123, Failures: 0, Errors: 0, Skipped: 0

[JENKINS] Recording test results
[INFO] 
[INFO] --- maven-bundle-plugin:2.3.7:bundle (default-bundle) @ curator-framework ---
[INFO] 
[INFO] --- maven-site-plugin:3.4:attach-descriptor (attach-descriptor) @ curator-framework ---
[INFO] 
[INFO] --- maven-license-plugin:1.9.0:check (license) @ curator-framework ---
[INFO] Checking licenses...
[INFO] Missing header in: <https://builds.apache.org/job/Curator-3.0/ws/curator-framework/src/main/java/org/apache/curator/framework/api/BackgroundPathableQuietlyable.java>
[CHECKSTYLE] No report found for mojo check
[INFO] ------------------------------------------------------------------------
[INFO] Reactor Summary:
[INFO] 
[INFO] Apache Curator ..................................... SUCCESS [ 25.203 s]
[INFO] Curator Testing .................................... SUCCESS [ 12.654 s]
[INFO] Curator Client ..................................... SUCCESS [01:10 min]
[INFO] Curator Framework .................................. FAILURE [17:52 min]
[INFO] Curator Recipes .................................... SKIPPED
[INFO] Curator Service Discovery .......................... SKIPPED
[INFO] Curator Examples ................................... SKIPPED
[INFO] Curator Service Discovery Server ................... SKIPPED
[INFO] Curator RPC Proxy .................................. SKIPPED
[INFO] ------------------------------------------------------------------------
[INFO] BUILD FAILURE
[INFO] ------------------------------------------------------------------------
[INFO] Total time: 19:54 min
[INFO] Finished at: 2015-08-25T18:46:15+00:00
[INFO] Final Memory: 31M/242M
[INFO] ------------------------------------------------------------------------
Waiting for Jenkins to finish collecting data
[ERROR] Failed to execute goal com.mycila.maven-license-plugin:maven-license-plugin:1.9.0:check (license) on project curator-framework: Some files do not have the expected license header -> [Help 1]
[ERROR] 
[ERROR] To see the full stack trace of the errors, re-run Maven with the -e switch.
[ERROR] Re-run Maven using the -X switch to enable full debug logging.
[ERROR] 
[ERROR] For more information about the errors and possible solutions, please read the following articles:
[ERROR] [Help 1] http://cwiki.apache.org/confluence/display/MAVEN/MojoExecutionException
[ERROR] 
[ERROR] After correcting the problems, you can resume the build with the command
[ERROR]   mvn <goals> -rf :curator-framework
[JENKINS] Archiving <https://builds.apache.org/job/Curator-3.0/ws/curator-x-rpc/pom.xml> to org.apache.curator/curator-x-rpc/3.0.0-SNAPSHOT/curator-x-rpc-3.0.0-SNAPSHOT.pom
Sending artifact delta relative to Curator-3.0 » Curator RPC Proxy #1
Archived 1 artifacts
Archive block size is 32768
Received 0 blocks and 7132 bytes
Compression is 0.0%
Took 2.8 sec
[JENKINS] Archiving <https://builds.apache.org/job/Curator-3.0/ws/curator-client/pom.xml> to org.apache.curator/curator-client/3.0.0-SNAPSHOT/curator-client-3.0.0-SNAPSHOT.pom
[JENKINS] Archiving <https://builds.apache.org/job/Curator-3.0/ws/curator-client/target/curator-client-3.0.0-SNAPSHOT.jar> to org.apache.curator/curator-client/3.0.0-SNAPSHOT/curator-client-3.0.0-SNAPSHOT.jar
No artifacts from Curator-3.0 » Curator Client #2 to compare, so performing full copy of artifacts
[JENKINS] Archiving <https://builds.apache.org/job/Curator-3.0/ws/curator-framework/pom.xml> to org.apache.curator/curator-framework/3.0.0-SNAPSHOT/curator-framework-3.0.0-SNAPSHOT.pom
[JENKINS] Archiving <https://builds.apache.org/job/Curator-3.0/ws/curator-framework/target/curator-framework-3.0.0-SNAPSHOT.jar> to org.apache.curator/curator-framework/3.0.0-SNAPSHOT/curator-framework-3.0.0-SNAPSHOT.jar
No artifacts from Curator-3.0 » Curator Framework #2 to compare, so performing full copy of artifacts
[JENKINS] Archiving <https://builds.apache.org/job/Curator-3.0/ws/curator-x-discovery-server/pom.xml> to org.apache.curator/curator-x-discovery-server/3.0.0-SNAPSHOT/curator-x-discovery-server-3.0.0-SNAPSHOT.pom
Sending artifact delta relative to Curator-3.0 » Curator Service Discovery Server #1
Archived 1 artifacts
Archive block size is 32768
Received 0 blocks and 4209 bytes
Compression is 0.0%
Took 0.14 sec
[JENKINS] Archiving <https://builds.apache.org/job/Curator-3.0/ws/curator-examples/pom.xml> to org.apache.curator/curator-examples/3.0.0-SNAPSHOT/curator-examples-3.0.0-SNAPSHOT.pom
Sending artifact delta relative to Curator-3.0 » Curator Examples #1
Archived 1 artifacts
Archive block size is 32768
Received 0 blocks and 2223 bytes
Compression is 0.0%
Took 0.14 sec
[JENKINS] Archiving <https://builds.apache.org/job/Curator-3.0/ws/curator-test/pom.xml> to org.apache.curator/curator-test/3.0.0-SNAPSHOT/curator-test-3.0.0-SNAPSHOT.pom
[JENKINS] Archiving <https://builds.apache.org/job/Curator-3.0/ws/curator-test/target/curator-test-3.0.0-SNAPSHOT.jar> to org.apache.curator/curator-test/3.0.0-SNAPSHOT/curator-test-3.0.0-SNAPSHOT.jar
No artifacts from Curator-3.0 » Curator Testing #2 to compare, so performing full copy of artifacts
[JENKINS] Archiving <https://builds.apache.org/job/Curator-3.0/ws/curator-recipes/pom.xml> to org.apache.curator/curator-recipes/3.0.0-SNAPSHOT/curator-recipes-3.0.0-SNAPSHOT.pom
Sending artifact delta relative to Curator-3.0 » Curator Recipes #1
Archived 1 artifacts
Archive block size is 32768
Received 0 blocks and 2810 bytes
Compression is 0.0%
Took 0.14 sec
[JENKINS] Archiving <https://builds.apache.org/job/Curator-3.0/ws/pom.xml> to org.apache.curator/apache-curator/3.0.0-SNAPSHOT/apache-curator-3.0.0-SNAPSHOT.pom
[JENKINS] Archiving <https://builds.apache.org/job/Curator-3.0/ws/target/apache-curator-3.0.0-SNAPSHOT-site.xml> to org.apache.curator/apache-curator/3.0.0-SNAPSHOT/apache-curator-3.0.0-SNAPSHOT-site.xml
Sending artifact delta relative to Curator-3.0 » Apache Curator #4
Archived 2 artifacts
Archive block size is 32768
Received 1 blocks and 3298 bytes
Compression is 90.9%
Took 0.24 sec
[JENKINS] Archiving <https://builds.apache.org/job/Curator-3.0/ws/curator-x-discovery/pom.xml> to org.apache.curator/curator-x-discovery/3.0.0-SNAPSHOT/curator-x-discovery-3.0.0-SNAPSHOT.pom
Sending artifact delta relative to Curator-3.0 » Curator Service Discovery #1
Archived 1 artifacts
Archive block size is 32768
Received 0 blocks and 2585 bytes
Compression is 0.0%
Took 0.14 sec
Sending e-mails to: dev@curator.apache.org
Sending e-mails to: dev@curator.apache.org
channel stopped

Re: Build failed in Jenkins: Curator-3.0 #4

Posted by Mike Drob <ma...@cloudera.com>.
Apologies for the noise here. When I initially configured the Curator-3.0
job, I missed that it needed to be Java 7, so we're ending up with a few
failed builds because of that.

On Tue, Aug 25, 2015 at 1:19 PM, Apache Jenkins Server <
jenkins@builds.apache.org> wrote:

> See <https://builds.apache.org/job/Curator-3.0/4/>
>
> ------------------------------------------
> [...truncated 1113 lines...]
> [INFO] Downloaded:
> https://repo.maven.apache.org/maven2/org/codehaus/woodstox/wstx-asl/3.2.6/wstx-asl-3.2.6.jar
> (509 KB at 7585.0 KB/sec)
> [INFO] Downloaded:
> https://repo.maven.apache.org/maven2/org/codehaus/plexus/plexus-utils/2.0.5/plexus-utils-2.0.5.jar
> (218 KB at 3113.4 KB/sec)
> [INFO] Downloaded:
> https://repo.maven.apache.org/maven2/com/google/code/google-collections/google-collect/snapshot-20080530/google-collect-snapshot-20080530.jar
> (490 KB at 5695.8 KB/sec)
> [INFO] Checking licenses...
> [CHECKSTYLE] No report found for mojo check
> [INFO]
> [INFO]
> ------------------------------------------------------------------------
> [INFO] Building Curator Testing 3.0.0-SNAPSHOT
> [INFO]
> ------------------------------------------------------------------------
> [INFO] Downloading:
> https://repo.maven.apache.org/maven2/org/apache/maven/plugins/maven-resources-plugin/2.6/maven-resources-plugin-2.6.pom
> [INFO] Downloaded:
> https://repo.maven.apache.org/maven2/org/apache/maven/plugins/maven-resources-plugin/2.6/maven-resources-plugin-2.6.pom
> (8 KB at 609.6 KB/sec)
> [INFO] Downloading:
> https://repo.maven.apache.org/maven2/org/apache/maven/plugins/maven-plugins/23/maven-plugins-23.pom
> [INFO] Downloaded:
> https://repo.maven.apache.org/maven2/org/apache/maven/plugins/maven-plugins/23/maven-plugins-23.pom
> (9 KB at 898.2 KB/sec)
> [INFO] Downloading:
> https://repo.maven.apache.org/maven2/org/apache/maven/plugins/maven-resources-plugin/2.6/maven-resources-plugin-2.6.jar
> [INFO] Downloaded:
> https://repo.maven.apache.org/maven2/org/apache/maven/plugins/maven-resources-plugin/2.6/maven-resources-plugin-2.6.jar
> (29 KB at 2620.6 KB/sec)
> [INFO] Downloading:
> https://repo.maven.apache.org/maven2/org/apache/maven/plugins/maven-compiler-plugin/3.1/maven-compiler-plugin-3.1.pom
> [INFO] Downloaded:
> https://repo.maven.apache.org/maven2/org/apache/maven/plugins/maven-compiler-plugin/3.1/maven-compiler-plugin-3.1.pom
> (10 KB at 1246.3 KB/sec)
> [INFO] Downloading:
> https://repo.maven.apache.org/maven2/org/apache/maven/plugins/maven-compiler-plugin/3.1/maven-compiler-plugin-3.1.jar
> [INFO] Downloaded:
> https://repo.maven.apache.org/maven2/org/apache/maven/plugins/maven-compiler-plugin/3.1/maven-compiler-plugin-3.1.jar
> (42 KB at 4660.3 KB/sec)
> [INFO] Downloading:
> https://repo.maven.apache.org/maven2/org/apache/maven/plugins/maven-surefire-plugin/2.17/maven-surefire-plugin-2.17.pom
> [INFO] Downloaded:
> https://repo.maven.apache.org/maven2/org/apache/maven/plugins/maven-surefire-plugin/2.17/maven-surefire-plugin-2.17.pom
> (5 KB at 488.4 KB/sec)
> [INFO] Downloading:
> https://repo.maven.apache.org/maven2/org/apache/maven/surefire/surefire/2.17/surefire-2.17.pom
> [INFO] Downloaded:
> https://repo.maven.apache.org/maven2/org/apache/maven/surefire/surefire/2.17/surefire-2.17.pom
> (17 KB at 1207.2 KB/sec)
> [INFO] Downloading:
> https://repo.maven.apache.org/maven2/org/apache/maven/plugins/maven-surefire-plugin/2.17/maven-surefire-plugin-2.17.jar
> [INFO] Downloaded:
> https://repo.maven.apache.org/maven2/org/apache/maven/plugins/maven-surefire-plugin/2.17/maven-surefire-plugin-2.17.jar
> (34 KB at 3039.0 KB/sec)
> [INFO] Downloading:
> https://repo.maven.apache.org/maven2/org/apache/maven/plugins/maven-jar-plugin/2.5/maven-jar-plugin-2.5.pom
> [INFO] Downloaded:
> https://repo.maven.apache.org/maven2/org/apache/maven/plugins/maven-jar-plugin/2.5/maven-jar-plugin-2.5.pom
> (8 KB at 514.1 KB/sec)
> [INFO] Downloading:
> https://repo.maven.apache.org/maven2/org/apache/maven/plugins/maven-jar-plugin/2.5/maven-jar-plugin-2.5.jar
> [INFO] Downloaded:
> https://repo.maven.apache.org/maven2/org/apache/maven/plugins/maven-jar-plugin/2.5/maven-jar-plugin-2.5.jar
> (25 KB at 2429.3 KB/sec)
> [INFO] Downloading:
> https://repo.maven.apache.org/maven2/org/apache/zookeeper/zookeeper/3.5.0-alpha/zookeeper-3.5.0-alpha.pom
> [INFO] Downloaded:
> https://repo.maven.apache.org/maven2/org/apache/zookeeper/zookeeper/3.5.0-alpha/zookeeper-3.5.0-alpha.pom
> (5 KB at 333.5 KB/sec)
> [INFO] Downloading:
> https://repo.maven.apache.org/maven2/org/slf4j/slf4j-api/1.7.6/slf4j-api-1.7.6.pom
> [INFO] Downloaded:
> https://repo.maven.apache.org/maven2/org/slf4j/slf4j-api/1.7.6/slf4j-api-1.7.6.pom
> (3 KB at 328.2 KB/sec)
> [INFO] Downloading:
> https://repo.maven.apache.org/maven2/org/slf4j/slf4j-parent/1.7.6/slf4j-parent-1.7.6.pom
> [INFO] Downloaded:
> https://repo.maven.apache.org/maven2/org/slf4j/slf4j-parent/1.7.6/slf4j-parent-1.7.6.pom
> (12 KB at 1162.8 KB/sec)
> [INFO] Downloading:
> https://repo.maven.apache.org/maven2/log4j/log4j/1.2.16/log4j-1.2.16.pom
> [INFO] Downloaded:
> https://repo.maven.apache.org/maven2/log4j/log4j/1.2.16/log4j-1.2.16.pom
> (20 KB at 1045.4 KB/sec)
> [INFO] Downloading:
> https://repo.maven.apache.org/maven2/io/netty/netty/3.7.0.Final/netty-3.7.0.Final.pom
> [INFO] Downloaded:
> https://repo.maven.apache.org/maven2/io/netty/netty/3.7.0.Final/netty-3.7.0.Final.pom
> (26 KB at 1968.4 KB/sec)
> [INFO] Downloading:
> https://repo.maven.apache.org/maven2/org/sonatype/oss/oss-parent/7/oss-parent-7.pom
> [INFO] Downloaded:
> https://repo.maven.apache.org/maven2/org/sonatype/oss/oss-parent/7/oss-parent-7.pom
> (5 KB at 673.0 KB/sec)
> [INFO] Downloading:
> https://repo.maven.apache.org/maven2/net/java/dev/javacc/javacc/5.0/javacc-5.0.pom
> [INFO] Downloaded:
> https://repo.maven.apache.org/maven2/net/java/dev/javacc/javacc/5.0/javacc-5.0.pom
> (3 KB at 202.8 KB/sec)
> [INFO] Downloading:
> https://repo.maven.apache.org/maven2/org/javassist/javassist/3.18.1-GA/javassist-3.18.1-GA.pom
> [INFO] Downloaded:
> https://repo.maven.apache.org/maven2/org/javassist/javassist/3.18.1-GA/javassist-3.18.1-GA.pom
> (10 KB at 1033.2 KB/sec)
> [INFO] Downloading:
> https://repo.maven.apache.org/maven2/org/apache/commons/commons-math/2.2/commons-math-2.2.pom
> [INFO] Downloaded:
> https://repo.maven.apache.org/maven2/org/apache/commons/commons-math/2.2/commons-math-2.2.pom
> (11 KB at 1091.8 KB/sec)
> [INFO] Downloading:
> https://repo.maven.apache.org/maven2/org/apache/commons/commons-parent/18/commons-parent-18.pom
> [INFO] Downloaded:
> https://repo.maven.apache.org/maven2/org/apache/commons/commons-parent/18/commons-parent-18.pom
> (33 KB at 2517.6 KB/sec)
> [INFO] Downloading:
> https://repo.maven.apache.org/maven2/com/google/guava/guava/16.0.1/guava-16.0.1.pom
> [INFO] Downloaded:
> https://repo.maven.apache.org/maven2/com/google/guava/guava/16.0.1/guava-16.0.1.pom
> (6 KB at 496.6 KB/sec)
> [INFO] Downloading:
> https://repo.maven.apache.org/maven2/com/google/guava/guava-parent/16.0.1/guava-parent-16.0.1.pom
> [INFO] Downloaded:
> https://repo.maven.apache.org/maven2/com/google/guava/guava-parent/16.0.1/guava-parent-16.0.1.pom
> (8 KB at 796.0 KB/sec)
> [INFO] Downloading:
> https://repo.maven.apache.org/maven2/org/testng/testng/6.8.8/testng-6.8.8.pom
> [INFO] Downloaded:
> https://repo.maven.apache.org/maven2/org/testng/testng/6.8.8/testng-6.8.8.pom
> (8 KB at 231.1 KB/sec)
> [INFO] Downloading:
> https://repo.maven.apache.org/maven2/org/sonatype/oss/oss-parent/3/oss-parent-3.pom
> [INFO] Downloaded:
> https://repo.maven.apache.org/maven2/org/sonatype/oss/oss-parent/3/oss-parent-3.pom
> (4 KB at 409.1 KB/sec)
> [INFO] Downloading:
> https://repo.maven.apache.org/maven2/org/beanshell/bsh/2.0b4/bsh-2.0b4.pom
> [INFO] Downloaded:
> https://repo.maven.apache.org/maven2/org/beanshell/bsh/2.0b4/bsh-2.0b4.pom
> (2 KB at 145.9 KB/sec)
> [INFO] Downloading:
> https://repo.maven.apache.org/maven2/org/beanshell/beanshell/2.0b4/beanshell-2.0b4.pom
> [INFO] Downloaded:
> https://repo.maven.apache.org/maven2/org/beanshell/beanshell/2.0b4/beanshell-2.0b4.pom
> (2 KB at 153.2 KB/sec)
> [INFO] Downloading:
> https://repo.maven.apache.org/maven2/com/beust/jcommander/1.27/jcommander-1.27.pom
> [INFO] Downloaded:
> https://repo.maven.apache.org/maven2/com/beust/jcommander/1.27/jcommander-1.27.pom
> (8 KB at 780.2 KB/sec)
> [INFO] Downloading:
> https://repo.maven.apache.org/maven2/org/slf4j/slf4j-log4j12/1.7.6/slf4j-log4j12-1.7.6.pom
> [INFO] Downloaded:
> https://repo.maven.apache.org/maven2/org/slf4j/slf4j-log4j12/1.7.6/slf4j-log4j12-1.7.6.pom
> (2 KB at 142.0 KB/sec)
> [INFO] Downloading:
> https://repo.maven.apache.org/maven2/log4j/log4j/1.2.17/log4j-1.2.17.pom
> [INFO] Downloaded:
> https://repo.maven.apache.org/maven2/log4j/log4j/1.2.17/log4j-1.2.17.pom
> (22 KB at 1930.5 KB/sec)
> [INFO] Downloading:
> https://repo.maven.apache.org/maven2/org/apache/zookeeper/zookeeper/3.5.0-alpha/zookeeper-3.5.0-alpha.jar
> [INFO] Downloading:
> https://repo.maven.apache.org/maven2/org/slf4j/slf4j-api/1.7.6/slf4j-api-1.7.6.jar
> [INFO] Downloading:
> https://repo.maven.apache.org/maven2/log4j/log4j/1.2.16/log4j-1.2.16.jar
> [INFO] Downloading:
> https://repo.maven.apache.org/maven2/io/netty/netty/3.7.0.Final/netty-3.7.0.Final.jar
> [INFO] Downloading:
> https://repo.maven.apache.org/maven2/net/java/dev/javacc/javacc/5.0/javacc-5.0.jar
> [INFO] Downloaded:
> https://repo.maven.apache.org/maven2/org/slf4j/slf4j-api/1.7.6/slf4j-api-1.7.6.jar
> (29 KB at 1751.0 KB/sec)
> [INFO] Downloading:
> https://repo.maven.apache.org/maven2/org/javassist/javassist/3.18.1-GA/javassist-3.18.1-GA.jar
> [INFO] Downloaded:
> https://repo.maven.apache.org/maven2/log4j/log4j/1.2.16/log4j-1.2.16.jar
> (471 KB at 10222.8 KB/sec)
> [INFO] Downloading:
> https://repo.maven.apache.org/maven2/org/apache/commons/commons-math/2.2/commons-math-2.2.jar
> [INFO] Downloaded:
> https://repo.maven.apache.org/maven2/net/java/dev/javacc/javacc/5.0/javacc-5.0.jar
> (292 KB at 6338.5 KB/sec)
> [INFO] Downloading:
> https://repo.maven.apache.org/maven2/com/google/guava/guava/16.0.1/guava-16.0.1.jar
> [INFO] Downloaded:
> https://repo.maven.apache.org/maven2/org/javassist/javassist/3.18.1-GA/javassist-3.18.1-GA.jar
> (698 KB at 7419.7 KB/sec)
> [INFO] Downloading:
> https://repo.maven.apache.org/maven2/org/testng/testng/6.8.8/testng-6.8.8.jar
> [INFO] Downloaded:
> https://repo.maven.apache.org/maven2/io/netty/netty/3.7.0.Final/netty-3.7.0.Final.jar
> (1181 KB at 9672.4 KB/sec)
> [INFO] Downloading:
> https://repo.maven.apache.org/maven2/org/beanshell/bsh/2.0b4/bsh-2.0b4.jar
> [INFO] Downloaded:
> https://repo.maven.apache.org/maven2/org/apache/zookeeper/zookeeper/3.5.0-alpha/zookeeper-3.5.0-alpha.jar
> (931 KB at 6889.4 KB/sec)
> [INFO] Downloading:
> https://repo.maven.apache.org/maven2/com/beust/jcommander/1.27/jcommander-1.27.jar
> [INFO] Downloaded:
> https://repo.maven.apache.org/maven2/org/apache/commons/commons-math/2.2/commons-math-2.2.jar
> (966 KB at 7204.1 KB/sec)
> [INFO] Downloading:
> https://repo.maven.apache.org/maven2/org/slf4j/slf4j-log4j12/1.7.6/slf4j-log4j12-1.7.6.jar
> [INFO] Downloaded:
> https://repo.maven.apache.org/maven2/org/beanshell/bsh/2.0b4/bsh-2.0b4.jar
> (276 KB at 1937.3 KB/sec)
> [INFO] Downloaded:
> https://repo.maven.apache.org/maven2/com/beust/jcommander/1.27/jcommander-1.27.jar
> (55 KB at 377.0 KB/sec)
> [INFO] Downloaded:
> https://repo.maven.apache.org/maven2/org/slf4j/slf4j-log4j12/1.7.6/slf4j-log4j12-1.7.6.jar
> (9 KB at 58.1 KB/sec)
> [INFO] Downloaded:
> https://repo.maven.apache.org/maven2/org/testng/testng/6.8.8/testng-6.8.8.jar
> (817 KB at 5170.1 KB/sec)
> [INFO] Downloaded:
> https://repo.maven.apache.org/maven2/com/google/guava/guava/16.0.1/guava-16.0.1.jar
> (2176 KB at 11157.9 KB/sec)
> [INFO]
> [INFO] --- maven-clean-plugin:2.5:clean (default-clean) @ curator-test ---
> [INFO]
> [INFO] --- maven-remote-resources-plugin:1.5:process (default) @
> curator-test ---
> [INFO]
> [INFO] --- maven-resources-plugin:2.6:resources (default-resources) @
> curator-test ---
> [INFO] Using 'UTF-8' encoding to copy filtered resources.
> [INFO] Copying 2 resources to META-INF
> [INFO] Copying 3 resources
> [INFO]
> [INFO] --- maven-compiler-plugin:3.1:compile (default-compile) @
> curator-test ---
> [INFO] Downloading:
> https://repo.maven.apache.org/maven2/org/apache/maven/maven-plugin-api/2.0.9/maven-plugin-api-2.0.9.pom
> [INFO] Downloaded:
> https://repo.maven.apache.org/maven2/org/apache/maven/maven-plugin-api/2.0.9/maven-plugin-api-2.0.9.pom
> (2 KB at 208.4 KB/sec)
> [INFO] Downloading:
> https://repo.maven.apache.org/maven2/org/apache/maven/maven/2.0.9/maven-2.0.9.pom
> [INFO] Downloaded:
> https://repo.maven.apache.org/maven2/org/apache/maven/maven/2.0.9/maven-2.0.9.pom
> (19 KB at 2308.0 KB/sec)
> [INFO] Downloading:
> https://repo.maven.apache.org/maven2/org/apache/maven/maven-artifact/2.0.9/maven-artifact-2.0.9.pom
> [INFO] Downloaded:
> https://repo.maven.apache.org/maven2/org/apache/maven/maven-artifact/2.0.9/maven-artifact-2.0.9.pom
> (2 KB at 225.9 KB/sec)
> [INFO] Downloading:
> https://repo.maven.apache.org/maven2/org/codehaus/plexus/plexus-utils/1.5.1/plexus-utils-1.5.1.pom
> [INFO] Downloaded:
> https://repo.maven.apache.org/maven2/org/codehaus/plexus/plexus-utils/1.5.1/plexus-utils-1.5.1.pom
> (3 KB at 224.2 KB/sec)
> [INFO] Downloading:
> https://repo.maven.apache.org/maven2/org/apache/maven/maven-core/2.0.9/maven-core-2.0.9.pom
> [INFO] Downloaded:
> https://repo.maven.apache.org/maven2/org/apache/maven/maven-core/2.0.9/maven-core-2.0.9.pom
> (8 KB at 844.7 KB/sec)
> [INFO] Downloading:
> https://repo.maven.apache.org/maven2/org/apache/maven/maven-settings/2.0.9/maven-settings-2.0.9.pom
> [INFO] Downloaded:
> https://repo.maven.apache.org/maven2/org/apache/maven/maven-settings/2.0.9/maven-settings-2.0.9.pom
> (3 KB at 251.2 KB/sec)
> [INFO] Downloading:
> https://repo.maven.apache.org/maven2/org/apache/maven/maven-model/2.0.9/maven-model-2.0.9.pom
> [INFO] Downloaded:
> https://repo.maven.apache.org/maven2/org/apache/maven/maven-model/2.0.9/maven-model-2.0.9.pom
> (4 KB at 438.1 KB/sec)
> [INFO] Downloading:
> https://repo.maven.apache.org/maven2/org/apache/maven/maven-plugin-parameter-documenter/2.0.9/maven-plugin-parameter-documenter-2.0.9.pom
> [INFO] Downloaded:
> https://repo.maven.apache.org/maven2/org/apache/maven/maven-plugin-parameter-documenter/2.0.9/maven-plugin-parameter-documenter-2.0.9.pom
> (2 KB at 239.7 KB/sec)
> [INFO] Downloading:
> https://repo.maven.apache.org/maven2/org/apache/maven/maven-profile/2.0.9/maven-profile-2.0.9.pom
> [INFO] Downloaded:
> https://repo.maven.apache.org/maven2/org/apache/maven/maven-profile/2.0.9/maven-profile-2.0.9.pom
> (3 KB at 286.0 KB/sec)
> [INFO] Downloading:
> https://repo.maven.apache.org/maven2/org/apache/maven/maven-repository-metadata/2.0.9/maven-repository-metadata-2.0.9.pom
> [INFO] Downloaded:
> https://repo.maven.apache.org/maven2/org/apache/maven/maven-repository-metadata/2.0.9/maven-repository-metadata-2.0.9.pom
> (2 KB at 232.1 KB/sec)
> [INFO] Downloading:
> https://repo.maven.apache.org/maven2/org/apache/maven/maven-error-diagnostics/2.0.9/maven-error-diagnostics-2.0.9.pom
> [INFO] Downloaded:
> https://repo.maven.apache.org/maven2/org/apache/maven/maven-error-diagnostics/2.0.9/maven-error-diagnostics-2.0.9.pom
> (2 KB at 89.6 KB/sec)
> [INFO] Downloading:
> https://repo.maven.apache.org/maven2/org/apache/maven/maven-project/2.0.9/maven-project-2.0.9.pom
> [INFO] Downloaded:
> https://repo.maven.apache.org/maven2/org/apache/maven/maven-project/2.0.9/maven-project-2.0.9.pom
> (3 KB at 50.9 KB/sec)
> [INFO] Downloading:
> https://repo.maven.apache.org/maven2/org/apache/maven/maven-artifact-manager/2.0.9/maven-artifact-manager-2.0.9.pom
> [INFO] Downloaded:
> https://repo.maven.apache.org/maven2/org/apache/maven/maven-artifact-manager/2.0.9/maven-artifact-manager-2.0.9.pom
> (3 KB at 146.5 KB/sec)
> [INFO] Downloading:
> https://repo.maven.apache.org/maven2/org/apache/maven/maven-plugin-registry/2.0.9/maven-plugin-registry-2.0.9.pom
> [INFO] Downloaded:
> https://repo.maven.apache.org/maven2/org/apache/maven/maven-plugin-registry/2.0.9/maven-plugin-registry-2.0.9.pom
> (2 KB at 213.9 KB/sec)
> [INFO] Downloading:
> https://repo.maven.apache.org/maven2/org/apache/maven/maven-plugin-descriptor/2.0.9/maven-plugin-descriptor-2.0.9.pom
> [INFO] Downloaded:
> https://repo.maven.apache.org/maven2/org/apache/maven/maven-plugin-descriptor/2.0.9/maven-plugin-descriptor-2.0.9.pom
> (3 KB at 253.3 KB/sec)
> [INFO] Downloading:
> https://repo.maven.apache.org/maven2/org/apache/maven/maven-monitor/2.0.9/maven-monitor-2.0.9.pom
> [INFO] Downloaded:
> https://repo.maven.apache.org/maven2/org/apache/maven/maven-monitor/2.0.9/maven-monitor-2.0.9.pom
> (2 KB at 179.3 KB/sec)
> [INFO] Downloading:
> https://repo.maven.apache.org/maven2/org/apache/maven/maven-toolchain/1.0/maven-toolchain-1.0.pom
> [INFO] Downloaded:
> https://repo.maven.apache.org/maven2/org/apache/maven/maven-toolchain/1.0/maven-toolchain-1.0.pom
> (4 KB at 416.7 KB/sec)
> [INFO] Downloading:
> https://repo.maven.apache.org/maven2/org/apache/maven/shared/maven-shared-utils/0.1/maven-shared-utils-0.1.pom
> [INFO] Downloaded:
> https://repo.maven.apache.org/maven2/org/apache/maven/shared/maven-shared-utils/0.1/maven-shared-utils-0.1.pom
> (4 KB at 494.0 KB/sec)
> [INFO] Downloading:
> https://repo.maven.apache.org/maven2/org/apache/maven/shared/maven-shared-incremental/1.1/maven-shared-incremental-1.1.pom
> [INFO] Downloaded:
> https://repo.maven.apache.org/maven2/org/apache/maven/shared/maven-shared-incremental/1.1/maven-shared-incremental-1.1.pom
> (5 KB at 661.6 KB/sec)
> [INFO] Downloading:
> https://repo.maven.apache.org/maven2/org/apache/maven/shared/maven-shared-components/19/maven-shared-components-19.pom
> [INFO] Downloaded:
> https://repo.maven.apache.org/maven2/org/apache/maven/shared/maven-shared-components/19/maven-shared-components-19.pom
> (7 KB at 776.2 KB/sec)
> [INFO] Downloading:
> https://repo.maven.apache.org/maven2/org/codehaus/plexus/plexus-compiler-api/2.2/plexus-compiler-api-2.2.pom
> [INFO] Downloaded:
> https://repo.maven.apache.org/maven2/org/codehaus/plexus/plexus-compiler-api/2.2/plexus-compiler-api-2.2.pom
> (865 B at 140.8 KB/sec)
> [INFO] Downloading:
> https://repo.maven.apache.org/maven2/org/codehaus/plexus/plexus-compiler/2.2/plexus-compiler-2.2.pom
> [INFO] Downloaded:
> https://repo.maven.apache.org/maven2/org/codehaus/plexus/plexus-compiler/2.2/plexus-compiler-2.2.pom
> (4 KB at 504.2 KB/sec)
> [INFO] Downloading:
> https://repo.maven.apache.org/maven2/org/codehaus/plexus/plexus-components/1.3.1/plexus-components-1.3.1.pom
> [INFO] Downloaded:
> https://repo.maven.apache.org/maven2/org/codehaus/plexus/plexus-components/1.3.1/plexus-components-1.3.1.pom
> (3 KB at 427.5 KB/sec)
> [INFO] Downloading:
> https://repo.maven.apache.org/maven2/org/codehaus/plexus/plexus-utils/3.0.8/plexus-utils-3.0.8.pom
> [INFO] Downloaded:
> https://repo.maven.apache.org/maven2/org/codehaus/plexus/plexus-utils/3.0.8/plexus-utils-3.0.8.pom
> (4 KB at 438.3 KB/sec)
> [INFO] Downloading:
> https://repo.maven.apache.org/maven2/org/codehaus/plexus/plexus-compiler-manager/2.2/plexus-compiler-manager-2.2.pom
> [INFO] Downloaded:
> https://repo.maven.apache.org/maven2/org/codehaus/plexus/plexus-compiler-manager/2.2/plexus-compiler-manager-2.2.pom
> (690 B at 96.3 KB/sec)
> [INFO] Downloading:
> https://repo.maven.apache.org/maven2/org/codehaus/plexus/plexus-compiler-javac/2.2/plexus-compiler-javac-2.2.pom
> [INFO] Downloaded:
> https://repo.maven.apache.org/maven2/org/codehaus/plexus/plexus-compiler-javac/2.2/plexus-compiler-javac-2.2.pom
> (769 B at 107.3 KB/sec)
> [INFO] Downloading:
> https://repo.maven.apache.org/maven2/org/codehaus/plexus/plexus-compilers/2.2/plexus-compilers-2.2.pom
> [INFO] Downloaded:
> https://repo.maven.apache.org/maven2/org/codehaus/plexus/plexus-compilers/2.2/plexus-compilers-2.2.pom
> (2 KB at 202.0 KB/sec)
> [INFO] Downloading:
> https://repo.maven.apache.org/maven2/org/codehaus/plexus/plexus-utils/1.5.1/plexus-utils-1.5.1.jar
> [INFO] Downloading:
> https://repo.maven.apache.org/maven2/org/apache/maven/shared/maven-shared-utils/0.1/maven-shared-utils-0.1.jar
> [INFO] Downloading:
> https://repo.maven.apache.org/maven2/org/apache/maven/shared/maven-shared-incremental/1.1/maven-shared-incremental-1.1.jar
> [INFO] Downloading:
> https://repo.maven.apache.org/maven2/org/codehaus/plexus/plexus-compiler-api/2.2/plexus-compiler-api-2.2.jar
> [INFO] Downloading:
> https://repo.maven.apache.org/maven2/org/codehaus/plexus/plexus-compiler-manager/2.2/plexus-compiler-manager-2.2.jar
> [INFO] Downloaded:
> https://repo.maven.apache.org/maven2/org/apache/maven/shared/maven-shared-incremental/1.1/maven-shared-incremental-1.1.jar
> (14 KB at 1322.1 KB/sec)
> [INFO] Downloading:
> https://repo.maven.apache.org/maven2/org/codehaus/plexus/plexus-compiler-javac/2.2/plexus-compiler-javac-2.2.jar
> [INFO] Downloaded:
> https://repo.maven.apache.org/maven2/org/codehaus/plexus/plexus-compiler-api/2.2/plexus-compiler-api-2.2.jar
> (25 KB at 1877.3 KB/sec)
> [INFO] Downloading:
> https://repo.maven.apache.org/maven2/com/google/collections/google-collections/1.0/google-collections-1.0.jar
> [INFO] Downloaded:
> https://repo.maven.apache.org/maven2/org/codehaus/plexus/plexus-compiler-manager/2.2/plexus-compiler-manager-2.2.jar
> (5 KB at 342.6 KB/sec)
> [INFO] Downloading:
> https://repo.maven.apache.org/maven2/junit/junit/3.8.2/junit-3.8.2.jar
> [INFO] Downloaded:
> https://repo.maven.apache.org/maven2/org/apache/maven/shared/maven-shared-utils/0.1/maven-shared-utils-0.1.jar
> (151 KB at 6859.0 KB/sec)
> [INFO] Downloaded:
> https://repo.maven.apache.org/maven2/org/codehaus/plexus/plexus-compiler-javac/2.2/plexus-compiler-javac-2.2.jar
> (19 KB at 882.2 KB/sec)
> [INFO] Downloaded:
> https://repo.maven.apache.org/maven2/org/codehaus/plexus/plexus-utils/1.5.1/plexus-utils-1.5.1.jar
> (206 KB at 8572.6 KB/sec)
> [INFO] Downloaded:
> https://repo.maven.apache.org/maven2/junit/junit/3.8.2/junit-3.8.2.jar
> (118 KB at 3927.1 KB/sec)
> [INFO] Downloaded:
> https://repo.maven.apache.org/maven2/com/google/collections/google-collections/1.0/google-collections-1.0.jar
> (625 KB at 11153.6 KB/sec)
> [INFO] Changes detected - recompiling the module!
> [INFO] Compiling 17 source files to <
> https://builds.apache.org/job/Curator-3.0/ws/curator-test/target/classes>
> [INFO]
> ------------------------------------------------------------------------
> [INFO] Reactor Summary:
> [INFO]
> [INFO] Apache Curator ..................................... SUCCESS [
> 11.883 s]
> [INFO] Curator Testing .................................... FAILURE [
> 2.342 s]
> [INFO] Curator Client ..................................... SKIPPED
> [INFO] Curator Framework .................................. SKIPPED
> [INFO] Curator Recipes .................................... SKIPPED
> [INFO] Curator Service Discovery .......................... SKIPPED
> [INFO] Curator Examples ................................... SKIPPED
> [INFO] Curator Service Discovery Server ................... SKIPPED
> [INFO] Curator RPC Proxy .................................. SKIPPED
> [INFO]
> ------------------------------------------------------------------------
> [INFO] BUILD FAILURE
> [INFO]
> ------------------------------------------------------------------------
> [INFO] Total time: 22.814 s
> [INFO] Finished at: 2015-08-25T18:20:52+00:00
> [INFO] Final Memory: 22M/244M
> [INFO]
> ------------------------------------------------------------------------
> [ERROR] Failed to execute goal
> org.apache.maven.plugins:maven-compiler-plugin:3.1:compile
> (default-compile) on project curator-test: Fatal error compiling: invalid
> target release: 1.7 -> [Help 1]
> [ERROR]
> [ERROR] To see the full stack trace of the errors, re-run Maven with the
> -e switch.
> [ERROR] Re-run Maven using the -X switch to enable full debug logging.
> [ERROR]
> [ERROR] For more information about the errors and possible solutions,
> please read the following articles:
> [ERROR] [Help 1]
> http://cwiki.apache.org/confluence/display/MAVEN/MojoExecutionException
> [ERROR]
> [ERROR] After correcting the problems, you can resume the build with the
> command
> [ERROR]   mvn <goals> -rf :curator-test
> [JENKINS] Archiving <
> https://builds.apache.org/job/Curator-3.0/ws/curator-x-rpc/pom.xml> to
> org.apache.curator/curator-x-rpc/3.0.0-SNAPSHOT/curator-x-rpc-3.0.0-SNAPSHOT.pom
> Sending artifact delta relative to Curator-3.0 » Curator RPC Proxy #1
> Archived 1 artifacts
> Archive block size is 32768
> Received 0 blocks and 7132 bytes
> Compression is 0.0%
> Took 2.8 sec
> [JENKINS] Archiving <
> https://builds.apache.org/job/Curator-3.0/ws/curator-client/pom.xml> to
> org.apache.curator/curator-client/3.0.0-SNAPSHOT/curator-client-3.0.0-SNAPSHOT.pom
> No artifacts from Curator-3.0 » Curator Client #2 to compare, so
> performing full copy of artifacts
> [JENKINS] Archiving <
> https://builds.apache.org/job/Curator-3.0/ws/curator-framework/pom.xml>
> to
> org.apache.curator/curator-framework/3.0.0-SNAPSHOT/curator-framework-3.0.0-SNAPSHOT.pom
> No artifacts from Curator-3.0 » Curator Framework #2 to compare, so
> performing full copy of artifacts
> [JENKINS] Archiving <
> https://builds.apache.org/job/Curator-3.0/ws/curator-x-discovery-server/pom.xml>
> to
> org.apache.curator/curator-x-discovery-server/3.0.0-SNAPSHOT/curator-x-discovery-server-3.0.0-SNAPSHOT.pom
> Sending artifact delta relative to Curator-3.0 » Curator Service Discovery
> Server #1
> Archived 1 artifacts
> Archive block size is 32768
> Received 0 blocks and 4209 bytes
> Compression is 0.0%
> Took 0.15 sec
> [JENKINS] Archiving <
> https://builds.apache.org/job/Curator-3.0/ws/curator-examples/pom.xml> to
> org.apache.curator/curator-examples/3.0.0-SNAPSHOT/curator-examples-3.0.0-SNAPSHOT.pom
> Sending artifact delta relative to Curator-3.0 » Curator Examples #1
> Archived 1 artifacts
> Archive block size is 32768
> Received 0 blocks and 2223 bytes
> Compression is 0.0%
> Took 0.16 sec
> [JENKINS] Archiving <
> https://builds.apache.org/job/Curator-3.0/ws/curator-test/pom.xml> to
> org.apache.curator/curator-test/3.0.0-SNAPSHOT/curator-test-3.0.0-SNAPSHOT.pom
> No artifacts from Curator-3.0 » Curator Testing #2 to compare, so
> performing full copy of artifacts
> [JENKINS] Archiving <
> https://builds.apache.org/job/Curator-3.0/ws/curator-recipes/pom.xml> to
> org.apache.curator/curator-recipes/3.0.0-SNAPSHOT/curator-recipes-3.0.0-SNAPSHOT.pom
> Sending artifact delta relative to Curator-3.0 » Curator Recipes #1
> Archived 1 artifacts
> Archive block size is 32768
> Received 0 blocks and 2810 bytes
> Compression is 0.0%
> Took 0.15 sec
> [JENKINS] Archiving <https://builds.apache.org/job/Curator-3.0/ws/pom.xml>
> to
> org.apache.curator/apache-curator/3.0.0-SNAPSHOT/apache-curator-3.0.0-SNAPSHOT.pom
> [JENKINS] Archiving <
> https://builds.apache.org/job/Curator-3.0/ws/target/apache-curator-3.0.0-SNAPSHOT-site.xml>
> to
> org.apache.curator/apache-curator/3.0.0-SNAPSHOT/apache-curator-3.0.0-SNAPSHOT-site.xml
> No artifacts from Curator-3.0 » Apache Curator #2 to compare, so
> performing full copy of artifacts
> [JENKINS] Archiving <
> https://builds.apache.org/job/Curator-3.0/ws/curator-x-discovery/pom.xml>
> to
> org.apache.curator/curator-x-discovery/3.0.0-SNAPSHOT/curator-x-discovery-3.0.0-SNAPSHOT.pom
> Sending artifact delta relative to Curator-3.0 » Curator Service Discovery
> #1
> Archived 1 artifacts
> Archive block size is 32768
> Received 0 blocks and 2585 bytes
> Compression is 0.0%
> Took 0.15 sec
> Sending e-mails to: dev@curator.apache.org
> channel stopped
>

Build failed in Jenkins: Curator-3.0 #4

Posted by Apache Jenkins Server <je...@builds.apache.org>.
See <https://builds.apache.org/job/Curator-3.0/4/>

------------------------------------------
[...truncated 1113 lines...]
[INFO] Downloaded: https://repo.maven.apache.org/maven2/org/codehaus/woodstox/wstx-asl/3.2.6/wstx-asl-3.2.6.jar (509 KB at 7585.0 KB/sec)
[INFO] Downloaded: https://repo.maven.apache.org/maven2/org/codehaus/plexus/plexus-utils/2.0.5/plexus-utils-2.0.5.jar (218 KB at 3113.4 KB/sec)
[INFO] Downloaded: https://repo.maven.apache.org/maven2/com/google/code/google-collections/google-collect/snapshot-20080530/google-collect-snapshot-20080530.jar (490 KB at 5695.8 KB/sec)
[INFO] Checking licenses...
[CHECKSTYLE] No report found for mojo check
[INFO]                                                                         
[INFO] ------------------------------------------------------------------------
[INFO] Building Curator Testing 3.0.0-SNAPSHOT
[INFO] ------------------------------------------------------------------------
[INFO] Downloading: https://repo.maven.apache.org/maven2/org/apache/maven/plugins/maven-resources-plugin/2.6/maven-resources-plugin-2.6.pom
[INFO] Downloaded: https://repo.maven.apache.org/maven2/org/apache/maven/plugins/maven-resources-plugin/2.6/maven-resources-plugin-2.6.pom (8 KB at 609.6 KB/sec)
[INFO] Downloading: https://repo.maven.apache.org/maven2/org/apache/maven/plugins/maven-plugins/23/maven-plugins-23.pom
[INFO] Downloaded: https://repo.maven.apache.org/maven2/org/apache/maven/plugins/maven-plugins/23/maven-plugins-23.pom (9 KB at 898.2 KB/sec)
[INFO] Downloading: https://repo.maven.apache.org/maven2/org/apache/maven/plugins/maven-resources-plugin/2.6/maven-resources-plugin-2.6.jar
[INFO] Downloaded: https://repo.maven.apache.org/maven2/org/apache/maven/plugins/maven-resources-plugin/2.6/maven-resources-plugin-2.6.jar (29 KB at 2620.6 KB/sec)
[INFO] Downloading: https://repo.maven.apache.org/maven2/org/apache/maven/plugins/maven-compiler-plugin/3.1/maven-compiler-plugin-3.1.pom
[INFO] Downloaded: https://repo.maven.apache.org/maven2/org/apache/maven/plugins/maven-compiler-plugin/3.1/maven-compiler-plugin-3.1.pom (10 KB at 1246.3 KB/sec)
[INFO] Downloading: https://repo.maven.apache.org/maven2/org/apache/maven/plugins/maven-compiler-plugin/3.1/maven-compiler-plugin-3.1.jar
[INFO] Downloaded: https://repo.maven.apache.org/maven2/org/apache/maven/plugins/maven-compiler-plugin/3.1/maven-compiler-plugin-3.1.jar (42 KB at 4660.3 KB/sec)
[INFO] Downloading: https://repo.maven.apache.org/maven2/org/apache/maven/plugins/maven-surefire-plugin/2.17/maven-surefire-plugin-2.17.pom
[INFO] Downloaded: https://repo.maven.apache.org/maven2/org/apache/maven/plugins/maven-surefire-plugin/2.17/maven-surefire-plugin-2.17.pom (5 KB at 488.4 KB/sec)
[INFO] Downloading: https://repo.maven.apache.org/maven2/org/apache/maven/surefire/surefire/2.17/surefire-2.17.pom
[INFO] Downloaded: https://repo.maven.apache.org/maven2/org/apache/maven/surefire/surefire/2.17/surefire-2.17.pom (17 KB at 1207.2 KB/sec)
[INFO] Downloading: https://repo.maven.apache.org/maven2/org/apache/maven/plugins/maven-surefire-plugin/2.17/maven-surefire-plugin-2.17.jar
[INFO] Downloaded: https://repo.maven.apache.org/maven2/org/apache/maven/plugins/maven-surefire-plugin/2.17/maven-surefire-plugin-2.17.jar (34 KB at 3039.0 KB/sec)
[INFO] Downloading: https://repo.maven.apache.org/maven2/org/apache/maven/plugins/maven-jar-plugin/2.5/maven-jar-plugin-2.5.pom
[INFO] Downloaded: https://repo.maven.apache.org/maven2/org/apache/maven/plugins/maven-jar-plugin/2.5/maven-jar-plugin-2.5.pom (8 KB at 514.1 KB/sec)
[INFO] Downloading: https://repo.maven.apache.org/maven2/org/apache/maven/plugins/maven-jar-plugin/2.5/maven-jar-plugin-2.5.jar
[INFO] Downloaded: https://repo.maven.apache.org/maven2/org/apache/maven/plugins/maven-jar-plugin/2.5/maven-jar-plugin-2.5.jar (25 KB at 2429.3 KB/sec)
[INFO] Downloading: https://repo.maven.apache.org/maven2/org/apache/zookeeper/zookeeper/3.5.0-alpha/zookeeper-3.5.0-alpha.pom
[INFO] Downloaded: https://repo.maven.apache.org/maven2/org/apache/zookeeper/zookeeper/3.5.0-alpha/zookeeper-3.5.0-alpha.pom (5 KB at 333.5 KB/sec)
[INFO] Downloading: https://repo.maven.apache.org/maven2/org/slf4j/slf4j-api/1.7.6/slf4j-api-1.7.6.pom
[INFO] Downloaded: https://repo.maven.apache.org/maven2/org/slf4j/slf4j-api/1.7.6/slf4j-api-1.7.6.pom (3 KB at 328.2 KB/sec)
[INFO] Downloading: https://repo.maven.apache.org/maven2/org/slf4j/slf4j-parent/1.7.6/slf4j-parent-1.7.6.pom
[INFO] Downloaded: https://repo.maven.apache.org/maven2/org/slf4j/slf4j-parent/1.7.6/slf4j-parent-1.7.6.pom (12 KB at 1162.8 KB/sec)
[INFO] Downloading: https://repo.maven.apache.org/maven2/log4j/log4j/1.2.16/log4j-1.2.16.pom
[INFO] Downloaded: https://repo.maven.apache.org/maven2/log4j/log4j/1.2.16/log4j-1.2.16.pom (20 KB at 1045.4 KB/sec)
[INFO] Downloading: https://repo.maven.apache.org/maven2/io/netty/netty/3.7.0.Final/netty-3.7.0.Final.pom
[INFO] Downloaded: https://repo.maven.apache.org/maven2/io/netty/netty/3.7.0.Final/netty-3.7.0.Final.pom (26 KB at 1968.4 KB/sec)
[INFO] Downloading: https://repo.maven.apache.org/maven2/org/sonatype/oss/oss-parent/7/oss-parent-7.pom
[INFO] Downloaded: https://repo.maven.apache.org/maven2/org/sonatype/oss/oss-parent/7/oss-parent-7.pom (5 KB at 673.0 KB/sec)
[INFO] Downloading: https://repo.maven.apache.org/maven2/net/java/dev/javacc/javacc/5.0/javacc-5.0.pom
[INFO] Downloaded: https://repo.maven.apache.org/maven2/net/java/dev/javacc/javacc/5.0/javacc-5.0.pom (3 KB at 202.8 KB/sec)
[INFO] Downloading: https://repo.maven.apache.org/maven2/org/javassist/javassist/3.18.1-GA/javassist-3.18.1-GA.pom
[INFO] Downloaded: https://repo.maven.apache.org/maven2/org/javassist/javassist/3.18.1-GA/javassist-3.18.1-GA.pom (10 KB at 1033.2 KB/sec)
[INFO] Downloading: https://repo.maven.apache.org/maven2/org/apache/commons/commons-math/2.2/commons-math-2.2.pom
[INFO] Downloaded: https://repo.maven.apache.org/maven2/org/apache/commons/commons-math/2.2/commons-math-2.2.pom (11 KB at 1091.8 KB/sec)
[INFO] Downloading: https://repo.maven.apache.org/maven2/org/apache/commons/commons-parent/18/commons-parent-18.pom
[INFO] Downloaded: https://repo.maven.apache.org/maven2/org/apache/commons/commons-parent/18/commons-parent-18.pom (33 KB at 2517.6 KB/sec)
[INFO] Downloading: https://repo.maven.apache.org/maven2/com/google/guava/guava/16.0.1/guava-16.0.1.pom
[INFO] Downloaded: https://repo.maven.apache.org/maven2/com/google/guava/guava/16.0.1/guava-16.0.1.pom (6 KB at 496.6 KB/sec)
[INFO] Downloading: https://repo.maven.apache.org/maven2/com/google/guava/guava-parent/16.0.1/guava-parent-16.0.1.pom
[INFO] Downloaded: https://repo.maven.apache.org/maven2/com/google/guava/guava-parent/16.0.1/guava-parent-16.0.1.pom (8 KB at 796.0 KB/sec)
[INFO] Downloading: https://repo.maven.apache.org/maven2/org/testng/testng/6.8.8/testng-6.8.8.pom
[INFO] Downloaded: https://repo.maven.apache.org/maven2/org/testng/testng/6.8.8/testng-6.8.8.pom (8 KB at 231.1 KB/sec)
[INFO] Downloading: https://repo.maven.apache.org/maven2/org/sonatype/oss/oss-parent/3/oss-parent-3.pom
[INFO] Downloaded: https://repo.maven.apache.org/maven2/org/sonatype/oss/oss-parent/3/oss-parent-3.pom (4 KB at 409.1 KB/sec)
[INFO] Downloading: https://repo.maven.apache.org/maven2/org/beanshell/bsh/2.0b4/bsh-2.0b4.pom
[INFO] Downloaded: https://repo.maven.apache.org/maven2/org/beanshell/bsh/2.0b4/bsh-2.0b4.pom (2 KB at 145.9 KB/sec)
[INFO] Downloading: https://repo.maven.apache.org/maven2/org/beanshell/beanshell/2.0b4/beanshell-2.0b4.pom
[INFO] Downloaded: https://repo.maven.apache.org/maven2/org/beanshell/beanshell/2.0b4/beanshell-2.0b4.pom (2 KB at 153.2 KB/sec)
[INFO] Downloading: https://repo.maven.apache.org/maven2/com/beust/jcommander/1.27/jcommander-1.27.pom
[INFO] Downloaded: https://repo.maven.apache.org/maven2/com/beust/jcommander/1.27/jcommander-1.27.pom (8 KB at 780.2 KB/sec)
[INFO] Downloading: https://repo.maven.apache.org/maven2/org/slf4j/slf4j-log4j12/1.7.6/slf4j-log4j12-1.7.6.pom
[INFO] Downloaded: https://repo.maven.apache.org/maven2/org/slf4j/slf4j-log4j12/1.7.6/slf4j-log4j12-1.7.6.pom (2 KB at 142.0 KB/sec)
[INFO] Downloading: https://repo.maven.apache.org/maven2/log4j/log4j/1.2.17/log4j-1.2.17.pom
[INFO] Downloaded: https://repo.maven.apache.org/maven2/log4j/log4j/1.2.17/log4j-1.2.17.pom (22 KB at 1930.5 KB/sec)
[INFO] Downloading: https://repo.maven.apache.org/maven2/org/apache/zookeeper/zookeeper/3.5.0-alpha/zookeeper-3.5.0-alpha.jar
[INFO] Downloading: https://repo.maven.apache.org/maven2/org/slf4j/slf4j-api/1.7.6/slf4j-api-1.7.6.jar
[INFO] Downloading: https://repo.maven.apache.org/maven2/log4j/log4j/1.2.16/log4j-1.2.16.jar
[INFO] Downloading: https://repo.maven.apache.org/maven2/io/netty/netty/3.7.0.Final/netty-3.7.0.Final.jar
[INFO] Downloading: https://repo.maven.apache.org/maven2/net/java/dev/javacc/javacc/5.0/javacc-5.0.jar
[INFO] Downloaded: https://repo.maven.apache.org/maven2/org/slf4j/slf4j-api/1.7.6/slf4j-api-1.7.6.jar (29 KB at 1751.0 KB/sec)
[INFO] Downloading: https://repo.maven.apache.org/maven2/org/javassist/javassist/3.18.1-GA/javassist-3.18.1-GA.jar
[INFO] Downloaded: https://repo.maven.apache.org/maven2/log4j/log4j/1.2.16/log4j-1.2.16.jar (471 KB at 10222.8 KB/sec)
[INFO] Downloading: https://repo.maven.apache.org/maven2/org/apache/commons/commons-math/2.2/commons-math-2.2.jar
[INFO] Downloaded: https://repo.maven.apache.org/maven2/net/java/dev/javacc/javacc/5.0/javacc-5.0.jar (292 KB at 6338.5 KB/sec)
[INFO] Downloading: https://repo.maven.apache.org/maven2/com/google/guava/guava/16.0.1/guava-16.0.1.jar
[INFO] Downloaded: https://repo.maven.apache.org/maven2/org/javassist/javassist/3.18.1-GA/javassist-3.18.1-GA.jar (698 KB at 7419.7 KB/sec)
[INFO] Downloading: https://repo.maven.apache.org/maven2/org/testng/testng/6.8.8/testng-6.8.8.jar
[INFO] Downloaded: https://repo.maven.apache.org/maven2/io/netty/netty/3.7.0.Final/netty-3.7.0.Final.jar (1181 KB at 9672.4 KB/sec)
[INFO] Downloading: https://repo.maven.apache.org/maven2/org/beanshell/bsh/2.0b4/bsh-2.0b4.jar
[INFO] Downloaded: https://repo.maven.apache.org/maven2/org/apache/zookeeper/zookeeper/3.5.0-alpha/zookeeper-3.5.0-alpha.jar (931 KB at 6889.4 KB/sec)
[INFO] Downloading: https://repo.maven.apache.org/maven2/com/beust/jcommander/1.27/jcommander-1.27.jar
[INFO] Downloaded: https://repo.maven.apache.org/maven2/org/apache/commons/commons-math/2.2/commons-math-2.2.jar (966 KB at 7204.1 KB/sec)
[INFO] Downloading: https://repo.maven.apache.org/maven2/org/slf4j/slf4j-log4j12/1.7.6/slf4j-log4j12-1.7.6.jar
[INFO] Downloaded: https://repo.maven.apache.org/maven2/org/beanshell/bsh/2.0b4/bsh-2.0b4.jar (276 KB at 1937.3 KB/sec)
[INFO] Downloaded: https://repo.maven.apache.org/maven2/com/beust/jcommander/1.27/jcommander-1.27.jar (55 KB at 377.0 KB/sec)
[INFO] Downloaded: https://repo.maven.apache.org/maven2/org/slf4j/slf4j-log4j12/1.7.6/slf4j-log4j12-1.7.6.jar (9 KB at 58.1 KB/sec)
[INFO] Downloaded: https://repo.maven.apache.org/maven2/org/testng/testng/6.8.8/testng-6.8.8.jar (817 KB at 5170.1 KB/sec)
[INFO] Downloaded: https://repo.maven.apache.org/maven2/com/google/guava/guava/16.0.1/guava-16.0.1.jar (2176 KB at 11157.9 KB/sec)
[INFO] 
[INFO] --- maven-clean-plugin:2.5:clean (default-clean) @ curator-test ---
[INFO] 
[INFO] --- maven-remote-resources-plugin:1.5:process (default) @ curator-test ---
[INFO] 
[INFO] --- maven-resources-plugin:2.6:resources (default-resources) @ curator-test ---
[INFO] Using 'UTF-8' encoding to copy filtered resources.
[INFO] Copying 2 resources to META-INF
[INFO] Copying 3 resources
[INFO] 
[INFO] --- maven-compiler-plugin:3.1:compile (default-compile) @ curator-test ---
[INFO] Downloading: https://repo.maven.apache.org/maven2/org/apache/maven/maven-plugin-api/2.0.9/maven-plugin-api-2.0.9.pom
[INFO] Downloaded: https://repo.maven.apache.org/maven2/org/apache/maven/maven-plugin-api/2.0.9/maven-plugin-api-2.0.9.pom (2 KB at 208.4 KB/sec)
[INFO] Downloading: https://repo.maven.apache.org/maven2/org/apache/maven/maven/2.0.9/maven-2.0.9.pom
[INFO] Downloaded: https://repo.maven.apache.org/maven2/org/apache/maven/maven/2.0.9/maven-2.0.9.pom (19 KB at 2308.0 KB/sec)
[INFO] Downloading: https://repo.maven.apache.org/maven2/org/apache/maven/maven-artifact/2.0.9/maven-artifact-2.0.9.pom
[INFO] Downloaded: https://repo.maven.apache.org/maven2/org/apache/maven/maven-artifact/2.0.9/maven-artifact-2.0.9.pom (2 KB at 225.9 KB/sec)
[INFO] Downloading: https://repo.maven.apache.org/maven2/org/codehaus/plexus/plexus-utils/1.5.1/plexus-utils-1.5.1.pom
[INFO] Downloaded: https://repo.maven.apache.org/maven2/org/codehaus/plexus/plexus-utils/1.5.1/plexus-utils-1.5.1.pom (3 KB at 224.2 KB/sec)
[INFO] Downloading: https://repo.maven.apache.org/maven2/org/apache/maven/maven-core/2.0.9/maven-core-2.0.9.pom
[INFO] Downloaded: https://repo.maven.apache.org/maven2/org/apache/maven/maven-core/2.0.9/maven-core-2.0.9.pom (8 KB at 844.7 KB/sec)
[INFO] Downloading: https://repo.maven.apache.org/maven2/org/apache/maven/maven-settings/2.0.9/maven-settings-2.0.9.pom
[INFO] Downloaded: https://repo.maven.apache.org/maven2/org/apache/maven/maven-settings/2.0.9/maven-settings-2.0.9.pom (3 KB at 251.2 KB/sec)
[INFO] Downloading: https://repo.maven.apache.org/maven2/org/apache/maven/maven-model/2.0.9/maven-model-2.0.9.pom
[INFO] Downloaded: https://repo.maven.apache.org/maven2/org/apache/maven/maven-model/2.0.9/maven-model-2.0.9.pom (4 KB at 438.1 KB/sec)
[INFO] Downloading: https://repo.maven.apache.org/maven2/org/apache/maven/maven-plugin-parameter-documenter/2.0.9/maven-plugin-parameter-documenter-2.0.9.pom
[INFO] Downloaded: https://repo.maven.apache.org/maven2/org/apache/maven/maven-plugin-parameter-documenter/2.0.9/maven-plugin-parameter-documenter-2.0.9.pom (2 KB at 239.7 KB/sec)
[INFO] Downloading: https://repo.maven.apache.org/maven2/org/apache/maven/maven-profile/2.0.9/maven-profile-2.0.9.pom
[INFO] Downloaded: https://repo.maven.apache.org/maven2/org/apache/maven/maven-profile/2.0.9/maven-profile-2.0.9.pom (3 KB at 286.0 KB/sec)
[INFO] Downloading: https://repo.maven.apache.org/maven2/org/apache/maven/maven-repository-metadata/2.0.9/maven-repository-metadata-2.0.9.pom
[INFO] Downloaded: https://repo.maven.apache.org/maven2/org/apache/maven/maven-repository-metadata/2.0.9/maven-repository-metadata-2.0.9.pom (2 KB at 232.1 KB/sec)
[INFO] Downloading: https://repo.maven.apache.org/maven2/org/apache/maven/maven-error-diagnostics/2.0.9/maven-error-diagnostics-2.0.9.pom
[INFO] Downloaded: https://repo.maven.apache.org/maven2/org/apache/maven/maven-error-diagnostics/2.0.9/maven-error-diagnostics-2.0.9.pom (2 KB at 89.6 KB/sec)
[INFO] Downloading: https://repo.maven.apache.org/maven2/org/apache/maven/maven-project/2.0.9/maven-project-2.0.9.pom
[INFO] Downloaded: https://repo.maven.apache.org/maven2/org/apache/maven/maven-project/2.0.9/maven-project-2.0.9.pom (3 KB at 50.9 KB/sec)
[INFO] Downloading: https://repo.maven.apache.org/maven2/org/apache/maven/maven-artifact-manager/2.0.9/maven-artifact-manager-2.0.9.pom
[INFO] Downloaded: https://repo.maven.apache.org/maven2/org/apache/maven/maven-artifact-manager/2.0.9/maven-artifact-manager-2.0.9.pom (3 KB at 146.5 KB/sec)
[INFO] Downloading: https://repo.maven.apache.org/maven2/org/apache/maven/maven-plugin-registry/2.0.9/maven-plugin-registry-2.0.9.pom
[INFO] Downloaded: https://repo.maven.apache.org/maven2/org/apache/maven/maven-plugin-registry/2.0.9/maven-plugin-registry-2.0.9.pom (2 KB at 213.9 KB/sec)
[INFO] Downloading: https://repo.maven.apache.org/maven2/org/apache/maven/maven-plugin-descriptor/2.0.9/maven-plugin-descriptor-2.0.9.pom
[INFO] Downloaded: https://repo.maven.apache.org/maven2/org/apache/maven/maven-plugin-descriptor/2.0.9/maven-plugin-descriptor-2.0.9.pom (3 KB at 253.3 KB/sec)
[INFO] Downloading: https://repo.maven.apache.org/maven2/org/apache/maven/maven-monitor/2.0.9/maven-monitor-2.0.9.pom
[INFO] Downloaded: https://repo.maven.apache.org/maven2/org/apache/maven/maven-monitor/2.0.9/maven-monitor-2.0.9.pom (2 KB at 179.3 KB/sec)
[INFO] Downloading: https://repo.maven.apache.org/maven2/org/apache/maven/maven-toolchain/1.0/maven-toolchain-1.0.pom
[INFO] Downloaded: https://repo.maven.apache.org/maven2/org/apache/maven/maven-toolchain/1.0/maven-toolchain-1.0.pom (4 KB at 416.7 KB/sec)
[INFO] Downloading: https://repo.maven.apache.org/maven2/org/apache/maven/shared/maven-shared-utils/0.1/maven-shared-utils-0.1.pom
[INFO] Downloaded: https://repo.maven.apache.org/maven2/org/apache/maven/shared/maven-shared-utils/0.1/maven-shared-utils-0.1.pom (4 KB at 494.0 KB/sec)
[INFO] Downloading: https://repo.maven.apache.org/maven2/org/apache/maven/shared/maven-shared-incremental/1.1/maven-shared-incremental-1.1.pom
[INFO] Downloaded: https://repo.maven.apache.org/maven2/org/apache/maven/shared/maven-shared-incremental/1.1/maven-shared-incremental-1.1.pom (5 KB at 661.6 KB/sec)
[INFO] Downloading: https://repo.maven.apache.org/maven2/org/apache/maven/shared/maven-shared-components/19/maven-shared-components-19.pom
[INFO] Downloaded: https://repo.maven.apache.org/maven2/org/apache/maven/shared/maven-shared-components/19/maven-shared-components-19.pom (7 KB at 776.2 KB/sec)
[INFO] Downloading: https://repo.maven.apache.org/maven2/org/codehaus/plexus/plexus-compiler-api/2.2/plexus-compiler-api-2.2.pom
[INFO] Downloaded: https://repo.maven.apache.org/maven2/org/codehaus/plexus/plexus-compiler-api/2.2/plexus-compiler-api-2.2.pom (865 B at 140.8 KB/sec)
[INFO] Downloading: https://repo.maven.apache.org/maven2/org/codehaus/plexus/plexus-compiler/2.2/plexus-compiler-2.2.pom
[INFO] Downloaded: https://repo.maven.apache.org/maven2/org/codehaus/plexus/plexus-compiler/2.2/plexus-compiler-2.2.pom (4 KB at 504.2 KB/sec)
[INFO] Downloading: https://repo.maven.apache.org/maven2/org/codehaus/plexus/plexus-components/1.3.1/plexus-components-1.3.1.pom
[INFO] Downloaded: https://repo.maven.apache.org/maven2/org/codehaus/plexus/plexus-components/1.3.1/plexus-components-1.3.1.pom (3 KB at 427.5 KB/sec)
[INFO] Downloading: https://repo.maven.apache.org/maven2/org/codehaus/plexus/plexus-utils/3.0.8/plexus-utils-3.0.8.pom
[INFO] Downloaded: https://repo.maven.apache.org/maven2/org/codehaus/plexus/plexus-utils/3.0.8/plexus-utils-3.0.8.pom (4 KB at 438.3 KB/sec)
[INFO] Downloading: https://repo.maven.apache.org/maven2/org/codehaus/plexus/plexus-compiler-manager/2.2/plexus-compiler-manager-2.2.pom
[INFO] Downloaded: https://repo.maven.apache.org/maven2/org/codehaus/plexus/plexus-compiler-manager/2.2/plexus-compiler-manager-2.2.pom (690 B at 96.3 KB/sec)
[INFO] Downloading: https://repo.maven.apache.org/maven2/org/codehaus/plexus/plexus-compiler-javac/2.2/plexus-compiler-javac-2.2.pom
[INFO] Downloaded: https://repo.maven.apache.org/maven2/org/codehaus/plexus/plexus-compiler-javac/2.2/plexus-compiler-javac-2.2.pom (769 B at 107.3 KB/sec)
[INFO] Downloading: https://repo.maven.apache.org/maven2/org/codehaus/plexus/plexus-compilers/2.2/plexus-compilers-2.2.pom
[INFO] Downloaded: https://repo.maven.apache.org/maven2/org/codehaus/plexus/plexus-compilers/2.2/plexus-compilers-2.2.pom (2 KB at 202.0 KB/sec)
[INFO] Downloading: https://repo.maven.apache.org/maven2/org/codehaus/plexus/plexus-utils/1.5.1/plexus-utils-1.5.1.jar
[INFO] Downloading: https://repo.maven.apache.org/maven2/org/apache/maven/shared/maven-shared-utils/0.1/maven-shared-utils-0.1.jar
[INFO] Downloading: https://repo.maven.apache.org/maven2/org/apache/maven/shared/maven-shared-incremental/1.1/maven-shared-incremental-1.1.jar
[INFO] Downloading: https://repo.maven.apache.org/maven2/org/codehaus/plexus/plexus-compiler-api/2.2/plexus-compiler-api-2.2.jar
[INFO] Downloading: https://repo.maven.apache.org/maven2/org/codehaus/plexus/plexus-compiler-manager/2.2/plexus-compiler-manager-2.2.jar
[INFO] Downloaded: https://repo.maven.apache.org/maven2/org/apache/maven/shared/maven-shared-incremental/1.1/maven-shared-incremental-1.1.jar (14 KB at 1322.1 KB/sec)
[INFO] Downloading: https://repo.maven.apache.org/maven2/org/codehaus/plexus/plexus-compiler-javac/2.2/plexus-compiler-javac-2.2.jar
[INFO] Downloaded: https://repo.maven.apache.org/maven2/org/codehaus/plexus/plexus-compiler-api/2.2/plexus-compiler-api-2.2.jar (25 KB at 1877.3 KB/sec)
[INFO] Downloading: https://repo.maven.apache.org/maven2/com/google/collections/google-collections/1.0/google-collections-1.0.jar
[INFO] Downloaded: https://repo.maven.apache.org/maven2/org/codehaus/plexus/plexus-compiler-manager/2.2/plexus-compiler-manager-2.2.jar (5 KB at 342.6 KB/sec)
[INFO] Downloading: https://repo.maven.apache.org/maven2/junit/junit/3.8.2/junit-3.8.2.jar
[INFO] Downloaded: https://repo.maven.apache.org/maven2/org/apache/maven/shared/maven-shared-utils/0.1/maven-shared-utils-0.1.jar (151 KB at 6859.0 KB/sec)
[INFO] Downloaded: https://repo.maven.apache.org/maven2/org/codehaus/plexus/plexus-compiler-javac/2.2/plexus-compiler-javac-2.2.jar (19 KB at 882.2 KB/sec)
[INFO] Downloaded: https://repo.maven.apache.org/maven2/org/codehaus/plexus/plexus-utils/1.5.1/plexus-utils-1.5.1.jar (206 KB at 8572.6 KB/sec)
[INFO] Downloaded: https://repo.maven.apache.org/maven2/junit/junit/3.8.2/junit-3.8.2.jar (118 KB at 3927.1 KB/sec)
[INFO] Downloaded: https://repo.maven.apache.org/maven2/com/google/collections/google-collections/1.0/google-collections-1.0.jar (625 KB at 11153.6 KB/sec)
[INFO] Changes detected - recompiling the module!
[INFO] Compiling 17 source files to <https://builds.apache.org/job/Curator-3.0/ws/curator-test/target/classes>
[INFO] ------------------------------------------------------------------------
[INFO] Reactor Summary:
[INFO] 
[INFO] Apache Curator ..................................... SUCCESS [ 11.883 s]
[INFO] Curator Testing .................................... FAILURE [  2.342 s]
[INFO] Curator Client ..................................... SKIPPED
[INFO] Curator Framework .................................. SKIPPED
[INFO] Curator Recipes .................................... SKIPPED
[INFO] Curator Service Discovery .......................... SKIPPED
[INFO] Curator Examples ................................... SKIPPED
[INFO] Curator Service Discovery Server ................... SKIPPED
[INFO] Curator RPC Proxy .................................. SKIPPED
[INFO] ------------------------------------------------------------------------
[INFO] BUILD FAILURE
[INFO] ------------------------------------------------------------------------
[INFO] Total time: 22.814 s
[INFO] Finished at: 2015-08-25T18:20:52+00:00
[INFO] Final Memory: 22M/244M
[INFO] ------------------------------------------------------------------------
[ERROR] Failed to execute goal org.apache.maven.plugins:maven-compiler-plugin:3.1:compile (default-compile) on project curator-test: Fatal error compiling: invalid target release: 1.7 -> [Help 1]
[ERROR] 
[ERROR] To see the full stack trace of the errors, re-run Maven with the -e switch.
[ERROR] Re-run Maven using the -X switch to enable full debug logging.
[ERROR] 
[ERROR] For more information about the errors and possible solutions, please read the following articles:
[ERROR] [Help 1] http://cwiki.apache.org/confluence/display/MAVEN/MojoExecutionException
[ERROR] 
[ERROR] After correcting the problems, you can resume the build with the command
[ERROR]   mvn <goals> -rf :curator-test
[JENKINS] Archiving <https://builds.apache.org/job/Curator-3.0/ws/curator-x-rpc/pom.xml> to org.apache.curator/curator-x-rpc/3.0.0-SNAPSHOT/curator-x-rpc-3.0.0-SNAPSHOT.pom
Sending artifact delta relative to Curator-3.0 » Curator RPC Proxy #1
Archived 1 artifacts
Archive block size is 32768
Received 0 blocks and 7132 bytes
Compression is 0.0%
Took 2.8 sec
[JENKINS] Archiving <https://builds.apache.org/job/Curator-3.0/ws/curator-client/pom.xml> to org.apache.curator/curator-client/3.0.0-SNAPSHOT/curator-client-3.0.0-SNAPSHOT.pom
No artifacts from Curator-3.0 » Curator Client #2 to compare, so performing full copy of artifacts
[JENKINS] Archiving <https://builds.apache.org/job/Curator-3.0/ws/curator-framework/pom.xml> to org.apache.curator/curator-framework/3.0.0-SNAPSHOT/curator-framework-3.0.0-SNAPSHOT.pom
No artifacts from Curator-3.0 » Curator Framework #2 to compare, so performing full copy of artifacts
[JENKINS] Archiving <https://builds.apache.org/job/Curator-3.0/ws/curator-x-discovery-server/pom.xml> to org.apache.curator/curator-x-discovery-server/3.0.0-SNAPSHOT/curator-x-discovery-server-3.0.0-SNAPSHOT.pom
Sending artifact delta relative to Curator-3.0 » Curator Service Discovery Server #1
Archived 1 artifacts
Archive block size is 32768
Received 0 blocks and 4209 bytes
Compression is 0.0%
Took 0.15 sec
[JENKINS] Archiving <https://builds.apache.org/job/Curator-3.0/ws/curator-examples/pom.xml> to org.apache.curator/curator-examples/3.0.0-SNAPSHOT/curator-examples-3.0.0-SNAPSHOT.pom
Sending artifact delta relative to Curator-3.0 » Curator Examples #1
Archived 1 artifacts
Archive block size is 32768
Received 0 blocks and 2223 bytes
Compression is 0.0%
Took 0.16 sec
[JENKINS] Archiving <https://builds.apache.org/job/Curator-3.0/ws/curator-test/pom.xml> to org.apache.curator/curator-test/3.0.0-SNAPSHOT/curator-test-3.0.0-SNAPSHOT.pom
No artifacts from Curator-3.0 » Curator Testing #2 to compare, so performing full copy of artifacts
[JENKINS] Archiving <https://builds.apache.org/job/Curator-3.0/ws/curator-recipes/pom.xml> to org.apache.curator/curator-recipes/3.0.0-SNAPSHOT/curator-recipes-3.0.0-SNAPSHOT.pom
Sending artifact delta relative to Curator-3.0 » Curator Recipes #1
Archived 1 artifacts
Archive block size is 32768
Received 0 blocks and 2810 bytes
Compression is 0.0%
Took 0.15 sec
[JENKINS] Archiving <https://builds.apache.org/job/Curator-3.0/ws/pom.xml> to org.apache.curator/apache-curator/3.0.0-SNAPSHOT/apache-curator-3.0.0-SNAPSHOT.pom
[JENKINS] Archiving <https://builds.apache.org/job/Curator-3.0/ws/target/apache-curator-3.0.0-SNAPSHOT-site.xml> to org.apache.curator/apache-curator/3.0.0-SNAPSHOT/apache-curator-3.0.0-SNAPSHOT-site.xml
No artifacts from Curator-3.0 » Apache Curator #2 to compare, so performing full copy of artifacts
[JENKINS] Archiving <https://builds.apache.org/job/Curator-3.0/ws/curator-x-discovery/pom.xml> to org.apache.curator/curator-x-discovery/3.0.0-SNAPSHOT/curator-x-discovery-3.0.0-SNAPSHOT.pom
Sending artifact delta relative to Curator-3.0 » Curator Service Discovery #1
Archived 1 artifacts
Archive block size is 32768
Received 0 blocks and 2585 bytes
Compression is 0.0%
Took 0.15 sec
Sending e-mails to: dev@curator.apache.org
channel stopped