You are viewing a plain text version of this content. The canonical link for it is here.
Posted to builds@hbase.apache.org by Apache Jenkins Server <je...@builds.apache.org> on 2017/10/18 09:07:54 UTC

Build failed in Jenkins: HBase-Trunk_matrix » JDK 1.8 (latest),Hadoop #3908

See <https://builds.apache.org/job/HBase-Trunk_matrix/jdk=JDK%201.8%20(latest),label=Hadoop/3908/display/redirect?page=changes>

Changes:

[zhangduo] HBASE-19001 Remove the hooks in RegionObserver which are designed to

------------------------------------------
[...truncated 1.48 MB...]
[INFO] ----------------------------------------------------------------------------
[INFO] Parameter: groupId, Value: archetype.it
[INFO] Parameter: artifactId, Value: basic
[INFO] Parameter: version, Value: 0.1-SNAPSHOT
[INFO] Parameter: package, Value: it.pkg
[INFO] Parameter: packageInPathFormat, Value: it/pkg
[INFO] Parameter: version, Value: 0.1-SNAPSHOT
[INFO] Parameter: package, Value: it.pkg
[INFO] Parameter: groupId, Value: archetype.it
[INFO] Parameter: artifactId, Value: basic
[INFO] project created from Archetype in dir: /home/jenkins/jenkins-slave/workspace/HBase-Trunk_matrix/a3159d73/hbase-archetypes/hbase-client-project/target/build-archetype/target/generated-sources/archetype/target/test-classes/projects/basic/project/basic
[INFO] 
[INFO] --- maven-install-plugin:2.5.2:install (default-install) @ hbase-client-project-archetype ---
[INFO] Installing /home/jenkins/jenkins-slave/workspace/HBase-Trunk_matrix/a3159d73/hbase-archetypes/hbase-client-project/target/build-archetype/target/generated-sources/archetype/target/hbase-client-project-archetype-3.0.0-SNAPSHOT.jar to /home/jenkins/.m2/repository/org/apache/hbase/hbase-client-project-archetype/3.0.0-SNAPSHOT/hbase-client-project-archetype-3.0.0-SNAPSHOT.jar
[INFO] Installing /home/jenkins/jenkins-slave/workspace/HBase-Trunk_matrix/a3159d73/hbase-archetypes/hbase-client-project/target/build-archetype/target/generated-sources/archetype/pom.xml to /home/jenkins/.m2/repository/org/apache/hbase/hbase-client-project-archetype/3.0.0-SNAPSHOT/hbase-client-project-archetype-3.0.0-SNAPSHOT.pom
[INFO] 
[INFO] --- maven-archetype-plugin:2.4:update-local-catalog (default-update-local-catalog) @ hbase-client-project-archetype ---
[INFO] ------------------------------------------------------------------------
[INFO] BUILD SUCCESS
[INFO] ------------------------------------------------------------------------
[INFO] Total time: 1.273s
[INFO] Finished at: Wed Oct 18 08:38:05 UTC 2017
[INFO] Final Memory: 21M/724M
[INFO] ------------------------------------------------------------------------
[INFO] Scanning for projects...
[INFO]                                                                         
[INFO] ------------------------------------------------------------------------
[INFO] Building hbase-shaded-client-project-archetype 3.0.0-SNAPSHOT
[INFO] ------------------------------------------------------------------------
[INFO] 
[INFO] --- maven-resources-plugin:3.0.1:resources (default-resources) @ hbase-shaded-client-project-archetype ---
[INFO] Using 'UTF-8' encoding to copy filtered resources.
[INFO] Copying 9 resources
[INFO] 
[INFO] --- maven-resources-plugin:3.0.1:testResources (default-testResources) @ hbase-shaded-client-project-archetype ---
[INFO] Using 'UTF-8' encoding to copy filtered resources.
[INFO] Copying 2 resources
[INFO] 
[INFO] --- maven-archetype-plugin:2.4:jar (default-jar) @ hbase-shaded-client-project-archetype ---
[INFO] Building archetype jar: /home/jenkins/jenkins-slave/workspace/HBase-Trunk_matrix/a3159d73/hbase-archetypes/hbase-shaded-client-project/target/build-archetype/target/generated-sources/archetype/target/hbase-shaded-client-project-archetype-3.0.0-SNAPSHOT
[INFO] 
[INFO] --- maven-archetype-plugin:2.4:integration-test (default-integration-test) @ hbase-shaded-client-project-archetype ---
[INFO] Processing Archetype IT project: basic
[INFO] ----------------------------------------------------------------------------
[INFO] Using following parameters for creating project from Archetype: hbase-shaded-client-project-archetype:3.0.0-SNAPSHOT
[INFO] ----------------------------------------------------------------------------
[INFO] Parameter: groupId, Value: archetype.it
[INFO] Parameter: artifactId, Value: basic
[INFO] Parameter: version, Value: 0.1-SNAPSHOT
[INFO] Parameter: package, Value: it.pkg
[INFO] Parameter: packageInPathFormat, Value: it/pkg
[INFO] Parameter: version, Value: 0.1-SNAPSHOT
[INFO] Parameter: package, Value: it.pkg
[INFO] Parameter: groupId, Value: archetype.it
[INFO] Parameter: artifactId, Value: basic
[INFO] project created from Archetype in dir: /home/jenkins/jenkins-slave/workspace/HBase-Trunk_matrix/a3159d73/hbase-archetypes/hbase-shaded-client-project/target/build-archetype/target/generated-sources/archetype/target/test-classes/projects/basic/project/basic
[INFO] 
[INFO] --- maven-install-plugin:2.5.2:install (default-install) @ hbase-shaded-client-project-archetype ---
[INFO] Installing /home/jenkins/jenkins-slave/workspace/HBase-Trunk_matrix/a3159d73/hbase-archetypes/hbase-shaded-client-project/target/build-archetype/target/generated-sources/archetype/target/hbase-shaded-client-project-archetype-3.0.0-SNAPSHOT.jar to /home/jenkins/.m2/repository/org/apache/hbase/hbase-shaded-client-project-archetype/3.0.0-SNAPSHOT/hbase-shaded-client-project-archetype-3.0.0-SNAPSHOT.jar
[INFO] Installing /home/jenkins/jenkins-slave/workspace/HBase-Trunk_matrix/a3159d73/hbase-archetypes/hbase-shaded-client-project/target/build-archetype/target/generated-sources/archetype/pom.xml to /home/jenkins/.m2/repository/org/apache/hbase/hbase-shaded-client-project-archetype/3.0.0-SNAPSHOT/hbase-shaded-client-project-archetype-3.0.0-SNAPSHOT.pom
[INFO] 
[INFO] --- maven-archetype-plugin:2.4:update-local-catalog (default-update-local-catalog) @ hbase-shaded-client-project-archetype ---
[INFO] ------------------------------------------------------------------------
[INFO] BUILD SUCCESS
[INFO] ------------------------------------------------------------------------
[INFO] Total time: 1.501s
[INFO] Finished at: Wed Oct 18 08:38:08 UTC 2017
[INFO] Final Memory: 21M/724M
[INFO] ------------------------------------------------------------------------
[INFO] ------------------------------------------------------------------------
[INFO] Reactor Summary:
[INFO] 
[INFO] Apache HBase ...................................... SUCCESS [2.258s]
[INFO] Apache HBase - Checkstyle ......................... SUCCESS [0.569s]
[INFO] Apache HBase - Build Support ...................... SUCCESS [0.062s]
[INFO] Apache HBase - Error Prone Rules .................. SUCCESS [0.268s]
[INFO] Apache HBase - Annotations ........................ SUCCESS [0.184s]
[INFO] Apache HBase - Build Configuration ................ SUCCESS [0.090s]
[INFO] Apache HBase - Shaded Protocol .................... SUCCESS [25.903s]
[INFO] Apache HBase - Common ............................. SUCCESS [2:10.799s]
[INFO] Apache HBase - Metrics API ........................ SUCCESS [1.600s]
[INFO] Apache HBase - Hadoop Compatibility ............... SUCCESS [13.164s]
[INFO] Apache HBase - Metrics Implementation ............. SUCCESS [7.162s]
[INFO] Apache HBase - Hadoop Two Compatibility ........... SUCCESS [16.042s]
[INFO] Apache HBase - Protocol ........................... SUCCESS [7.906s]
[INFO] Apache HBase - Client ............................. SUCCESS [2:13.577s]
[INFO] Apache HBase - Replication ........................ SUCCESS [1.190s]
[INFO] Apache HBase - Prefix Tree ........................ SUCCESS [14.023s]
[INFO] Apache HBase - Procedure .......................... SUCCESS [2:50.191s]
[INFO] Apache HBase - Resource Bundle .................... SUCCESS [0.169s]
[INFO] Apache HBase - Server ............................. SUCCESS [1:51:41.337s]
[INFO] Apache HBase - MapReduce .......................... SUCCESS [12:29.017s]
[INFO] Apache HBase - Testing Util ....................... SUCCESS [2.952s]
[INFO] Apache HBase - Thrift ............................. SUCCESS [1:38.446s]
[INFO] Apache HBase - RSGroup ............................ SUCCESS [3:18.826s]
[INFO] Apache HBase - Shell .............................. SUCCESS [11:55.257s]
[INFO] Apache HBase - Coprocessor Endpoint ............... SUCCESS [3:18.479s]
[INFO] Apache HBase - Backup ............................. SUCCESS [9:26.968s]
[INFO] Apache HBase - Integration Tests .................. SUCCESS [5.606s]
[INFO] Apache HBase - Examples ........................... SUCCESS [46.731s]
[INFO] Apache HBase - Rest ............................... SUCCESS [3:36.570s]
[INFO] Apache HBase - External Block Cache ............... SUCCESS [2.434s]
[INFO] Apache HBase - Spark .............................. SUCCESS [3:37.767s]
[INFO] Apache HBase - Spark Integration Tests ............ SUCCESS [3.079s]
[INFO] Apache HBase - Assembly ........................... SUCCESS [5.009s]
[INFO] Apache HBase - Shaded ............................. SUCCESS [0.160s]
[INFO] Apache HBase - Shaded - Client .................... SUCCESS [1.213s]
[INFO] Apache HBase - Shaded - MapReduce ................. SUCCESS [1.873s]
[INFO] Apache HBase Shaded Packaging Invariants .......... SUCCESS [2.123s]
[INFO] Apache HBase - Archetypes ......................... SUCCESS [0.058s]
[INFO] Apache HBase - Exemplar for hbase-client archetype  SUCCESS [33.821s]
[INFO] Apache HBase - Exemplar for hbase-shaded-client archetype  SUCCESS [33.680s]
[INFO] Apache HBase - Archetype builder .................. SUCCESS [15.493s]
[INFO] ------------------------------------------------------------------------
[INFO] BUILD SUCCESS
[INFO] ------------------------------------------------------------------------
[INFO] Total time: 2:52:23.478s
[INFO] Finished at: Wed Oct 18 08:38:08 UTC 2017
[INFO] Final Memory: 214M/3098M
[INFO] ------------------------------------------------------------------------
Performing Post build task...
Match found for :.* : True
Logical operation result is TRUE
Running script  : # Run zombie detector script
./dev-support/zombie-detector.sh --jenkins ${BUILD_ID}
[a3159d73] $ /bin/bash -xe /tmp/jenkins8607562709061799285.sh
+ ./dev-support/zombie-detector.sh --jenkins 3908
Wed Oct 18 08:38:11 UTC 2017 We're ok: there is no zombie test


    {color:green}+1 zombies{color}. No zombie tests found running at the end of the build.
POST BUILD TASK : SUCCESS
END OF POST BUILD TASK : 0
Archiving artifacts
Recording test results
[FINDBUGS] Collecting findbugs analysis files...
[FINDBUGS] Searching for all files in /home/jenkins/jenkins-slave/workspace/HBase-Trunk_matrix/a3159d73 that match the pattern **/findbugs.xml,**/findbugsXml.xml
[FINDBUGS] Parsing 48 files in /home/jenkins/jenkins-slave/workspace/HBase-Trunk_matrix/a3159d73
[FINDBUGS] Successfully parsed file /home/jenkins/jenkins-slave/workspace/HBase-Trunk_matrix/a3159d73/hbase-archetypes/hbase-client-project/target/findbugs.xml with 0 unique warnings and 0 duplicates.
[FINDBUGS] Successfully parsed file /home/jenkins/jenkins-slave/workspace/HBase-Trunk_matrix/a3159d73/hbase-archetypes/hbase-client-project/target/findbugsXml.xml with 0 unique warnings and 0 duplicates.
[FINDBUGS] Successfully parsed file /home/jenkins/jenkins-slave/workspace/HBase-Trunk_matrix/a3159d73/hbase-archetypes/hbase-shaded-client-project/target/findbugs.xml with 0 unique warnings and 0 duplicates.
[FINDBUGS] Successfully parsed file /home/jenkins/jenkins-slave/workspace/HBase-Trunk_matrix/a3159d73/hbase-archetypes/hbase-shaded-client-project/target/findbugsXml.xml with 0 unique warnings and 0 duplicates.
[FINDBUGS] Successfully parsed file /home/jenkins/jenkins-slave/workspace/HBase-Trunk_matrix/a3159d73/hbase-backup/target/findbugs.xml with 0 unique warnings and 0 duplicates.
[FINDBUGS] Successfully parsed file /home/jenkins/jenkins-slave/workspace/HBase-Trunk_matrix/a3159d73/hbase-backup/target/findbugsXml.xml with 0 unique warnings and 0 duplicates.
[FINDBUGS] Successfully parsed file /home/jenkins/jenkins-slave/workspace/HBase-Trunk_matrix/a3159d73/hbase-build-support/hbase-error-prone/target/findbugs.xml with 0 unique warnings and 0 duplicates.
[FINDBUGS] Successfully parsed file /home/jenkins/jenkins-slave/workspace/HBase-Trunk_matrix/a3159d73/hbase-build-support/hbase-error-prone/target/findbugsXml.xml with 0 unique warnings and 0 duplicates.
[FINDBUGS] Successfully parsed file /home/jenkins/jenkins-slave/workspace/HBase-Trunk_matrix/a3159d73/hbase-client/target/findbugs.xml with 0 unique warnings and 0 duplicates.
[FINDBUGS] Successfully parsed file /home/jenkins/jenkins-slave/workspace/HBase-Trunk_matrix/a3159d73/hbase-client/target/findbugsXml.xml with 0 unique warnings and 0 duplicates.
[FINDBUGS] Successfully parsed file /home/jenkins/jenkins-slave/workspace/HBase-Trunk_matrix/a3159d73/hbase-common/target/findbugs.xml with 0 unique warnings and 0 duplicates.
[FINDBUGS] Successfully parsed file /home/jenkins/jenkins-slave/workspace/HBase-Trunk_matrix/a3159d73/hbase-common/target/findbugsXml.xml with 0 unique warnings and 0 duplicates.
[FINDBUGS] Successfully parsed file /home/jenkins/jenkins-slave/workspace/HBase-Trunk_matrix/a3159d73/hbase-endpoint/target/findbugs.xml with 0 unique warnings and 0 duplicates.
[FINDBUGS] Successfully parsed file /home/jenkins/jenkins-slave/workspace/HBase-Trunk_matrix/a3159d73/hbase-endpoint/target/findbugsXml.xml with 0 unique warnings and 0 duplicates.
[FINDBUGS] Successfully parsed file /home/jenkins/jenkins-slave/workspace/HBase-Trunk_matrix/a3159d73/hbase-examples/target/findbugs.xml with 0 unique warnings and 0 duplicates.
[FINDBUGS] Successfully parsed file /home/jenkins/jenkins-slave/workspace/HBase-Trunk_matrix/a3159d73/hbase-examples/target/findbugsXml.xml with 0 unique warnings and 0 duplicates.
[FINDBUGS] Successfully parsed file /home/jenkins/jenkins-slave/workspace/HBase-Trunk_matrix/a3159d73/hbase-external-blockcache/target/findbugs.xml with 0 unique warnings and 0 duplicates.
[FINDBUGS] Successfully parsed file /home/jenkins/jenkins-slave/workspace/HBase-Trunk_matrix/a3159d73/hbase-external-blockcache/target/findbugsXml.xml with 0 unique warnings and 0 duplicates.
[FINDBUGS] Successfully parsed file /home/jenkins/jenkins-slave/workspace/HBase-Trunk_matrix/a3159d73/hbase-hadoop-compat/target/findbugs.xml with 0 unique warnings and 0 duplicates.
[FINDBUGS] Successfully parsed file /home/jenkins/jenkins-slave/workspace/HBase-Trunk_matrix/a3159d73/hbase-hadoop-compat/target/findbugsXml.xml with 0 unique warnings and 0 duplicates.
[FINDBUGS] Successfully parsed file /home/jenkins/jenkins-slave/workspace/HBase-Trunk_matrix/a3159d73/hbase-hadoop2-compat/target/findbugs.xml with 0 unique warnings and 0 duplicates.
[FINDBUGS] Successfully parsed file /home/jenkins/jenkins-slave/workspace/HBase-Trunk_matrix/a3159d73/hbase-hadoop2-compat/target/findbugsXml.xml with 0 unique warnings and 0 duplicates.
[FINDBUGS] Successfully parsed file /home/jenkins/jenkins-slave/workspace/HBase-Trunk_matrix/a3159d73/hbase-mapreduce/target/findbugs.xml with 0 unique warnings and 0 duplicates.
[FINDBUGS] Successfully parsed file /home/jenkins/jenkins-slave/workspace/HBase-Trunk_matrix/a3159d73/hbase-mapreduce/target/findbugsXml.xml with 0 unique warnings and 0 duplicates.
[FINDBUGS] Successfully parsed file /home/jenkins/jenkins-slave/workspace/HBase-Trunk_matrix/a3159d73/hbase-metrics-api/target/findbugs.xml with 0 unique warnings and 0 duplicates.
[FINDBUGS] Successfully parsed file /home/jenkins/jenkins-slave/workspace/HBase-Trunk_matrix/a3159d73/hbase-metrics-api/target/findbugsXml.xml with 0 unique warnings and 0 duplicates.
[FINDBUGS] Successfully parsed file /home/jenkins/jenkins-slave/workspace/HBase-Trunk_matrix/a3159d73/hbase-metrics/target/findbugs.xml with 0 unique warnings and 0 duplicates.
[FINDBUGS] Successfully parsed file /home/jenkins/jenkins-slave/workspace/HBase-Trunk_matrix/a3159d73/hbase-metrics/target/findbugsXml.xml with 0 unique warnings and 0 duplicates.
[FINDBUGS] Successfully parsed file /home/jenkins/jenkins-slave/workspace/HBase-Trunk_matrix/a3159d73/hbase-prefix-tree/target/findbugs.xml with 0 unique warnings and 0 duplicates.
[FINDBUGS] Successfully parsed file /home/jenkins/jenkins-slave/workspace/HBase-Trunk_matrix/a3159d73/hbase-prefix-tree/target/findbugsXml.xml with 0 unique warnings and 0 duplicates.
[FINDBUGS] Successfully parsed file /home/jenkins/jenkins-slave/workspace/HBase-Trunk_matrix/a3159d73/hbase-procedure/target/findbugs.xml with 0 unique warnings and 0 duplicates.
[FINDBUGS] Successfully parsed file /home/jenkins/jenkins-slave/workspace/HBase-Trunk_matrix/a3159d73/hbase-procedure/target/findbugsXml.xml with 0 unique warnings and 0 duplicates.
[FINDBUGS] Successfully parsed file /home/jenkins/jenkins-slave/workspace/HBase-Trunk_matrix/a3159d73/hbase-protocol-shaded/target/findbugs.xml with 0 unique warnings and 0 duplicates.
[FINDBUGS] Successfully parsed file /home/jenkins/jenkins-slave/workspace/HBase-Trunk_matrix/a3159d73/hbase-protocol-shaded/target/findbugsXml.xml with 0 unique warnings and 0 duplicates.
[FINDBUGS] Successfully parsed file /home/jenkins/jenkins-slave/workspace/HBase-Trunk_matrix/a3159d73/hbase-protocol/target/findbugs.xml with 0 unique warnings and 0 duplicates.
[FINDBUGS] Successfully parsed file /home/jenkins/jenkins-slave/workspace/HBase-Trunk_matrix/a3159d73/hbase-protocol/target/findbugsXml.xml with 0 unique warnings and 0 duplicates.
[FINDBUGS] Successfully parsed file /home/jenkins/jenkins-slave/workspace/HBase-Trunk_matrix/a3159d73/hbase-replication/target/findbugs.xml with 0 unique warnings and 0 duplicates.
[FINDBUGS] Successfully parsed file /home/jenkins/jenkins-slave/workspace/HBase-Trunk_matrix/a3159d73/hbase-replication/target/findbugsXml.xml with 0 unique warnings and 0 duplicates.
[FINDBUGS] Successfully parsed file /home/jenkins/jenkins-slave/workspace/HBase-Trunk_matrix/a3159d73/hbase-rest/target/findbugs.xml with 0 unique warnings and 0 duplicates.
[FINDBUGS] Successfully parsed file /home/jenkins/jenkins-slave/workspace/HBase-Trunk_matrix/a3159d73/hbase-rest/target/findbugsXml.xml with 0 unique warnings and 0 duplicates.
[FINDBUGS] Successfully parsed file /home/jenkins/jenkins-slave/workspace/HBase-Trunk_matrix/a3159d73/hbase-rsgroup/target/findbugs.xml with 0 unique warnings and 0 duplicates.
[FINDBUGS] Successfully parsed file /home/jenkins/jenkins-slave/workspace/HBase-Trunk_matrix/a3159d73/hbase-rsgroup/target/findbugsXml.xml with 0 unique warnings and 0 duplicates.
[FINDBUGS] Successfully parsed file /home/jenkins/jenkins-slave/workspace/HBase-Trunk_matrix/a3159d73/hbase-server/target/findbugs.xml with 0 unique warnings and 0 duplicates.
[FINDBUGS] Successfully parsed file /home/jenkins/jenkins-slave/workspace/HBase-Trunk_matrix/a3159d73/hbase-server/target/findbugsXml.xml with 0 unique warnings and 0 duplicates.
[FINDBUGS] Successfully parsed file /home/jenkins/jenkins-slave/workspace/HBase-Trunk_matrix/a3159d73/hbase-spark/target/findbugs.xml with 0 unique warnings and 0 duplicates.
[FINDBUGS] Successfully parsed file /home/jenkins/jenkins-slave/workspace/HBase-Trunk_matrix/a3159d73/hbase-spark/target/findbugsXml.xml with 0 unique warnings and 0 duplicates.
[FINDBUGS] Successfully parsed file /home/jenkins/jenkins-slave/workspace/HBase-Trunk_matrix/a3159d73/hbase-thrift/target/findbugs.xml with 0 unique warnings and 0 duplicates.
[FINDBUGS] Successfully parsed file /home/jenkins/jenkins-slave/workspace/HBase-Trunk_matrix/a3159d73/hbase-thrift/target/findbugsXml.xml with 0 unique warnings and 0 duplicates.
<Git Blamer> Using GitBlamer to create author and commit information for all warnings.
<Git Blamer> GIT_COMMIT=e804dd0b600f898f7519dee7134b68ad04c20a9a, workspace=/home/jenkins/jenkins-slave/workspace/HBase-Trunk_matrix/a3159d73
[FINDBUGS] Computing warning deltas based on reference build #3903
[CHECKSTYLE] Collecting checkstyle analysis files...
[CHECKSTYLE] Searching for all files in /home/jenkins/jenkins-slave/workspace/HBase-Trunk_matrix/a3159d73 that match the pattern **/checkstyle-result.xml
[CHECKSTYLE] Parsing 41 files in /home/jenkins/jenkins-slave/workspace/HBase-Trunk_matrix/a3159d73
[CHECKSTYLE] Successfully parsed file /home/jenkins/jenkins-slave/workspace/HBase-Trunk_matrix/a3159d73/hbase-annotations/target/checkstyle-result.xml with 0 unique warnings and 0 duplicates.
[CHECKSTYLE] Successfully parsed file /home/jenkins/jenkins-slave/workspace/HBase-Trunk_matrix/a3159d73/hbase-archetypes/hbase-archetype-builder/target/checkstyle-result.xml with 0 unique warnings and 0 duplicates.
[CHECKSTYLE] Successfully parsed file /home/jenkins/jenkins-slave/workspace/HBase-Trunk_matrix/a3159d73/hbase-archetypes/hbase-client-project/target/checkstyle-result.xml with 0 unique warnings and 0 duplicates.
[CHECKSTYLE] Successfully parsed file /home/jenkins/jenkins-slave/workspace/HBase-Trunk_matrix/a3159d73/hbase-archetypes/hbase-shaded-client-project/target/checkstyle-result.xml with 0 unique warnings and 0 duplicates.
[CHECKSTYLE] Successfully parsed file /home/jenkins/jenkins-slave/workspace/HBase-Trunk_matrix/a3159d73/hbase-archetypes/target/checkstyle-result.xml with 0 unique warnings and 0 duplicates.
[CHECKSTYLE] Successfully parsed file /home/jenkins/jenkins-slave/workspace/HBase-Trunk_matrix/a3159d73/hbase-assembly/target/checkstyle-result.xml with 0 unique warnings and 0 duplicates.
[CHECKSTYLE] Successfully parsed file /home/jenkins/jenkins-slave/workspace/HBase-Trunk_matrix/a3159d73/hbase-backup/target/checkstyle-result.xml with 187 unique warnings and 0 duplicates.
[CHECKSTYLE] Successfully parsed file /home/jenkins/jenkins-slave/workspace/HBase-Trunk_matrix/a3159d73/hbase-build-configuration/target/checkstyle-result.xml with 187 unique warnings and 0 duplicates.
[CHECKSTYLE] Successfully parsed file /home/jenkins/jenkins-slave/workspace/HBase-Trunk_matrix/a3159d73/hbase-build-support/hbase-error-prone/target/checkstyle-result.xml with 191 unique warnings and 0 duplicates.
[CHECKSTYLE] Successfully parsed file /home/jenkins/jenkins-slave/workspace/HBase-Trunk_matrix/a3159d73/hbase-build-support/target/checkstyle-result.xml with 191 unique warnings and 0 duplicates.
[CHECKSTYLE] Successfully parsed file /home/jenkins/jenkins-slave/workspace/HBase-Trunk_matrix/a3159d73/hbase-checkstyle/target/checkstyle-result.xml with 191 unique warnings and 0 duplicates.
[CHECKSTYLE] Successfully parsed file /home/jenkins/jenkins-slave/workspace/HBase-Trunk_matrix/a3159d73/hbase-client/target/checkstyle-result.xml with 3699 unique warnings and 0 duplicates.
[CHECKSTYLE] Successfully parsed file /home/jenkins/jenkins-slave/workspace/HBase-Trunk_matrix/a3159d73/hbase-common/target/checkstyle-result.xml with 5172 unique warnings and 0 duplicates.
[CHECKSTYLE] Successfully parsed file /home/jenkins/jenkins-slave/workspace/HBase-Trunk_matrix/a3159d73/hbase-endpoint/target/checkstyle-result.xml with 5312 unique warnings and 0 duplicates.
[CHECKSTYLE] Successfully parsed file /home/jenkins/jenkins-slave/workspace/HBase-Trunk_matrix/a3159d73/hbase-examples/target/checkstyle-result.xml with 5601 unique warnings and 0 duplicates.
[CHECKSTYLE] Successfully parsed file /home/jenkins/jenkins-slave/workspace/HBase-Trunk_matrix/a3159d73/hbase-external-blockcache/target/checkstyle-result.xml with 5603 unique warnings and 0 duplicates.
[CHECKSTYLE] Successfully parsed file /home/jenkins/jenkins-slave/workspace/HBase-Trunk_matrix/a3159d73/hbase-hadoop-compat/target/checkstyle-result.xml with 5625 unique warnings and 0 duplicates.
[CHECKSTYLE] Successfully parsed file /home/jenkins/jenkins-slave/workspace/HBase-Trunk_matrix/a3159d73/hbase-hadoop2-compat/target/checkstyle-result.xml with 5761 unique warnings and 0 duplicates.
[CHECKSTYLE] Successfully parsed file /home/jenkins/jenkins-slave/workspace/HBase-Trunk_matrix/a3159d73/hbase-it/target/checkstyle-result.xml with 5761 unique warnings and 0 duplicates.
[CHECKSTYLE] Successfully parsed file /home/jenkins/jenkins-slave/workspace/HBase-Trunk_matrix/a3159d73/hbase-mapreduce/target/checkstyle-result.xml with 6267 unique warnings and 0 duplicates.
[CHECKSTYLE] Successfully parsed file /home/jenkins/jenkins-slave/workspace/HBase-Trunk_matrix/a3159d73/hbase-metrics-api/target/checkstyle-result.xml with 6271 unique warnings and 0 duplicates.
[CHECKSTYLE] Successfully parsed file /home/jenkins/jenkins-slave/workspace/HBase-Trunk_matrix/a3159d73/hbase-metrics/target/checkstyle-result.xml with 6280 unique warnings and 0 duplicates.
[CHECKSTYLE] Successfully parsed file /home/jenkins/jenkins-slave/workspace/HBase-Trunk_matrix/a3159d73/hbase-prefix-tree/target/checkstyle-result.xml with 6441 unique warnings and 0 duplicates.
[CHECKSTYLE] Successfully parsed file /home/jenkins/jenkins-slave/workspace/HBase-Trunk_matrix/a3159d73/hbase-procedure/target/checkstyle-result.xml with 6565 unique warnings and 0 duplicates.
[CHECKSTYLE] Successfully parsed file /home/jenkins/jenkins-slave/workspace/HBase-Trunk_matrix/a3159d73/hbase-protocol-shaded/target/checkstyle-result.xml with 6568 unique warnings and 0 duplicates.
[CHECKSTYLE] Successfully parsed file /home/jenkins/jenkins-slave/workspace/HBase-Trunk_matrix/a3159d73/hbase-protocol/target/checkstyle-result.xml with 6571 unique warnings and 0 duplicates.
[CHECKSTYLE] Successfully parsed file /home/jenkins/jenkins-slave/workspace/HBase-Trunk_matrix/a3159d73/hbase-replication/target/checkstyle-result.xml with 6647 unique warnings and 0 duplicates.
[CHECKSTYLE] Successfully parsed file /home/jenkins/jenkins-slave/workspace/HBase-Trunk_matrix/a3159d73/hbase-resource-bundle/target/checkstyle-result.xml with 6647 unique warnings and 0 duplicates.
[CHECKSTYLE] Successfully parsed file /home/jenkins/jenkins-slave/workspace/HBase-Trunk_matrix/a3159d73/hbase-rest/target/checkstyle-result.xml with 7256 unique warnings and 0 duplicates.
[CHECKSTYLE] Successfully parsed file /home/jenkins/jenkins-slave/workspace/HBase-Trunk_matrix/a3159d73/hbase-rsgroup/target/checkstyle-result.xml with 7294 unique warnings and 0 duplicates.
[CHECKSTYLE] Successfully parsed file /home/jenkins/jenkins-slave/workspace/HBase-Trunk_matrix/a3159d73/hbase-server/target/checkstyle-result.xml with 13452 unique warnings and 0 duplicates.
[CHECKSTYLE] Successfully parsed file /home/jenkins/jenkins-slave/workspace/HBase-Trunk_matrix/a3159d73/hbase-shaded/hbase-shaded-check-invariants/target/checkstyle-result.xml with 13452 unique warnings and 0 duplicates.
[CHECKSTYLE] Successfully parsed file /home/jenkins/jenkins-slave/workspace/HBase-Trunk_matrix/a3159d73/hbase-shaded/hbase-shaded-client/target/checkstyle-result.xml with 13452 unique warnings and 0 duplicates.
[CHECKSTYLE] Successfully parsed file /home/jenkins/jenkins-slave/workspace/HBase-Trunk_matrix/a3159d73/hbase-shaded/hbase-shaded-mapreduce/target/checkstyle-result.xml with 13452 unique warnings and 0 duplicates.
[CHECKSTYLE] Successfully parsed file /home/jenkins/jenkins-slave/workspace/HBase-Trunk_matrix/a3159d73/hbase-shaded/target/checkstyle-result.xml with 13452 unique warnings and 0 duplicates.
[CHECKSTYLE] Successfully parsed file /home/jenkins/jenkins-slave/workspace/HBase-Trunk_matrix/a3159d73/hbase-shell/target/checkstyle-result.xml with 13452 unique warnings and 0 duplicates.
[CHECKSTYLE] Successfully parsed file /home/jenkins/jenkins-slave/workspace/HBase-Trunk_matrix/a3159d73/hbase-spark-it/target/checkstyle-result.xml with 13452 unique warnings and 0 duplicates.
[CHECKSTYLE] Successfully parsed file /home/jenkins/jenkins-slave/workspace/HBase-Trunk_matrix/a3159d73/hbase-spark/target/checkstyle-result.xml with 13481 unique warnings and 0 duplicates.
[CHECKSTYLE] Successfully parsed file /home/jenkins/jenkins-slave/workspace/HBase-Trunk_matrix/a3159d73/hbase-testing-util/target/checkstyle-result.xml with 13481 unique warnings and 0 duplicates.
[CHECKSTYLE] Successfully parsed file /home/jenkins/jenkins-slave/workspace/HBase-Trunk_matrix/a3159d73/hbase-thrift/target/checkstyle-result.xml with 13616 unique warnings and 0 duplicates.
[CHECKSTYLE] Successfully parsed file /home/jenkins/jenkins-slave/workspace/HBase-Trunk_matrix/a3159d73/target/checkstyle-result.xml with 13616 unique warnings and 0 duplicates.
<Git Blamer> Using GitBlamer to create author and commit information for all warnings.
<Git Blamer> GIT_COMMIT=e804dd0b600f898f7519dee7134b68ad04c20a9a, workspace=/home/jenkins/jenkins-slave/workspace/HBase-Trunk_matrix/a3159d73
 > git rev-parse e804dd0b600f898f7519dee7134b68ad04c20a9a^{commit} # timeout=10
Agent went offline during the build
ERROR: Connection was broken: java.io.EOFException
	at java.io.ObjectInputStream$PeekInputStream.readFully(ObjectInputStream.java:2638)
	at java.io.ObjectInputStream$BlockDataInputStream.readShort(ObjectInputStream.java:3113)
	at java.io.ObjectInputStream.readStreamHeader(ObjectInputStream.java:853)
	at java.io.ObjectInputStream.<init>(ObjectInputStream.java:349)
	at hudson.remoting.ObjectInputStreamEx.<init>(ObjectInputStreamEx.java:48)
	at hudson.remoting.AbstractSynchronousByteArrayCommandTransport.read(AbstractSynchronousByteArrayCommandTransport.java:35)
	at hudson.remoting.SynchronousCommandTransport$ReaderThread.run(SynchronousCommandTransport.java:59)
Caused: java.io.IOException: Unexpected termination of the channel
	at hudson.remoting.SynchronousCommandTransport$ReaderThread.run(SynchronousCommandTransport.java:73)

Build step 'Publish Checkstyle analysis results' marked build as failure

Build failed in Jenkins: HBase-Trunk_matrix » JDK 1.8 (latest),Hadoop #3910

Posted by Apache Jenkins Server <je...@builds.apache.org>.
See <https://builds.apache.org/job/HBase-Trunk_matrix/jdk=JDK%201.8%20(latest),label=Hadoop/3910/display/redirect>

------------------------------------------
[...truncated 1.17 MB...]
[INFO] Total time: 1.120s
[INFO] Finished at: Wed Oct 18 14:17:57 UTC 2017
[INFO] Final Memory: 20M/724M
[INFO] ------------------------------------------------------------------------
[INFO] Archetype project created in <https://builds.apache.org/job/HBase-Trunk_matrix/jdk=JDK%201.8%20(latest),label=Hadoop/ws/hbase-archetypes/hbase-client-project/target/build-archetype/target/generated-sources/archetype>
[INFO] ------------------------------------------------------------------------
[INFO] BUILD SUCCESS
[INFO] ------------------------------------------------------------------------
[INFO] Total time: 3.433s
[INFO] Finished at: Wed Oct 18 14:17:57 UTC 2017
[INFO] Final Memory: 21M/724M
[INFO] ------------------------------------------------------------------------
[INFO] Scanning for projects...
[INFO]                                                                         
[INFO] ------------------------------------------------------------------------
[INFO] Building Apache HBase - Exemplar for hbase-shaded-client archetype 3.0.0-SNAPSHOT
[INFO] ------------------------------------------------------------------------
[INFO] 
[INFO] >>> maven-archetype-plugin:2.4:create-from-project (default-cli) @ hbase-shaded-client-project >>>
[INFO] 
[INFO] <<< maven-archetype-plugin:2.4:create-from-project (default-cli) @ hbase-shaded-client-project <<<
[INFO] 
[INFO] --- maven-archetype-plugin:2.4:create-from-project (default-cli) @ hbase-shaded-client-project ---
[INFO] Setting default groupId: org.apache.hbase
[INFO] Setting default artifactId: hbase-shaded-client-project
[INFO] Setting default version: 3.0.0-SNAPSHOT
[INFO] Setting default package: org.apache.hbase
[INFO] Scanning for projects...
[INFO]                                                                         
[INFO] ------------------------------------------------------------------------
[INFO] Building hbase-shaded-client-project-archetype 3.0.0-SNAPSHOT
[INFO] ------------------------------------------------------------------------
[INFO] 
[INFO] --- maven-resources-plugin:3.0.1:resources (default-resources) @ hbase-shaded-client-project-archetype ---
[WARNING] Using platform encoding (ISO-8859-1 actually) to copy filtered resources, i.e. build is platform dependent!
[INFO] Copying 9 resources
[INFO] 
[INFO] --- maven-resources-plugin:3.0.1:testResources (default-testResources) @ hbase-shaded-client-project-archetype ---
[WARNING] Using platform encoding (ISO-8859-1 actually) to copy filtered resources, i.e. build is platform dependent!
[INFO] Copying 2 resources
[INFO] 
[INFO] --- maven-archetype-plugin:2.4:jar (default-jar) @ hbase-shaded-client-project-archetype ---
[INFO] Building archetype jar: <https://builds.apache.org/job/HBase-Trunk_matrix/jdk=JDK%201.8%20(latest),label=Hadoop/ws/hbase-archetypes/hbase-shaded-client-project/target/build-archetype/target/generated-sources/archetype/target/hbase-shaded-client-project-archetype-3.0.0-SNAPSHOT>
[INFO] ------------------------------------------------------------------------
[INFO] BUILD SUCCESS
[INFO] ------------------------------------------------------------------------
[INFO] Total time: 1.120s
[INFO] Finished at: Wed Oct 18 14:18:01 UTC 2017
[INFO] Final Memory: 20M/724M
[INFO] ------------------------------------------------------------------------
[INFO] Archetype project created in <https://builds.apache.org/job/HBase-Trunk_matrix/jdk=JDK%201.8%20(latest),label=Hadoop/ws/hbase-archetypes/hbase-shaded-client-project/target/build-archetype/target/generated-sources/archetype>
[INFO] ------------------------------------------------------------------------
[INFO] BUILD SUCCESS
[INFO] ------------------------------------------------------------------------
[INFO] Total time: 3.655s
[INFO] Finished at: Wed Oct 18 14:18:02 UTC 2017
[INFO] Final Memory: 21M/724M
[INFO] ------------------------------------------------------------------------
[INFO] 
[INFO] --- maven-resources-plugin:2.7:copy-resources (hbase-client-ARCHETYPE__copy-pom-to-temp-for-xslt-processing) @ hbase-archetype-builder ---
[INFO] Using 'UTF-8' encoding to copy filtered resources.
[INFO] Copying 1 resource
[INFO] 
[INFO] --- maven-resources-plugin:2.7:copy-resources (hbase-shaded-client-ARCHETYPE__copy-pom-to-temp-for-xslt-processing) @ hbase-archetype-builder ---
[INFO] Using 'UTF-8' encoding to copy filtered resources.
[INFO] Copying 1 resource
[INFO] 
[INFO] --- xml-maven-plugin:1.0.1:transform (modify-archetype-pom-files-via-xslt) @ hbase-archetype-builder ---
[INFO] Transforming file: <https://builds.apache.org/job/HBase-Trunk_matrix/jdk=JDK%201.8%20(latest),label=Hadoop/3910/artifact/hbase-archetypes/hbase-archetype-builder/../hbase-client-project/target/temp-arch/pom.xml>
[INFO] Transformed 1 file(s).
[INFO] Transforming file: <https://builds.apache.org/job/HBase-Trunk_matrix/jdk=JDK%201.8%20(latest),label=Hadoop/3910/artifact/hbase-archetypes/hbase-archetype-builder/../hbase-shaded-client-project/target/temp-arch/pom.xml>
[INFO] Transformed 1 file(s).
[INFO] 
[INFO] --- maven-install-plugin:2.5.2:install (default-install) @ hbase-archetype-builder ---
[INFO] Installing <https://builds.apache.org/job/HBase-Trunk_matrix/jdk=JDK%201.8%20(latest),label=Hadoop/3910/artifact/hbase-archetypes/hbase-archetype-builder/pom.xml> to /home/jenkins/.m2/repository/org/apache/hbase/hbase-archetype-builder/3.0.0-SNAPSHOT/hbase-archetype-builder-3.0.0-SNAPSHOT.pom
[INFO] 
[INFO] --- exec-maven-plugin:1.6.0:exec (run-installArchetypes-script) @ hbase-archetype-builder ---
[INFO] Scanning for projects...
[INFO]                                                                         
[INFO] ------------------------------------------------------------------------
[INFO] Building hbase-client-project-archetype 3.0.0-SNAPSHOT
[INFO] ------------------------------------------------------------------------
[INFO] 
[INFO] --- maven-resources-plugin:3.0.1:resources (default-resources) @ hbase-client-project-archetype ---
[INFO] Using 'UTF-8' encoding to copy filtered resources.
[INFO] Copying 9 resources
[INFO] 
[INFO] --- maven-resources-plugin:3.0.1:testResources (default-testResources) @ hbase-client-project-archetype ---
[INFO] Using 'UTF-8' encoding to copy filtered resources.
[INFO] Copying 2 resources
[INFO] 
[INFO] --- maven-archetype-plugin:2.4:jar (default-jar) @ hbase-client-project-archetype ---
[INFO] Building archetype jar: <https://builds.apache.org/job/HBase-Trunk_matrix/jdk=JDK%201.8%20(latest),label=Hadoop/ws/hbase-archetypes/hbase-client-project/target/build-archetype/target/generated-sources/archetype/target/hbase-client-project-archetype-3.0.0-SNAPSHOT>
[INFO] 
[INFO] --- maven-archetype-plugin:2.4:integration-test (default-integration-test) @ hbase-client-project-archetype ---
[INFO] Processing Archetype IT project: basic
[INFO] ----------------------------------------------------------------------------
[INFO] Using following parameters for creating project from Archetype: hbase-client-project-archetype:3.0.0-SNAPSHOT
[INFO] ----------------------------------------------------------------------------
[INFO] Parameter: groupId, Value: archetype.it
[INFO] Parameter: artifactId, Value: basic
[INFO] Parameter: version, Value: 0.1-SNAPSHOT
[INFO] Parameter: package, Value: it.pkg
[INFO] Parameter: packageInPathFormat, Value: it/pkg
[INFO] Parameter: version, Value: 0.1-SNAPSHOT
[INFO] Parameter: package, Value: it.pkg
[INFO] Parameter: groupId, Value: archetype.it
[INFO] Parameter: artifactId, Value: basic
[INFO] project created from Archetype in dir: <https://builds.apache.org/job/HBase-Trunk_matrix/jdk=JDK%201.8%20(latest),label=Hadoop/ws/hbase-archetypes/hbase-client-project/target/build-archetype/target/generated-sources/archetype/target/test-classes/projects/basic/project/basic>
[INFO] 
[INFO] --- maven-install-plugin:2.5.2:install (default-install) @ hbase-client-project-archetype ---
[INFO] Installing <https://builds.apache.org/job/HBase-Trunk_matrix/jdk=JDK%201.8%20(latest),label=Hadoop/ws/hbase-archetypes/hbase-client-project/target/build-archetype/target/generated-sources/archetype/target/hbase-client-project-archetype-3.0.0-SNAPSHOT.jar> to /home/jenkins/.m2/repository/org/apache/hbase/hbase-client-project-archetype/3.0.0-SNAPSHOT/hbase-client-project-archetype-3.0.0-SNAPSHOT.jar
[INFO] Installing <https://builds.apache.org/job/HBase-Trunk_matrix/jdk=JDK%201.8%20(latest),label=Hadoop/3910/artifact/hbase-archetypes/hbase-client-project/target/build-archetype/target/generated-sources/archetype/pom.xml> to /home/jenkins/.m2/repository/org/apache/hbase/hbase-client-project-archetype/3.0.0-SNAPSHOT/hbase-client-project-archetype-3.0.0-SNAPSHOT.pom
[INFO] 
[INFO] --- maven-archetype-plugin:2.4:update-local-catalog (default-update-local-catalog) @ hbase-client-project-archetype ---
[INFO] ------------------------------------------------------------------------
[INFO] BUILD SUCCESS
[INFO] ------------------------------------------------------------------------
[INFO] Total time: 1.278s
[INFO] Finished at: Wed Oct 18 14:18:04 UTC 2017
[INFO] Final Memory: 21M/724M
[INFO] ------------------------------------------------------------------------
[INFO] Scanning for projects...
[INFO]                                                                         
[INFO] ------------------------------------------------------------------------
[INFO] Building hbase-shaded-client-project-archetype 3.0.0-SNAPSHOT
[INFO] ------------------------------------------------------------------------
[INFO] 
[INFO] --- maven-resources-plugin:3.0.1:resources (default-resources) @ hbase-shaded-client-project-archetype ---
[INFO] Using 'UTF-8' encoding to copy filtered resources.
[INFO] Copying 9 resources
[INFO] 
[INFO] --- maven-resources-plugin:3.0.1:testResources (default-testResources) @ hbase-shaded-client-project-archetype ---
[INFO] Using 'UTF-8' encoding to copy filtered resources.
[INFO] Copying 2 resources
[INFO] 
[INFO] --- maven-archetype-plugin:2.4:jar (default-jar) @ hbase-shaded-client-project-archetype ---
[INFO] Building archetype jar: <https://builds.apache.org/job/HBase-Trunk_matrix/jdk=JDK%201.8%20(latest),label=Hadoop/ws/hbase-archetypes/hbase-shaded-client-project/target/build-archetype/target/generated-sources/archetype/target/hbase-shaded-client-project-archetype-3.0.0-SNAPSHOT>
[INFO] 
[INFO] --- maven-archetype-plugin:2.4:integration-test (default-integration-test) @ hbase-shaded-client-project-archetype ---
[INFO] Processing Archetype IT project: basic
[INFO] ----------------------------------------------------------------------------
[INFO] Using following parameters for creating project from Archetype: hbase-shaded-client-project-archetype:3.0.0-SNAPSHOT
[INFO] ----------------------------------------------------------------------------
[INFO] Parameter: groupId, Value: archetype.it
[INFO] Parameter: artifactId, Value: basic
[INFO] Parameter: version, Value: 0.1-SNAPSHOT
[INFO] Parameter: package, Value: it.pkg
[INFO] Parameter: packageInPathFormat, Value: it/pkg
[INFO] Parameter: version, Value: 0.1-SNAPSHOT
[INFO] Parameter: package, Value: it.pkg
[INFO] Parameter: groupId, Value: archetype.it
[INFO] Parameter: artifactId, Value: basic
[INFO] project created from Archetype in dir: <https://builds.apache.org/job/HBase-Trunk_matrix/jdk=JDK%201.8%20(latest),label=Hadoop/ws/hbase-archetypes/hbase-shaded-client-project/target/build-archetype/target/generated-sources/archetype/target/test-classes/projects/basic/project/basic>
[INFO] 
[INFO] --- maven-install-plugin:2.5.2:install (default-install) @ hbase-shaded-client-project-archetype ---
[INFO] Installing <https://builds.apache.org/job/HBase-Trunk_matrix/jdk=JDK%201.8%20(latest),label=Hadoop/ws/hbase-archetypes/hbase-shaded-client-project/target/build-archetype/target/generated-sources/archetype/target/hbase-shaded-client-project-archetype-3.0.0-SNAPSHOT.jar> to /home/jenkins/.m2/repository/org/apache/hbase/hbase-shaded-client-project-archetype/3.0.0-SNAPSHOT/hbase-shaded-client-project-archetype-3.0.0-SNAPSHOT.jar
[INFO] Installing <https://builds.apache.org/job/HBase-Trunk_matrix/jdk=JDK%201.8%20(latest),label=Hadoop/3910/artifact/hbase-archetypes/hbase-shaded-client-project/target/build-archetype/target/generated-sources/archetype/pom.xml> to /home/jenkins/.m2/repository/org/apache/hbase/hbase-shaded-client-project-archetype/3.0.0-SNAPSHOT/hbase-shaded-client-project-archetype-3.0.0-SNAPSHOT.pom
[INFO] 
[INFO] --- maven-archetype-plugin:2.4:update-local-catalog (default-update-local-catalog) @ hbase-shaded-client-project-archetype ---
[INFO] ------------------------------------------------------------------------
[INFO] BUILD SUCCESS
[INFO] ------------------------------------------------------------------------
[INFO] Total time: 1.327s
[INFO] Finished at: Wed Oct 18 14:18:07 UTC 2017
[INFO] Final Memory: 21M/724M
[INFO] ------------------------------------------------------------------------
[INFO] ------------------------------------------------------------------------
[INFO] Reactor Summary:
[INFO] 
[INFO] Apache HBase ...................................... SUCCESS [2.267s]
[INFO] Apache HBase - Checkstyle ......................... SUCCESS [0.622s]
[INFO] Apache HBase - Build Support ...................... SUCCESS [0.072s]
[INFO] Apache HBase - Error Prone Rules .................. SUCCESS [0.239s]
[INFO] Apache HBase - Annotations ........................ SUCCESS [0.186s]
[INFO] Apache HBase - Build Configuration ................ SUCCESS [0.080s]
[INFO] Apache HBase - Shaded Protocol .................... SUCCESS [25.668s]
[INFO] Apache HBase - Common ............................. SUCCESS [2:10.416s]
[INFO] Apache HBase - Metrics API ........................ SUCCESS [1.683s]
[INFO] Apache HBase - Hadoop Compatibility ............... SUCCESS [13.068s]
[INFO] Apache HBase - Metrics Implementation ............. SUCCESS [7.069s]
[INFO] Apache HBase - Hadoop Two Compatibility ........... SUCCESS [16.062s]
[INFO] Apache HBase - Protocol ........................... SUCCESS [7.496s]
[INFO] Apache HBase - Client ............................. SUCCESS [2:14.738s]
[INFO] Apache HBase - Replication ........................ SUCCESS [1.167s]
[INFO] Apache HBase - Prefix Tree ........................ SUCCESS [14.381s]
[INFO] Apache HBase - Procedure .......................... SUCCESS [2:44.578s]
[INFO] Apache HBase - Resource Bundle .................... SUCCESS [0.164s]
[INFO] Apache HBase - Server ............................. FAILURE [20:38.373s]
[INFO] Apache HBase - MapReduce .......................... SKIPPED
[INFO] Apache HBase - Testing Util ....................... SKIPPED
[INFO] Apache HBase - Thrift ............................. SKIPPED
[INFO] Apache HBase - RSGroup ............................ SKIPPED
[INFO] Apache HBase - Shell .............................. SKIPPED
[INFO] Apache HBase - Coprocessor Endpoint ............... SKIPPED
[INFO] Apache HBase - Backup ............................. SKIPPED
[INFO] Apache HBase - Integration Tests .................. SKIPPED
[INFO] Apache HBase - Examples ........................... SKIPPED
[INFO] Apache HBase - Rest ............................... SKIPPED
[INFO] Apache HBase - External Block Cache ............... SKIPPED
[INFO] Apache HBase - Spark .............................. SKIPPED
[INFO] Apache HBase - Spark Integration Tests ............ SKIPPED
[INFO] Apache HBase - Assembly ........................... SKIPPED
[INFO] Apache HBase - Shaded ............................. SUCCESS [0.249s]
[INFO] Apache HBase - Shaded - Client .................... SUCCESS [1.121s]
[INFO] Apache HBase - Shaded - MapReduce ................. SKIPPED
[INFO] Apache HBase Shaded Packaging Invariants .......... SKIPPED
[INFO] Apache HBase - Archetypes ......................... SUCCESS [0.050s]
[INFO] Apache HBase - Exemplar for hbase-client archetype  SKIPPED
[INFO] Apache HBase - Exemplar for hbase-shaded-client archetype  SKIPPED
[INFO] Apache HBase - Archetype builder .................. SUCCESS [15.565s]
[INFO] ------------------------------------------------------------------------
[INFO] BUILD FAILURE
[INFO] ------------------------------------------------------------------------
[INFO] Total time: 29:36.814s
[INFO] Finished at: Wed Oct 18 14:18:07 UTC 2017
[INFO] Final Memory: 96M/4396M
[INFO] ------------------------------------------------------------------------
[ERROR] Failed to execute goal org.apache.maven.plugins:maven-surefire-plugin:2.19.1:test (default-test) on project hbase-server: There are test failures.
[ERROR] 
[ERROR] Please refer to <https://builds.apache.org/job/HBase-Trunk_matrix/jdk=JDK%201.8%20(latest),label=Hadoop/ws/hbase-server/target/surefire-reports> for the individual test results.
[ERROR] -> [Help 1]
[ERROR] 
[ERROR] To see the full stack trace of the errors, re-run Maven with the -e switch.
[ERROR] Re-run Maven using the -X switch to enable full debug logging.
[ERROR] 
[ERROR] For more information about the errors and possible solutions, please read the following articles:
[ERROR] [Help 1] http://cwiki.apache.org/confluence/display/MAVEN/MojoFailureException
[ERROR] 
[ERROR] After correcting the problems, you can resume the build with the command
[ERROR]   mvn <goals> -rf :hbase-server
Build step 'Invoke top-level Maven targets' marked build as failure
Performing Post build task...
Match found for :.* : True
Logical operation result is TRUE
Running script  : # Run zombie detector script
./dev-support/zombie-detector.sh --jenkins ${BUILD_ID}
[a3159d73] $ /bin/bash -xe /tmp/jenkins3580459072849488610.sh
+ ./dev-support/zombie-detector.sh --jenkins 3910
Wed Oct 18 14:18:20 UTC 2017 We're ok: there is no zombie test


    {color:green}+1 zombies{color}. No zombie tests found running at the end of the build.
POST BUILD TASK : SUCCESS
END OF POST BUILD TASK : 0
Archiving artifacts
Recording test results
[FINDBUGS] Skipping publisher since build result is FAILURE
[CHECKSTYLE] Skipping publisher since build result is FAILURE

Build failed in Jenkins: HBase-Trunk_matrix » JDK 1.8 (latest),Hadoop #3909

Posted by Apache Jenkins Server <je...@builds.apache.org>.
See <https://builds.apache.org/job/HBase-Trunk_matrix/jdk=JDK%201.8%20(latest),label=Hadoop/3909/display/redirect>

------------------------------------------
[...truncated 1.17 MB...]
[INFO] Total time: 1.143s
[INFO] Finished at: Wed Oct 18 10:15:51 UTC 2017
[INFO] Final Memory: 20M/724M
[INFO] ------------------------------------------------------------------------
[INFO] Archetype project created in <https://builds.apache.org/job/HBase-Trunk_matrix/jdk=JDK%201.8%20(latest),label=Hadoop/ws/hbase-archetypes/hbase-client-project/target/build-archetype/target/generated-sources/archetype>
[INFO] ------------------------------------------------------------------------
[INFO] BUILD SUCCESS
[INFO] ------------------------------------------------------------------------
[INFO] Total time: 3.570s
[INFO] Finished at: Wed Oct 18 10:15:51 UTC 2017
[INFO] Final Memory: 21M/724M
[INFO] ------------------------------------------------------------------------
[INFO] Scanning for projects...
[INFO]                                                                         
[INFO] ------------------------------------------------------------------------
[INFO] Building Apache HBase - Exemplar for hbase-shaded-client archetype 3.0.0-SNAPSHOT
[INFO] ------------------------------------------------------------------------
[INFO] 
[INFO] >>> maven-archetype-plugin:2.4:create-from-project (default-cli) @ hbase-shaded-client-project >>>
[INFO] 
[INFO] <<< maven-archetype-plugin:2.4:create-from-project (default-cli) @ hbase-shaded-client-project <<<
[INFO] 
[INFO] --- maven-archetype-plugin:2.4:create-from-project (default-cli) @ hbase-shaded-client-project ---
[INFO] Setting default groupId: org.apache.hbase
[INFO] Setting default artifactId: hbase-shaded-client-project
[INFO] Setting default version: 3.0.0-SNAPSHOT
[INFO] Setting default package: org.apache.hbase
[INFO] Scanning for projects...
[INFO]                                                                         
[INFO] ------------------------------------------------------------------------
[INFO] Building hbase-shaded-client-project-archetype 3.0.0-SNAPSHOT
[INFO] ------------------------------------------------------------------------
[INFO] 
[INFO] --- maven-resources-plugin:3.0.1:resources (default-resources) @ hbase-shaded-client-project-archetype ---
[WARNING] Using platform encoding (ISO-8859-1 actually) to copy filtered resources, i.e. build is platform dependent!
[INFO] Copying 9 resources
[INFO] 
[INFO] --- maven-resources-plugin:3.0.1:testResources (default-testResources) @ hbase-shaded-client-project-archetype ---
[WARNING] Using platform encoding (ISO-8859-1 actually) to copy filtered resources, i.e. build is platform dependent!
[INFO] Copying 2 resources
[INFO] 
[INFO] --- maven-archetype-plugin:2.4:jar (default-jar) @ hbase-shaded-client-project-archetype ---
[INFO] Building archetype jar: <https://builds.apache.org/job/HBase-Trunk_matrix/jdk=JDK%201.8%20(latest),label=Hadoop/ws/hbase-archetypes/hbase-shaded-client-project/target/build-archetype/target/generated-sources/archetype/target/hbase-shaded-client-project-archetype-3.0.0-SNAPSHOT>
[INFO] ------------------------------------------------------------------------
[INFO] BUILD SUCCESS
[INFO] ------------------------------------------------------------------------
[INFO] Total time: 1.037s
[INFO] Finished at: Wed Oct 18 10:15:56 UTC 2017
[INFO] Final Memory: 20M/724M
[INFO] ------------------------------------------------------------------------
[INFO] Archetype project created in <https://builds.apache.org/job/HBase-Trunk_matrix/jdk=JDK%201.8%20(latest),label=Hadoop/ws/hbase-archetypes/hbase-shaded-client-project/target/build-archetype/target/generated-sources/archetype>
[INFO] ------------------------------------------------------------------------
[INFO] BUILD SUCCESS
[INFO] ------------------------------------------------------------------------
[INFO] Total time: 3.499s
[INFO] Finished at: Wed Oct 18 10:15:56 UTC 2017
[INFO] Final Memory: 21M/724M
[INFO] ------------------------------------------------------------------------
[INFO] 
[INFO] --- maven-resources-plugin:2.7:copy-resources (hbase-client-ARCHETYPE__copy-pom-to-temp-for-xslt-processing) @ hbase-archetype-builder ---
[INFO] Using 'UTF-8' encoding to copy filtered resources.
[INFO] Copying 1 resource
[INFO] 
[INFO] --- maven-resources-plugin:2.7:copy-resources (hbase-shaded-client-ARCHETYPE__copy-pom-to-temp-for-xslt-processing) @ hbase-archetype-builder ---
[INFO] Using 'UTF-8' encoding to copy filtered resources.
[INFO] Copying 1 resource
[INFO] 
[INFO] --- xml-maven-plugin:1.0.1:transform (modify-archetype-pom-files-via-xslt) @ hbase-archetype-builder ---
[INFO] Transforming file: <https://builds.apache.org/job/HBase-Trunk_matrix/jdk=JDK%201.8%20(latest),label=Hadoop/3909/artifact/hbase-archetypes/hbase-archetype-builder/../hbase-client-project/target/temp-arch/pom.xml>
[INFO] Transformed 1 file(s).
[INFO] Transforming file: <https://builds.apache.org/job/HBase-Trunk_matrix/jdk=JDK%201.8%20(latest),label=Hadoop/3909/artifact/hbase-archetypes/hbase-archetype-builder/../hbase-shaded-client-project/target/temp-arch/pom.xml>
[INFO] Transformed 1 file(s).
[INFO] 
[INFO] --- maven-install-plugin:2.5.2:install (default-install) @ hbase-archetype-builder ---
[INFO] Installing <https://builds.apache.org/job/HBase-Trunk_matrix/jdk=JDK%201.8%20(latest),label=Hadoop/3909/artifact/hbase-archetypes/hbase-archetype-builder/pom.xml> to /home/jenkins/.m2/repository/org/apache/hbase/hbase-archetype-builder/3.0.0-SNAPSHOT/hbase-archetype-builder-3.0.0-SNAPSHOT.pom
[INFO] 
[INFO] --- exec-maven-plugin:1.6.0:exec (run-installArchetypes-script) @ hbase-archetype-builder ---
[INFO] Scanning for projects...
[INFO]                                                                         
[INFO] ------------------------------------------------------------------------
[INFO] Building hbase-client-project-archetype 3.0.0-SNAPSHOT
[INFO] ------------------------------------------------------------------------
[INFO] 
[INFO] --- maven-resources-plugin:3.0.1:resources (default-resources) @ hbase-client-project-archetype ---
[INFO] Using 'UTF-8' encoding to copy filtered resources.
[INFO] Copying 9 resources
[INFO] 
[INFO] --- maven-resources-plugin:3.0.1:testResources (default-testResources) @ hbase-client-project-archetype ---
[INFO] Using 'UTF-8' encoding to copy filtered resources.
[INFO] Copying 2 resources
[INFO] 
[INFO] --- maven-archetype-plugin:2.4:jar (default-jar) @ hbase-client-project-archetype ---
[INFO] Building archetype jar: <https://builds.apache.org/job/HBase-Trunk_matrix/jdk=JDK%201.8%20(latest),label=Hadoop/ws/hbase-archetypes/hbase-client-project/target/build-archetype/target/generated-sources/archetype/target/hbase-client-project-archetype-3.0.0-SNAPSHOT>
[INFO] 
[INFO] --- maven-archetype-plugin:2.4:integration-test (default-integration-test) @ hbase-client-project-archetype ---
[INFO] Processing Archetype IT project: basic
[INFO] ----------------------------------------------------------------------------
[INFO] Using following parameters for creating project from Archetype: hbase-client-project-archetype:3.0.0-SNAPSHOT
[INFO] ----------------------------------------------------------------------------
[INFO] Parameter: groupId, Value: archetype.it
[INFO] Parameter: artifactId, Value: basic
[INFO] Parameter: version, Value: 0.1-SNAPSHOT
[INFO] Parameter: package, Value: it.pkg
[INFO] Parameter: packageInPathFormat, Value: it/pkg
[INFO] Parameter: version, Value: 0.1-SNAPSHOT
[INFO] Parameter: package, Value: it.pkg
[INFO] Parameter: groupId, Value: archetype.it
[INFO] Parameter: artifactId, Value: basic
[INFO] project created from Archetype in dir: <https://builds.apache.org/job/HBase-Trunk_matrix/jdk=JDK%201.8%20(latest),label=Hadoop/ws/hbase-archetypes/hbase-client-project/target/build-archetype/target/generated-sources/archetype/target/test-classes/projects/basic/project/basic>
[INFO] 
[INFO] --- maven-install-plugin:2.5.2:install (default-install) @ hbase-client-project-archetype ---
[INFO] Installing <https://builds.apache.org/job/HBase-Trunk_matrix/jdk=JDK%201.8%20(latest),label=Hadoop/ws/hbase-archetypes/hbase-client-project/target/build-archetype/target/generated-sources/archetype/target/hbase-client-project-archetype-3.0.0-SNAPSHOT.jar> to /home/jenkins/.m2/repository/org/apache/hbase/hbase-client-project-archetype/3.0.0-SNAPSHOT/hbase-client-project-archetype-3.0.0-SNAPSHOT.jar
[INFO] Installing <https://builds.apache.org/job/HBase-Trunk_matrix/jdk=JDK%201.8%20(latest),label=Hadoop/3909/artifact/hbase-archetypes/hbase-client-project/target/build-archetype/target/generated-sources/archetype/pom.xml> to /home/jenkins/.m2/repository/org/apache/hbase/hbase-client-project-archetype/3.0.0-SNAPSHOT/hbase-client-project-archetype-3.0.0-SNAPSHOT.pom
[INFO] 
[INFO] --- maven-archetype-plugin:2.4:update-local-catalog (default-update-local-catalog) @ hbase-client-project-archetype ---
[INFO] ------------------------------------------------------------------------
[INFO] BUILD SUCCESS
[INFO] ------------------------------------------------------------------------
[INFO] Total time: 1.280s
[INFO] Finished at: Wed Oct 18 10:15:58 UTC 2017
[INFO] Final Memory: 21M/724M
[INFO] ------------------------------------------------------------------------
[INFO] Scanning for projects...
[INFO]                                                                         
[INFO] ------------------------------------------------------------------------
[INFO] Building hbase-shaded-client-project-archetype 3.0.0-SNAPSHOT
[INFO] ------------------------------------------------------------------------
[INFO] 
[INFO] --- maven-resources-plugin:3.0.1:resources (default-resources) @ hbase-shaded-client-project-archetype ---
[INFO] Using 'UTF-8' encoding to copy filtered resources.
[INFO] Copying 9 resources
[INFO] 
[INFO] --- maven-resources-plugin:3.0.1:testResources (default-testResources) @ hbase-shaded-client-project-archetype ---
[INFO] Using 'UTF-8' encoding to copy filtered resources.
[INFO] Copying 2 resources
[INFO] 
[INFO] --- maven-archetype-plugin:2.4:jar (default-jar) @ hbase-shaded-client-project-archetype ---
[INFO] Building archetype jar: <https://builds.apache.org/job/HBase-Trunk_matrix/jdk=JDK%201.8%20(latest),label=Hadoop/ws/hbase-archetypes/hbase-shaded-client-project/target/build-archetype/target/generated-sources/archetype/target/hbase-shaded-client-project-archetype-3.0.0-SNAPSHOT>
[INFO] 
[INFO] --- maven-archetype-plugin:2.4:integration-test (default-integration-test) @ hbase-shaded-client-project-archetype ---
[INFO] Processing Archetype IT project: basic
[INFO] ----------------------------------------------------------------------------
[INFO] Using following parameters for creating project from Archetype: hbase-shaded-client-project-archetype:3.0.0-SNAPSHOT
[INFO] ----------------------------------------------------------------------------
[INFO] Parameter: groupId, Value: archetype.it
[INFO] Parameter: artifactId, Value: basic
[INFO] Parameter: version, Value: 0.1-SNAPSHOT
[INFO] Parameter: package, Value: it.pkg
[INFO] Parameter: packageInPathFormat, Value: it/pkg
[INFO] Parameter: version, Value: 0.1-SNAPSHOT
[INFO] Parameter: package, Value: it.pkg
[INFO] Parameter: groupId, Value: archetype.it
[INFO] Parameter: artifactId, Value: basic
[INFO] project created from Archetype in dir: <https://builds.apache.org/job/HBase-Trunk_matrix/jdk=JDK%201.8%20(latest),label=Hadoop/ws/hbase-archetypes/hbase-shaded-client-project/target/build-archetype/target/generated-sources/archetype/target/test-classes/projects/basic/project/basic>
[INFO] 
[INFO] --- maven-install-plugin:2.5.2:install (default-install) @ hbase-shaded-client-project-archetype ---
[INFO] Installing <https://builds.apache.org/job/HBase-Trunk_matrix/jdk=JDK%201.8%20(latest),label=Hadoop/ws/hbase-archetypes/hbase-shaded-client-project/target/build-archetype/target/generated-sources/archetype/target/hbase-shaded-client-project-archetype-3.0.0-SNAPSHOT.jar> to /home/jenkins/.m2/repository/org/apache/hbase/hbase-shaded-client-project-archetype/3.0.0-SNAPSHOT/hbase-shaded-client-project-archetype-3.0.0-SNAPSHOT.jar
[INFO] Installing <https://builds.apache.org/job/HBase-Trunk_matrix/jdk=JDK%201.8%20(latest),label=Hadoop/3909/artifact/hbase-archetypes/hbase-shaded-client-project/target/build-archetype/target/generated-sources/archetype/pom.xml> to /home/jenkins/.m2/repository/org/apache/hbase/hbase-shaded-client-project-archetype/3.0.0-SNAPSHOT/hbase-shaded-client-project-archetype-3.0.0-SNAPSHOT.pom
[INFO] 
[INFO] --- maven-archetype-plugin:2.4:update-local-catalog (default-update-local-catalog) @ hbase-shaded-client-project-archetype ---
[INFO] ------------------------------------------------------------------------
[INFO] BUILD SUCCESS
[INFO] ------------------------------------------------------------------------
[INFO] Total time: 1.237s
[INFO] Finished at: Wed Oct 18 10:16:01 UTC 2017
[INFO] Final Memory: 21M/724M
[INFO] ------------------------------------------------------------------------
[INFO] ------------------------------------------------------------------------
[INFO] Reactor Summary:
[INFO] 
[INFO] Apache HBase ...................................... SUCCESS [2.337s]
[INFO] Apache HBase - Checkstyle ......................... SUCCESS [0.582s]
[INFO] Apache HBase - Build Support ...................... SUCCESS [0.058s]
[INFO] Apache HBase - Error Prone Rules .................. SUCCESS [0.238s]
[INFO] Apache HBase - Annotations ........................ SUCCESS [0.175s]
[INFO] Apache HBase - Build Configuration ................ SUCCESS [0.088s]
[INFO] Apache HBase - Shaded Protocol .................... SUCCESS [25.417s]
[INFO] Apache HBase - Common ............................. SUCCESS [2:10.092s]
[INFO] Apache HBase - Metrics API ........................ SUCCESS [1.638s]
[INFO] Apache HBase - Hadoop Compatibility ............... SUCCESS [13.056s]
[INFO] Apache HBase - Metrics Implementation ............. SUCCESS [6.988s]
[INFO] Apache HBase - Hadoop Two Compatibility ........... SUCCESS [16.121s]
[INFO] Apache HBase - Protocol ........................... SUCCESS [7.876s]
[INFO] Apache HBase - Client ............................. SUCCESS [2:17.817s]
[INFO] Apache HBase - Replication ........................ SUCCESS [1.172s]
[INFO] Apache HBase - Prefix Tree ........................ SUCCESS [13.991s]
[INFO] Apache HBase - Procedure .......................... SUCCESS [2:46.883s]
[INFO] Apache HBase - Resource Bundle .................... SUCCESS [0.450s]
[INFO] Apache HBase - Server ............................. FAILURE [19:46.811s]
[INFO] Apache HBase - MapReduce .......................... SKIPPED
[INFO] Apache HBase - Testing Util ....................... SKIPPED
[INFO] Apache HBase - Thrift ............................. SKIPPED
[INFO] Apache HBase - RSGroup ............................ SKIPPED
[INFO] Apache HBase - Shell .............................. SKIPPED
[INFO] Apache HBase - Coprocessor Endpoint ............... SKIPPED
[INFO] Apache HBase - Backup ............................. SKIPPED
[INFO] Apache HBase - Integration Tests .................. SKIPPED
[INFO] Apache HBase - Examples ........................... SKIPPED
[INFO] Apache HBase - Rest ............................... SKIPPED
[INFO] Apache HBase - External Block Cache ............... SKIPPED
[INFO] Apache HBase - Spark .............................. SKIPPED
[INFO] Apache HBase - Spark Integration Tests ............ SKIPPED
[INFO] Apache HBase - Assembly ........................... SKIPPED
[INFO] Apache HBase - Shaded ............................. SUCCESS [0.265s]
[INFO] Apache HBase - Shaded - Client .................... SUCCESS [1.163s]
[INFO] Apache HBase - Shaded - MapReduce ................. SKIPPED
[INFO] Apache HBase Shaded Packaging Invariants .......... SKIPPED
[INFO] Apache HBase - Archetypes ......................... SUCCESS [0.051s]
[INFO] Apache HBase - Exemplar for hbase-client archetype  SKIPPED
[INFO] Apache HBase - Exemplar for hbase-shaded-client archetype  SKIPPED
[INFO] Apache HBase - Archetype builder .................. SUCCESS [15.362s]
[INFO] ------------------------------------------------------------------------
[INFO] BUILD FAILURE
[INFO] ------------------------------------------------------------------------
[INFO] Total time: 28:50.106s
[INFO] Finished at: Wed Oct 18 10:16:01 UTC 2017
[INFO] Final Memory: 96M/3962M
[INFO] ------------------------------------------------------------------------
[ERROR] Failed to execute goal org.apache.maven.plugins:maven-surefire-plugin:2.19.1:test (default-test) on project hbase-server: There are test failures.
[ERROR] 
[ERROR] Please refer to <https://builds.apache.org/job/HBase-Trunk_matrix/jdk=JDK%201.8%20(latest),label=Hadoop/ws/hbase-server/target/surefire-reports> for the individual test results.
[ERROR] -> [Help 1]
[ERROR] 
[ERROR] To see the full stack trace of the errors, re-run Maven with the -e switch.
[ERROR] Re-run Maven using the -X switch to enable full debug logging.
[ERROR] 
[ERROR] For more information about the errors and possible solutions, please read the following articles:
[ERROR] [Help 1] http://cwiki.apache.org/confluence/display/MAVEN/MojoFailureException
[ERROR] 
[ERROR] After correcting the problems, you can resume the build with the command
[ERROR]   mvn <goals> -rf :hbase-server
Build step 'Invoke top-level Maven targets' marked build as failure
Performing Post build task...
Match found for :.* : True
Logical operation result is TRUE
Running script  : # Run zombie detector script
./dev-support/zombie-detector.sh --jenkins ${BUILD_ID}
[a3159d73] $ /bin/bash -xe /tmp/jenkins8814083802469255978.sh
+ ./dev-support/zombie-detector.sh --jenkins 3909
Wed Oct 18 10:16:21 UTC 2017 We're ok: there is no zombie test


    {color:green}+1 zombies{color}. No zombie tests found running at the end of the build.
POST BUILD TASK : SUCCESS
END OF POST BUILD TASK : 0
Archiving artifacts
Recording test results
[FINDBUGS] Skipping publisher since build result is FAILURE
[CHECKSTYLE] Skipping publisher since build result is FAILURE