You are viewing a plain text version of this content. The canonical link for it is here.
Posted to builds@beam.apache.org by Apache Jenkins Server <je...@builds.apache.org> on 2021/05/26 00:45:02 UTC

Build failed in Jenkins: beam_PostCommit_Java_PVR_Flink_Streaming #6424

See <https://ci-beam.apache.org/job/beam_PostCommit_Java_PVR_Flink_Streaming/6424/display/redirect?page=changes>

Changes:

[relax] GroupIntoBatches improvements

[relax] make sure that DataflowRunner batch override for GroupIntoBatches

[noreply] Minor: Fix doc left nav on dev website (#14881)

[zyichi] [BEAM-12395] Add support to enable google cloud profiler for python SDK

[relax] fix DataflowRunnerTest

[noreply] Fix flaky test on slow remote systems by adding `afterIterations` to


------------------------------------------
[...truncated 10.02 KB...]
> Task :model:job-management:createCheckerFrameworkManifest
> Task :runners:java-fn-execution:createCheckerFrameworkManifest
> Task :sdks:java:core:generateAvroProtocol NO-SOURCE
> Task :sdks:java:fn-execution:processResources NO-SOURCE
> Task :runners:core-java:processResources NO-SOURCE
> Task :sdks:java:extensions:google-cloud-platform-core:processResources NO-SOURCE
> Task :runners:java-fn-execution:processResources NO-SOURCE
> Task :sdks:java:harness:processResources NO-SOURCE
> Task :sdks:java:expansion-service:processResources NO-SOURCE
> Task :sdks:java:core:generateAvroJava NO-SOURCE
> Task :runners:core-java:processTestResources NO-SOURCE
> Task :runners:core-construction-java:processResources NO-SOURCE
> Task :runners:java-job-service:processResources NO-SOURCE
> Task :runners:flink:1.12:copyResourcesOverrides NO-SOURCE
> Task :runners:core-construction-java:processTestResources NO-SOURCE
> Task :model:job-management:extractProto
> Task :model:fn-execution:extractProto
> Task :sdks:java:build-tools:createCheckerFrameworkManifest
> Task :sdks:java:extensions:protobuf:createCheckerFrameworkManifest
> Task :sdks:java:io:google-cloud-platform:createCheckerFrameworkManifest
> Task :model:job-management:processResources
> Task :sdks:java:io:google-cloud-platform:processResources NO-SOURCE
> Task :sdks:java:extensions:protobuf:extractProto
> Task :model:fn-execution:processResources
> Task :sdks:java:extensions:protobuf:processResources NO-SOURCE
> Task :runners:portability:java:createCheckerFrameworkManifest
> Task :runners:flink:1.12:copySourceOverrides
> Task :runners:portability:java:processResources NO-SOURCE
> Task :runners:portability:java:processTestResources NO-SOURCE
> Task :runners:flink:1.12:copyTestResourcesOverrides NO-SOURCE
> Task :runners:flink:1.12:createCheckerFrameworkManifest
> Task :runners:flink:1.12:processResources
> Task :runners:flink:1.12:copyTestSourceOverrides
> Task :runners:flink:1.12:processTestResources
> Task :sdks:java:core:generateGrammarSource FROM-CACHE
> Task :sdks:java:core:processResources
> Task :sdks:java:core:generateTestAvroProtocol NO-SOURCE
> Task :sdks:java:build-tools:compileJava FROM-CACHE
> Task :sdks:java:build-tools:processResources
> Task :sdks:java:build-tools:classes
> Task :sdks:java:build-tools:jar
> Task :sdks:java:core:generateTestAvroJava
> Task :sdks:java:core:generateTestGrammarSource NO-SOURCE
> Task :sdks:java:core:processTestResources
> Task :model:pipeline:extractIncludeProto
> Task :model:pipeline:extractProto
> Task :model:pipeline:generateProto FROM-CACHE
> Task :model:pipeline:compileJava
> Task :model:pipeline:processResources
> Task :model:pipeline:classes
> Task :model:pipeline:jar
> Task :model:pipeline:shadowJar FROM-CACHE
> Task :model:fn-execution:extractIncludeProto
> Task :model:fn-execution:generateProto FROM-CACHE
> Task :model:job-management:extractIncludeProto
> Task :model:job-management:generateProto FROM-CACHE
> Task :model:job-management:compileJava
> Task :model:job-management:classes
> Task :model:job-management:shadowJar FROM-CACHE
> Task :model:fn-execution:compileJava
> Task :model:fn-execution:classes
> Task :model:fn-execution:shadowJar FROM-CACHE
> Task :sdks:java:core:compileJava
Note: Some input files use or override a deprecated API.
Note: Recompile with -Xlint:deprecation for details.
Note: Some input files use unchecked or unsafe operations.
Note: Recompile with -Xlint:unchecked for details.

> Task :sdks:java:core:classes
> Task :sdks:java:core:shadowJar
> Task :sdks:java:extensions:protobuf:extractIncludeProto
> Task :sdks:java:extensions:protobuf:generateProto NO-SOURCE
> Task :sdks:java:core:jar

> Task :sdks:java:fn-execution:compileJava
Note: <https://ci-beam.apache.org/job/beam_PostCommit_Java_PVR_Flink_Streaming/ws/src/sdks/java/fn-execution/src/main/java/org/apache/beam/sdk/fn/data/BeamFnDataSizeBasedBufferingOutboundObserver.java> uses or overrides a deprecated API.
Note: Recompile with -Xlint:deprecation for details.
Note: Some input files use unchecked or unsafe operations.
Note: Recompile with -Xlint:unchecked for details.

> Task :sdks:java:extensions:protobuf:compileJava
> Task :sdks:java:core:compileTestJava
> Task :sdks:java:fn-execution:classes
> Task :sdks:java:fn-execution:jar
> Task :runners:core-construction-java:compileJava

> Task :sdks:java:extensions:protobuf:compileJava
Note: Some input files use or override a deprecated API.
Note: Recompile with -Xlint:deprecation for details.
Note: Some input files use unchecked or unsafe operations.
Note: Recompile with -Xlint:unchecked for details.

> Task :sdks:java:extensions:protobuf:classes
> Task :sdks:java:extensions:protobuf:jar

> Task :sdks:java:core:compileTestJava
Note: Some input files use or override a deprecated API.
Note: Recompile with -Xlint:deprecation for details.
Note: Some input files use unchecked or unsafe operations.
Note: Recompile with -Xlint:unchecked for details.

> Task :sdks:java:core:testClasses
> Task :sdks:java:core:shadowTestJar

> Task :runners:core-construction-java:compileJava
Note: Some input files use or override a deprecated API.
Note: Recompile with -Xlint:deprecation for details.
Note: Some input files use unchecked or unsafe operations.
Note: Recompile with -Xlint:unchecked for details.

> Task :runners:core-construction-java:classes
> Task :runners:core-construction-java:jar

> Task :runners:core-construction-java:compileTestJava
Note: Some input files use or override a deprecated API.
Note: Recompile with -Xlint:deprecation for details.
Note: Some input files use unchecked or unsafe operations.
Note: Recompile with -Xlint:unchecked for details.

> Task :runners:core-construction-java:testClasses
> Task :runners:core-construction-java:testJar
> Task :runners:core-java:compileJava
Note: Some input files use or override a deprecated API.
Note: Recompile with -Xlint:deprecation for details.
Note: Some input files use unchecked or unsafe operations.
Note: Recompile with -Xlint:unchecked for details.

> Task :runners:core-java:classes
> Task :runners:core-java:jar

> Task :runners:core-java:compileTestJava
Note: Some input files use or override a deprecated API.
Note: Recompile with -Xlint:deprecation for details.
Note: Some input files use unchecked or unsafe operations.
Note: Recompile with -Xlint:unchecked for details.

> Task :runners:core-java:testClasses
> Task :runners:core-java:testJar

> Task :sdks:java:extensions:google-cloud-platform-core:compileJava
Note: Some input files use or override a deprecated API.
Note: Recompile with -Xlint:deprecation for details.

> Task :sdks:java:extensions:google-cloud-platform-core:classes
> Task :sdks:java:extensions:google-cloud-platform-core:jar
> Task :sdks:java:harness:compileJava
Note: Some input files use or override a deprecated API.
Note: Recompile with -Xlint:deprecation for details.
Note: Some input files use unchecked or unsafe operations.
Note: Recompile with -Xlint:unchecked for details.

> Task :sdks:java:harness:classes
> Task :sdks:java:harness:jar
> Task :sdks:java:harness:shadowJar
> Task :runners:java-fn-execution:compileJava
Note: Some input files use or override a deprecated API.
Note: Recompile with -Xlint:deprecation for details.
Note: Some input files use unchecked or unsafe operations.
Note: Recompile with -Xlint:unchecked for details.

> Task :runners:java-fn-execution:classes
> Task :runners:java-fn-execution:jar

> Task :sdks:java:expansion-service:compileJava
Note: <https://ci-beam.apache.org/job/beam_PostCommit_Java_PVR_Flink_Streaming/ws/src/sdks/java/expansion-service/src/main/java/org/apache/beam/sdk/expansion/service/ExpansionService.java> uses unchecked or unsafe operations.
Note: Recompile with -Xlint:unchecked for details.

> Task :sdks:java:expansion-service:classes
> Task :sdks:java:expansion-service:jar

> Task :runners:java-job-service:compileJava
Note: <https://ci-beam.apache.org/job/beam_PostCommit_Java_PVR_Flink_Streaming/ws/src/runners/java-job-service/src/main/java/org/apache/beam/runners/jobsubmission/PortablePipelineJarCreator.java> uses unchecked or unsafe operations.
Note: Recompile with -Xlint:unchecked for details.

> Task :runners:java-job-service:classes
> Task :runners:java-job-service:jar
> Task :sdks:java:io:google-cloud-platform:compileJava
> Task :runners:flink:1.12:compileJava
> Task :runners:portability:java:compileJava
> Task :runners:portability:java:classes
> Task :runners:portability:java:jar

> Task :runners:portability:java:compileTestJava
Note: <https://ci-beam.apache.org/job/beam_PostCommit_Java_PVR_Flink_Streaming/ws/src/runners/portability/java/src/test/java/org/apache/beam/runners/portability/CloseableResourceTest.java> uses or overrides a deprecated API.
Note: Recompile with -Xlint:deprecation for details.
Note: <https://ci-beam.apache.org/job/beam_PostCommit_Java_PVR_Flink_Streaming/ws/src/runners/portability/java/src/test/java/org/apache/beam/runners/portability/ExternalWorkerServiceTest.java> uses unchecked or unsafe operations.
Note: Recompile with -Xlint:unchecked for details.

> Task :runners:portability:java:testClasses
> Task :runners:portability:java:testJar

> Task :runners:flink:1.12:compileJava
Note: Some input files use or override a deprecated API.
Note: Recompile with -Xlint:deprecation for details.
Note: Some input files use unchecked or unsafe operations.
Note: Recompile with -Xlint:unchecked for details.

> Task :runners:flink:1.12:classes
> Task :runners:flink:1.12:jar

> Task :sdks:java:io:google-cloud-platform:compileJava
Note: Some input files use or override a deprecated API.
Note: Recompile with -Xlint:deprecation for details.
Note: Some input files use unchecked or unsafe operations.
Note: Recompile with -Xlint:unchecked for details.

> Task :sdks:java:io:google-cloud-platform:classes
> Task :sdks:java:io:google-cloud-platform:jar

> Task :runners:flink:1.12:compileTestJava
Note: Some input files use or override a deprecated API.
Note: Recompile with -Xlint:deprecation for details.
Note: Some input files use unchecked or unsafe operations.
Note: Recompile with -Xlint:unchecked for details.

> Task :runners:flink:1.12:testClasses
> Task :runners:flink:1.12:testJar
> Task :runners:flink:1.12:job-server:validatesPortableRunnerStreaming

org.apache.beam.sdk.testing.TestStreamTest > testFirstElementLate FAILED
    java.lang.RuntimeException at TestStreamTest.java:263

250 tests completed, 1 failed, 2 skipped

> Task :runners:flink:1.12:job-server:validatesPortableRunnerStreaming FAILED

FAILURE: Build failed with an exception.

* What went wrong:
Execution failed for task ':runners:flink:1.12:job-server:validatesPortableRunnerStreaming'.
> There were failing tests. See the report at: file://<https://ci-beam.apache.org/job/beam_PostCommit_Java_PVR_Flink_Streaming/ws/src/runners/flink/1.12/job-server/build/reports/tests/validatesPortableRunnerStreaming/index.html>

* Try:
Run with --stacktrace option to get the stack trace. Run with --info or --debug option to get more log output. Run with --scan to get full insights.

* Get more help at https://help.gradle.org

Deprecated Gradle features were used in this build, making it incompatible with Gradle 7.0.
Use '--warning-mode all' to show the individual deprecation warnings.
See https://docs.gradle.org/6.8.3/userguide/command_line_interface.html#sec:command_line_warnings

BUILD FAILED in 44m 31s
88 actionable tasks: 80 executed, 8 from cache

Publishing build scan...
https://gradle.com/s/kjhof6j4u4lyq

Build step 'Invoke Gradle script' changed build result to FAILURE
Build step 'Invoke Gradle script' marked build as failure

---------------------------------------------------------------------
To unsubscribe, e-mail: builds-unsubscribe@beam.apache.org
For additional commands, e-mail: builds-help@beam.apache.org


Jenkins build is back to normal : beam_PostCommit_Java_PVR_Flink_Streaming #6425

Posted by Apache Jenkins Server <je...@builds.apache.org>.
See <https://ci-beam.apache.org/job/beam_PostCommit_Java_PVR_Flink_Streaming/6425/display/redirect?page=changes>


---------------------------------------------------------------------
To unsubscribe, e-mail: builds-unsubscribe@beam.apache.org
For additional commands, e-mail: builds-help@beam.apache.org