You are viewing a plain text version of this content. The canonical link for it is here.
Posted to builds@mesos.apache.org by Apache Jenkins Server <je...@builds.apache.org> on 2018/03/28 19:06:54 UTC
Build failed in Jenkins: Mesos-Reviewbot #22037
See <https://builds.apache.org/job/Mesos-Reviewbot/22037/display/redirect>
------------------------------------------
[...truncated 35.04 MB...]
I0328 19:06:49.211832 5578 slave.cpp:294] Agent using credential for: test-principal
I0328 19:06:49.211853 5578 credentials.hpp:37] Loading credentials for authentication from '/tmp/Endpoint_SlaveEndpointTest_AuthorizedRequest_1_Qvk23R/http_credentials'
I0328 19:06:49.212083 5578 http.cpp:959] Creating default 'basic' HTTP authenticator for realm 'mesos-agent-readonly'
I0328 19:06:49.212393 5578 disk_profile_adaptor.cpp:80] Creating default disk profile adaptor module
I0328 19:06:49.213651 5578 slave.cpp:609] Agent resources: [{"name":"cpus","scalar":{"value":2.0},"type":"SCALAR"},{"name":"mem","scalar":{"value":1024.0},"type":"SCALAR"},{"name":"disk","scalar":{"value":1024.0},"type":"SCALAR"},{"name":"ports","ranges":{"range":[{"begin":31000,"end":32000}]},"type":"RANGES"}]
I0328 19:06:49.213861 5578 slave.cpp:617] Agent attributes: [ ]
I0328 19:06:49.213876 5578 slave.cpp:626] Agent hostname: b6910ea8f88b
I0328 19:06:49.213989 5582 task_status_update_manager.cpp:181] Pausing sending task status updates
I0328 19:06:49.215569 5585 state.cpp:66] Recovering state from '/tmp/Endpoint_SlaveEndpointTest_AuthorizedRequest_1_h7hfN9/meta'
I0328 19:06:49.215975 5570 task_status_update_manager.cpp:207] Recovering task status update manager
I0328 19:06:49.216200 5577 containerizer.cpp:674] Recovering containerizer
I0328 19:06:49.217836 5590 provisioner.cpp:495] Provisioner recovery complete
I0328 19:06:49.218215 5582 slave.cpp:7212] Finished recovery
I0328 19:06:49.221181 5581 process.cpp:3564] Handling HTTP event for process 'slave(949)' with path: '/slave(949)/monitor/statistics.json'
I0328 19:06:49.222854 5574 http.cpp:1099] HTTP GET for /slave(949)/monitor/statistics.json from 172.17.0.2:55086
I0328 19:06:49.222942 5574 http.cpp:936] Authorizing principal 'test-principal' to GET the '/monitor/statistics.json' endpoint
I0328 19:06:49.225605 5575 slave.cpp:919] Agent terminating
[ OK ] Endpoint/SlaveEndpointTest.AuthorizedRequest/1 (31 ms)
[ RUN ] Endpoint/SlaveEndpointTest.AuthorizedRequest/2
I0328 19:06:49.238127 5566 containerizer.cpp:304] Using isolation { environment_secret, posix/cpu, posix/mem, filesystem/posix, network/cni }
W0328 19:06:49.238654 5566 backend.cpp:76] Failed to create 'aufs' backend: AufsBackend requires root privileges
W0328 19:06:49.238677 5566 backend.cpp:76] Failed to create 'bind' backend: BindBackend requires root privileges
I0328 19:06:49.238708 5566 provisioner.cpp:299] Using default backend 'copy'
I0328 19:06:49.243590 5588 slave.cpp:261] Mesos agent started on (950)@172.17.0.2:36039
I0328 19:06:49.243615 5588 slave.cpp:262] Flags at startup: --acls="" --appc_simple_discovery_uri_prefix="http://" --appc_store_dir="/tmp/Endpoint_SlaveEndpointTest_AuthorizedRequest_2_hSJVoJ/store/appc" --authenticate_http_readonly="true" --authenticate_http_readwrite="false" --authenticatee="crammd5" --authentication_backoff_factor="1secs" --authorizer="local" --cgroups_cpu_enable_pids_and_tids_count="false" --cgroups_enable_cfs="false" --cgroups_hierarchy="/sys/fs/cgroup" --cgroups_limit_swap="false" --cgroups_root="mesos" --container_disk_watch_interval="15secs" --containerizers="mesos" --credential="/tmp/Endpoint_SlaveEndpointTest_AuthorizedRequest_2_hSJVoJ/credential" --default_role="*" --disallow_sharing_agent_pid_namespace="false" --disk_watch_interval="1mins" --docker="docker" --docker_kill_orphans="true" --docker_registry="https://registry-1.docker.io" --docker_remove_delay="6hrs" --docker_socket="/var/run/docker.sock" --docker_stop_timeout="0ns" --docker_store_dir="/tmp/Endpoint_SlaveEndpointTest_AuthorizedRequest_2_hSJVoJ/store/docker" --docker_volume_checkpoint_dir="/var/run/mesos/isolators/docker/volume" --enforce_container_disk_quota="false" --executor_registration_timeout="1mins" --executor_reregistration_timeout="2secs" --executor_shutdown_grace_period="5secs" --fetcher_cache_dir="/tmp/Endpoint_SlaveEndpointTest_AuthorizedRequest_2_hSJVoJ/fetch" --fetcher_cache_size="2GB" --frameworks_home="" --gc_delay="1weeks" --gc_disk_headroom="0.1" --hadoop_home="" --help="false" --hostname_lookup="true" --http_command_executor="false" --http_credentials="/tmp/Endpoint_SlaveEndpointTest_AuthorizedRequest_2_hSJVoJ/http_credentials" --http_heartbeat_interval="30secs" --initialize_driver_logging="true" --isolation="posix/cpu,posix/mem" --launcher="posix" --launcher_dir="/tmp/SRC/build/mesos-1.6.0/_build/sub/src" --logbufsecs="0" --logging_level="INFO" --max_completed_executors_per_framework="150" --oversubscribed_resources_interval="15secs" --perf_duration="10secs" --perf_interval="1mins" --port="5051" --qos_correction_interval_min="0ns" --quiet="false" --reconfiguration_policy="equal" --recover="reconnect" --recovery_timeout="15mins" --registration_backoff_factor="10ms" --resources="cpus:2;gpus:0;mem:1024;disk:1024;ports:[31000-32000]" --revocable_cpu_low_priority="true" --runtime_dir="/tmp/Endpoint_SlaveEndpointTest_AuthorizedRequest_2_hSJVoJ" --sandbox_directory="/mnt/mesos/sandbox" --strict="true" --switch_user="true" --systemd_enable_support="true" --systemd_runtime_directory="/run/systemd/system" --version="false" --work_dir="/tmp/Endpoint_SlaveEndpointTest_AuthorizedRequest_2_96mu30" --zk_session_timeout="10secs"
I0328 19:06:49.244009 5588 credentials.hpp:86] Loading credential for authentication from '/tmp/Endpoint_SlaveEndpointTest_AuthorizedRequest_2_hSJVoJ/credential'
I0328 19:06:49.244189 5588 slave.cpp:294] Agent using credential for: test-principal
I0328 19:06:49.244211 5588 credentials.hpp:37] Loading credentials for authentication from '/tmp/Endpoint_SlaveEndpointTest_AuthorizedRequest_2_hSJVoJ/http_credentials'
I0328 19:06:49.244446 5588 http.cpp:959] Creating default 'basic' HTTP authenticator for realm 'mesos-agent-readonly'
I0328 19:06:49.244801 5588 disk_profile_adaptor.cpp:80] Creating default disk profile adaptor module
I0328 19:06:49.246129 5588 slave.cpp:609] Agent resources: [{"name":"cpus","scalar":{"value":2.0},"type":"SCALAR"},{"name":"mem","scalar":{"value":1024.0},"type":"SCALAR"},{"name":"disk","scalar":{"value":1024.0},"type":"SCALAR"},{"name":"ports","ranges":{"range":[{"begin":31000,"end":32000}]},"type":"RANGES"}]
I0328 19:06:49.246345 5588 slave.cpp:617] Agent attributes: [ ]
I0328 19:06:49.246361 5588 slave.cpp:626] Agent hostname: b6910ea8f88b
I0328 19:06:49.246495 5569 task_status_update_manager.cpp:181] Pausing sending task status updates
I0328 19:06:49.248188 5590 state.cpp:66] Recovering state from '/tmp/Endpoint_SlaveEndpointTest_AuthorizedRequest_2_96mu30/meta'
I0328 19:06:49.248497 5572 task_status_update_manager.cpp:207] Recovering task status update manager
I0328 19:06:49.248704 5585 containerizer.cpp:674] Recovering containerizer
I0328 19:06:49.250289 5568 provisioner.cpp:495] Provisioner recovery complete
I0328 19:06:49.250618 5569 slave.cpp:7212] Finished recovery
I0328 19:06:49.254250 5567 process.cpp:3564] Handling HTTP event for process 'slave(950)' with path: '/slave(950)/containers'
I0328 19:06:49.255872 5581 http.cpp:1099] HTTP GET for /slave(950)/containers from 172.17.0.2:55088
I0328 19:06:49.255951 5581 http.cpp:936] Authorizing principal 'test-principal' to GET the '/containers' endpoint
I0328 19:06:49.259261 5568 slave.cpp:919] Agent terminating
[ OK ] Endpoint/SlaveEndpointTest.AuthorizedRequest/2 (34 ms)
[ RUN ] Endpoint/SlaveEndpointTest.UnauthorizedRequest/0
I0328 19:06:49.271930 5566 containerizer.cpp:304] Using isolation { environment_secret, posix/cpu, posix/mem, filesystem/posix, network/cni }
W0328 19:06:49.272455 5566 backend.cpp:76] Failed to create 'aufs' backend: AufsBackend requires root privileges
W0328 19:06:49.272480 5566 backend.cpp:76] Failed to create 'bind' backend: BindBackend requires root privileges
I0328 19:06:49.272508 5566 provisioner.cpp:299] Using default backend 'copy'
I0328 19:06:49.276906 5584 slave.cpp:261] Mesos agent started on (951)@172.17.0.2:36039
I0328 19:06:49.277166 5584 slave.cpp:262] Flags at startup: --acls="" --appc_simple_discovery_uri_prefix="http://" --appc_store_dir="/tmp/Endpoint_SlaveEndpointTest_UnauthorizedRequest_0_ULFL3A/store/appc" --authenticate_http_readonly="true" --authenticate_http_readwrite="false" --authenticatee="crammd5" --authentication_backoff_factor="1secs" --authorizer="local" --cgroups_cpu_enable_pids_and_tids_count="false" --cgroups_enable_cfs="false" --cgroups_hierarchy="/sys/fs/cgroup" --cgroups_limit_swap="false" --cgroups_root="mesos" --container_disk_watch_interval="15secs" --containerizers="mesos" --credential="/tmp/Endpoint_SlaveEndpointTest_UnauthorizedRequest_0_ULFL3A/credential" --default_role="*" --disallow_sharing_agent_pid_namespace="false" --disk_watch_interval="1mins" --docker="docker" --docker_kill_orphans="true" --docker_registry="https://registry-1.docker.io" --docker_remove_delay="6hrs" --docker_socket="/var/run/docker.sock" --docker_stop_timeout="0ns" --docker_store_dir="/tmp/Endpoint_SlaveEndpointTest_UnauthorizedRequest_0_ULFL3A/store/docker" --docker_volume_checkpoint_dir="/var/run/mesos/isolators/docker/volume" --enforce_container_disk_quota="false" --executor_registration_timeout="1mins" --executor_reregistration_timeout="2secs" --executor_shutdown_grace_period="5secs" --fetcher_cache_dir="/tmp/Endpoint_SlaveEndpointTest_UnauthorizedRequest_0_ULFL3A/fetch" --fetcher_cache_size="2GB" --frameworks_home="" --gc_delay="1weeks" --gc_disk_headroom="0.1" --hadoop_home="" --help="false" --hostname_lookup="true" --http_command_executor="false" --http_credentials="/tmp/Endpoint_SlaveEndpointTest_UnauthorizedRequest_0_ULFL3A/http_credentials" --http_heartbeat_interval="30secs" --initialize_driver_logging="true" --isolation="posix/cpu,posix/mem" --launcher="posix" --launcher_dir="/tmp/SRC/build/mesos-1.6.0/_build/sub/src" --logbufsecs="0" --logging_level="INFO" --max_completed_executors_per_framework="150" --oversubscribed_resources_interval="15secs" --perf_duration="10secs" --perf_interval="1mins" --port="5051" --qos_correction_interval_min="0ns" --quiet="false" --reconfiguration_policy="equal" --recover="reconnect" --recovery_timeout="15mins" --registration_backoff_factor="10ms" --resources="cpus:2;gpus:0;mem:1024;disk:1024;ports:[31000-32000]" --revocable_cpu_low_priority="true" --runtime_dir="/tmp/Endpoint_SlaveEndpointTest_UnauthorizedRequest_0_ULFL3A" --sandbox_directory="/mnt/mesos/sandbox" --strict="true" --switch_user="true" --systemd_enable_support="true" --systemd_runtime_directory="/run/systemd/system" --version="false" --work_dir="/tmp/Endpoint_SlaveEndpointTest_UnauthorizedRequest_0_cnbiDS" --zk_session_timeout="10secs"
I0328 19:06:49.277899 5584 credentials.hpp:86] Loading credential for authentication from '/tmp/Endpoint_SlaveEndpointTest_UnauthorizedRequest_0_ULFL3A/credential'
I0328 19:06:49.278070 5584 slave.cpp:294] Agent using credential for: test-principal
I0328 19:06:49.278092 5584 credentials.hpp:37] Loading credentials for authentication from '/tmp/Endpoint_SlaveEndpointTest_UnauthorizedRequest_0_ULFL3A/http_credentials'
I0328 19:06:49.278316 5584 http.cpp:959] Creating default 'basic' HTTP authenticator for realm 'mesos-agent-readonly'
I0328 19:06:49.278640 5584 disk_profile_adaptor.cpp:80] Creating default disk profile adaptor module
I0328 19:06:49.279942 5584 slave.cpp:609] Agent resources: [{"name":"cpus","scalar":{"value":2.0},"type":"SCALAR"},{"name":"mem","scalar":{"value":1024.0},"type":"SCALAR"},{"name":"disk","scalar":{"value":1024.0},"type":"SCALAR"},{"name":"ports","ranges":{"range":[{"begin":31000,"end":32000}]},"type":"RANGES"}]
I0328 19:06:49.280149 5584 slave.cpp:617] Agent attributes: [ ]
I0328 19:06:49.280164 5584 slave.cpp:626] Agent hostname: b6910ea8f88b
I0328 19:06:49.280315 5583 task_status_update_manager.cpp:181] Pausing sending task status updates
I0328 19:06:49.281827 5590 state.cpp:66] Recovering state from '/tmp/Endpoint_SlaveEndpointTest_UnauthorizedRequest_0_cnbiDS/meta'
I0328 19:06:49.282132 5590 task_status_update_manager.cpp:207] Recovering task status update manager
I0328 19:06:49.282343 5586 containerizer.cpp:674] Recovering containerizer
I0328 19:06:49.283983 5579 provisioner.cpp:495] Provisioner recovery complete
I0328 19:06:49.284379 5585 slave.cpp:7212] Finished recovery
I0328 19:06:49.288318 5575 process.cpp:3564] Handling HTTP event for process 'slave(951)' with path: '/slave(951)/monitor/statistics'
I0328 19:06:49.290036 5571 http.cpp:1099] HTTP GET for /slave(951)/monitor/statistics from 172.17.0.2:55090
I0328 19:06:49.290132 5571 http.cpp:936] Authorizing principal 'test-principal' to GET the '/monitor/statistics' endpoint
I0328 19:06:49.291771 5587 slave.cpp:919] Agent terminating
[ OK ] Endpoint/SlaveEndpointTest.UnauthorizedRequest/0 (33 ms)
[ RUN ] Endpoint/SlaveEndpointTest.UnauthorizedRequest/1
I0328 19:06:49.305140 5566 containerizer.cpp:304] Using isolation { environment_secret, posix/cpu, posix/mem, filesystem/posix, network/cni }
W0328 19:06:49.305678 5566 backend.cpp:76] Failed to create 'aufs' backend: AufsBackend requires root privileges
W0328 19:06:49.305702 5566 backend.cpp:76] Failed to create 'bind' backend: BindBackend requires root privileges
I0328 19:06:49.305733 5566 provisioner.cpp:299] Using default backend 'copy'
I0328 19:06:49.310026 5585 slave.cpp:261] Mesos agent started on (952)@172.17.0.2:36039
I0328 19:06:49.310048 5585 slave.cpp:262] Flags at startup: --acls="" --appc_simple_discovery_uri_prefix="http://" --appc_store_dir="/tmp/Endpoint_SlaveEndpointTest_UnauthorizedRequest_1_hbnh2s/store/appc" --authenticate_http_readonly="true" --authenticate_http_readwrite="false" --authenticatee="crammd5" --authentication_backoff_factor="1secs" --authorizer="local" --cgroups_cpu_enable_pids_and_tids_count="false" --cgroups_enable_cfs="false" --cgroups_hierarchy="/sys/fs/cgroup" --cgroups_limit_swap="false" --cgroups_root="mesos" --container_disk_watch_interval="15secs" --containerizers="mesos" --credential="/tmp/Endpoint_SlaveEndpointTest_UnauthorizedRequest_1_hbnh2s/credential" --default_role="*" --disallow_sharing_agent_pid_namespace="false" --disk_watch_interval="1mins" --docker="docker" --docker_kill_orphans="true" --docker_registry="https://registry-1.docker.io" --docker_remove_delay="6hrs" --docker_socket="/var/run/docker.sock" --docker_stop_timeout="0ns" --docker_store_dir="/tmp/Endpoint_SlaveEndpointTest_UnauthorizedRequest_1_hbnh2s/store/docker" --docker_volume_checkpoint_dir="/var/run/mesos/isolators/docker/volume" --enforce_container_disk_quota="false" --executor_registration_timeout="1mins" --executor_reregistration_timeout="2secs" --executor_shutdown_grace_period="5secs" --fetcher_cache_dir="/tmp/Endpoint_SlaveEndpointTest_UnauthorizedRequest_1_hbnh2s/fetch" --fetcher_cache_size="2GB" --frameworks_home="" --gc_delay="1weeks" --gc_disk_headroom="0.1" --hadoop_home="" --help="false" --hostname_lookup="true" --http_command_executor="false" --http_credentials="/tmp/Endpoint_SlaveEndpointTest_UnauthorizedRequest_1_hbnh2s/http_credentials" --http_heartbeat_interval="30secs" --initialize_driver_logging="true" --isolation="posix/cpu,posix/mem" --launcher="posix" --launcher_dir="/tmp/SRC/build/mesos-1.6.0/_build/sub/src" --logbufsecs="0" --logging_level="INFO" --max_completed_executors_per_framework="150" --oversubscribed_resources_interval="15secs" --perf_duration="10secs" --perf_interval="1mins" --port="5051" --qos_correction_interval_min="0ns" --quiet="false" --reconfiguration_policy="equal" --recover="reconnect" --recovery_timeout="15mins" --registration_backoff_factor="10ms" --resources="cpus:2;gpus:0;mem:1024;disk:1024;ports:[31000-32000]" --revocable_cpu_low_priority="true" --runtime_dir="/tmp/Endpoint_SlaveEndpointTest_UnauthorizedRequest_1_hbnh2s" --sandbox_directory="/mnt/mesos/sandbox" --strict="true" --switch_user="true" --systemd_enable_support="true" --systemd_runtime_directory="/run/systemd/system" --version="false" --work_dir="/tmp/Endpoint_SlaveEndpointTest_UnauthorizedRequest_1_2oUUwK" --zk_session_timeout="10secs"
I0328 19:06:49.310451 5585 credentials.hpp:86] Loading credential for authentication from '/tmp/Endpoint_SlaveEndpointTest_UnauthorizedRequest_1_hbnh2s/credential'
I0328 19:06:49.310627 5585 slave.cpp:294] Agent using credential for: test-principal
I0328 19:06:49.310649 5585 credentials.hpp:37] Loading credentials for authentication from '/tmp/Endpoint_SlaveEndpointTest_UnauthorizedRequest_1_hbnh2s/http_credentials'
I0328 19:06:49.310894 5585 http.cpp:959] Creating default 'basic' HTTP authenticator for realm 'mesos-agent-readonly'
I0328 19:06:49.311246 5585 disk_profile_adaptor.cpp:80] Creating default disk profile adaptor module
I0328 19:06:49.312644 5585 slave.cpp:609] Agent resources: [{"name":"cpus","scalar":{"value":2.0},"type":"SCALAR"},{"name":"mem","scalar":{"value":1024.0},"type":"SCALAR"},{"name":"disk","scalar":{"value":1024.0},"type":"SCALAR"},{"name":"ports","ranges":{"range":[{"begin":31000,"end":32000}]},"type":"RANGES"}]
I0328 19:06:49.312858 5585 slave.cpp:617] Agent attributes: [ ]
I0328 19:06:49.312873 5585 slave.cpp:626] Agent hostname: b6910ea8f88b
I0328 19:06:49.313015 5589 task_status_update_manager.cpp:181] Pausing sending task status updates
I0328 19:06:49.314733 5568 state.cpp:66] Recovering state from '/tmp/Endpoint_SlaveEndpointTest_UnauthorizedRequest_1_2oUUwK/meta'
I0328 19:06:49.315030 5586 task_status_update_manager.cpp:207] Recovering task status update manager
I0328 19:06:49.315227 5582 containerizer.cpp:674] Recovering containerizer
I0328 19:06:49.316674 5587 provisioner.cpp:495] Provisioner recovery complete
I0328 19:06:49.317049 5589 slave.cpp:7212] Finished recovery
I0328 19:06:49.320905 5569 process.cpp:3564] Handling HTTP event for process 'slave(952)' with path: '/slave(952)/monitor/statistics.json'
I0328 19:06:49.322510 5567 http.cpp:1099] HTTP GET for /slave(952)/monitor/statistics.json from 172.17.0.2:55092
I0328 19:06:49.322587 5567 http.cpp:936] Authorizing principal 'test-principal' to GET the '/monitor/statistics.json' endpoint
I0328 19:06:49.324136 5566 slave.cpp:919] Agent terminating
[ OK ] Endpoint/SlaveEndpointTest.UnauthorizedRequest/1 (32 ms)
[ RUN ] Endpoint/SlaveEndpointTest.UnauthorizedRequest/2
I0328 19:06:49.337194 5566 containerizer.cpp:304] Using isolation { environment_secret, posix/cpu, posix/mem, filesystem/posix, network/cni }
W0328 19:06:49.337745 5566 backend.cpp:76] Failed to create 'aufs' backend: AufsBackend requires root privileges
W0328 19:06:49.337769 5566 backend.cpp:76] Failed to create 'bind' backend: BindBackend requires root privileges
I0328 19:06:49.337800 5566 provisioner.cpp:299] Using default backend 'copy'
I0328 19:06:49.342217 5583 slave.cpp:261] Mesos agent started on (953)@172.17.0.2:36039
I0328 19:06:49.342242 5583 slave.cpp:262] Flags at startup: --acls="" --appc_simple_discovery_uri_prefix="http://" --appc_store_dir="/tmp/Endpoint_SlaveEndpointTest_UnauthorizedRequest_2_Zui4jl/store/appc" --authenticate_http_readonly="true" --authenticate_http_readwrite="false" --authenticatee="crammd5" --authentication_backoff_factor="1secs" --authorizer="local" --cgroups_cpu_enable_pids_and_tids_count="false" --cgroups_enable_cfs="false" --cgroups_hierarchy="/sys/fs/cgroup" --cgroups_limit_swap="false" --cgroups_root="mesos" --container_disk_watch_interval="15secs" --containerizers="mesos" --credential="/tmp/Endpoint_SlaveEndpointTest_UnauthorizedRequest_2_Zui4jl/credential" --default_role="*" --disallow_sharing_agent_pid_namespace="false" --disk_watch_interval="1mins" --docker="docker" --docker_kill_orphans="true" --docker_registry="https://registry-1.docker.io" --docker_remove_delay="6hrs" --docker_socket="/var/run/docker.sock" --docker_stop_timeout="0ns" --docker_store_dir="/tmp/Endpoint_SlaveEndpointTest_UnauthorizedRequest_2_Zui4jl/store/docker" --docker_volume_checkpoint_dir="/var/run/mesos/isolators/docker/volume" --enforce_container_disk_quota="false" --executor_registration_timeout="1mins" --executor_reregistration_timeout="2secs" --executor_shutdown_grace_period="5secs" --fetcher_cache_dir="/tmp/Endpoint_SlaveEndpointTest_UnauthorizedRequest_2_Zui4jl/fetch" --fetcher_cache_size="2GB" --frameworks_home="" --gc_delay="1weeks" --gc_disk_headroom="0.1" --hadoop_home="" --help="false" --hostname_lookup="true" --http_command_executor="false" --http_credentials="/tmp/Endpoint_SlaveEndpointTest_UnauthorizedRequest_2_Zui4jl/http_credentials" --http_heartbeat_interval="30secs" --initialize_driver_logging="true" --isolation="posix/cpu,posix/mem" --launcher="posix" --launcher_dir="/tmp/SRC/build/mesos-1.6.0/_build/sub/src" --logbufsecs="0" --logging_level="INFO" --max_completed_executors_per_framework="150" --oversubscribed_resources_interval="15secs" --perf_duration="10secs" --perf_interval="1mins" --port="5051" --qos_correction_interval_min="0ns" --quiet="false" --reconfiguration_policy="equal" --recover="reconnect" --recovery_timeout="15mins" --registration_backoff_factor="10ms" --resources="cpus:2;gpus:0;mem:1024;disk:1024;ports:[31000-32000]" --revocable_cpu_low_priority="true" --runtime_dir="/tmp/Endpoint_SlaveEndpointTest_UnauthorizedRequest_2_Zui4jl" --sandbox_directory="/mnt/mesos/sandbox" --strict="true" --switch_user="true" --systemd_enable_support="true" --systemd_runtime_directory="/run/systemd/system" --version="false" --work_dir="/tmp/Endpoint_SlaveEndpointTest_UnauthorizedRequest_2_McTTJC" --zk_session_timeout="10secs"
I0328 19:06:49.342684 5583 credentials.hpp:86] Loading credential for authentication from '/tmp/Endpoint_SlaveEndpointTest_UnauthorizedRequest_2_Zui4jl/credential'
I0328 19:06:49.342875 5583 slave.cpp:294] Agent using credential for: test-principal
I0328 19:06:49.342896 5583 credentials.hpp:37] Loading credentials for authentication from '/tmp/Endpoint_SlaveEndpointTest_UnauthorizedRequest_2_Zui4jl/http_credentials'
I0328 19:06:49.343165 5583 http.cpp:959] Creating default 'basic' HTTP authenticator for realm 'mesos-agent-readonly'
I0328 19:06:49.343492 5583 disk_profile_adaptor.cpp:80] Creating default disk profile adaptor module
I0328 19:06:49.344775 5583 slave.cpp:609] Agent resources: [{"name":"cpus","scalar":{"value":2.0},"type":"SCALAR"},{"name":"mem","scalar":{"value":1024.0},"type":"SCALAR"},{"name":"disk","scalar":{"value":1024.0},"type":"SCALAR"},{"name":"ports","ranges":{"range":[{"begin":31000,"end":32000}]},"type":"RANGES"}]
I0328 19:06:49.344985 5583 slave.cpp:617] Agent attributes: [ ]
I0328 19:06:49.345000 5583 slave.cpp:626] Agent hostname: b6910ea8f88b
I0328 19:06:49.345149 5584 task_status_update_manager.cpp:181] Pausing sending task status updates
I0328 19:06:49.346616 5579 state.cpp:66] Recovering state from '/tmp/Endpoint_SlaveEndpointTest_UnauthorizedRequest_2_McTTJC/meta'
I0328 19:06:49.346915 5570 task_status_update_manager.cpp:207] Recovering task status update manager
I0328 19:06:49.347141 5575 containerizer.cpp:674] Recovering containerizer
I0328 19:06:49.348728 5568 provisioner.cpp:495] Provisioner recovery complete
I0328 19:06:49.349052 5584 slave.cpp:7212] Finished recovery
I0328 19:06:49.352778 5590 process.cpp:3564] Handling HTTP event for process 'slave(953)' with path: '/slave(953)/containers'
I0328 19:06:49.354413 5569 http.cpp:1099] HTTP GET for /slave(953)/containers from 172.17.0.2:55094
I0328 19:06:49.354496 5569 http.cpp:936] Authorizing principal 'test-principal' to GET the '/containers' endpoint
I0328 19:06:49.356086 5567 slave.cpp:919] Agent terminating
[ OK ] Endpoint/SlaveEndpointTest.UnauthorizedRequest/2 (32 ms)
[ RUN ] Endpoint/SlaveEndpointTest.NoAuthorizer/0
I0328 19:06:49.369659 5566 containerizer.cpp:304] Using isolation { environment_secret, posix/cpu, posix/mem, filesystem/posix, network/cni }
W0328 19:06:49.370225 5566 backend.cpp:76] Failed to create 'aufs' backend: AufsBackend requires root privileges
W0328 19:06:49.370256 5566 backend.cpp:76] Failed to create 'bind' backend: BindBackend requires root privileges
I0328 19:06:49.370301 5566 provisioner.cpp:299] Using default backend 'copy'
I0328 19:06:49.372321 5566 cluster.cpp:460] Creating default 'local' authorizer
I0328 19:06:49.374866 5579 slave.cpp:261] Mesos agent started on (954)@172.17.0.2:36039
I0328 19:06:49.374892 5579 slave.cpp:262] Flags at startup: --acls="" --appc_simple_discovery_uri_prefix="http://" --appc_store_dir="/tmp/Endpoint_SlaveEndpointTest_NoAuthorizer_0_LoaWUd/store/appc" --authenticate_http_readonly="true" --authenticate_http_readwrite="false" --authenticatee="crammd5" --authentication_backoff_factor="1secs" --authorizer="local" --cgroups_cpu_enable_pids_and_tids_count="false" --cgroups_enable_cfs="false" --cgroups_hierarchy="/sys/fs/cgroup" --cgroups_limit_swap="false" --cgroups_root="mesos" --container_disk_watch_interval="15secs" --containerizers="mesos" --credential="/tmp/Endpoint_SlaveEndpointTest_NoAuthorizer_0_LoaWUd/credential" --default_role="*" --disallow_sharing_agent_pid_namespace="false" --disk_watch_interval="1mins" --docker="docker" --docker_kill_orphans="true" --docker_registry="https://registry-1.docker.io" --docker_remove_delay="6hrs" --docker_socket="/var/run/docker.sock" --docker_stop_timeout="0ns" --docker_store_dir="/tmp/Endpoint_SlaveEndpointTest_NoAuthorizer_0_LoaWUd/store/docker" --docker_volume_checkpoint_dir="/var/run/mesos/isolators/docker/volume" --enforce_container_disk_quota="false" --executor_registration_timeout="1mins" --executor_reregistration_timeout="2secs" --executor_shutdown_grace_period="5secs" --fetcher_cache_dir="/tmp/Endpoint_SlaveEndpointTest_NoAuthorizer_0_LoaWUd/fetch" --fetcher_cache_size="2GB" --frameworks_home="" --gc_delay="1weeks" --gc_disk_headroom="0.1" --hadoop_home="" --help="false" --hostname_lookup="true" --http_command_executor="false" --http_credentials="/tmp/Endpoint_SlaveEndpointTest_NoAuthorizer_0_LoaWUd/http_credentials" --http_heartbeat_interval="30secs" --initialize_driver_logging="true" --isolation="posix/cpu,posix/mem" --launcher="posix" --launcher_dir="/tmp/SRC/build/mesos-1.6.0/_build/sub/src" --logbufsecs="0" --logging_level="INFO" --max_completed_executors_per_framework="150" --oversubscribed_resources_interval="15secs" --perf_duration="10secs" --perf_interval="1mins" --port="5051" --qos_correction_interval_min="0ns" --quiet="false" --reconfiguration_policy="equal" --recover="reconnect" --recovery_timeout="15mins" --registration_backoff_factor="10ms" --resources="cpus:2;gpus:0;mem:1024;disk:1024;ports:[31000-32000]" --revocable_cpu_low_priority="true" --runtime_dir="/tmp/Endpoint_SlaveEndpointTest_NoAuthorizer_0_LoaWUd" --sandbox_directory="/mnt/mesos/sandbox" --strict="true" --switch_user="true" --systemd_enable_support="true" --systemd_runtime_directory="/run/systemd/system" --version="false" --work_dir="/tmp/Endpoint_SlaveEndpointTest_NoAuthorizer_0_lHXZfv" --zk_session_timeout="10secs"
I0328 19:06:49.375321 5579 credentials.hpp:86] Loading credential for authentication from '/tmp/Endpoint_SlaveEndpointTest_NoAuthorizer_0_LoaWUd/credential'
I0328 19:06:49.375494 5579 slave.cpp:294] Agent using credential for: test-principal
I0328 19:06:49.375515 5579 credentials.hpp:37] Loading credentials for authentication from '/tmp/Endpoint_SlaveEndpointTest_NoAuthorizer_0_LoaWUd/http_credentials'
I0328 19:06:49.375730 5579 http.cpp:959] Creating default 'basic' HTTP authenticator for realm 'mesos-agent-readonly'
I0328 19:06:49.376021 5579 disk_profile_adaptor.cpp:80] Creating default disk profile adaptor module
I0328 19:06:49.377269 5579 slave.cpp:609] Agent resources: [{"name":"cpus","scalar":{"value":2.0},"type":"SCALAR"},{"name":"mem","scalar":{"value":1024.0},"type":"SCALAR"},{"name":"disk","scalar":{"value":1024.0},"type":"SCALAR"},{"name":"ports","ranges":{"range":[{"begin":31000,"end":32000}]},"type":"RANGES"}]
I0328 19:06:49.377472 5579 slave.cpp:617] Agent attributes: [ ]
I0328 19:06:49.377487 5579 slave.cpp:626] Agent hostname: b6910ea8f88b
I0328 19:06:49.377624 5575 task_status_update_manager.cpp:181] Pausing sending task status updates
I0328 19:06:49.379101 5573 state.cpp:66] Recovering state from '/tmp/Endpoint_SlaveEndpointTest_NoAuthorizer_0_lHXZfv/meta'
I0328 19:06:49.379403 5580 task_status_update_manager.cpp:207] Recovering task status update manager
I0328 19:06:49.379597 5571 containerizer.cpp:674] Recovering containerizer
I0328 19:06:49.381111 5583 provisioner.cpp:495] Provisioner recovery complete
I0328 19:06:49.381484 5575 slave.cpp:7212] Finished recovery
I0328 19:06:49.384995 5570 process.cpp:3564] Handling HTTP event for process 'slave(954)' with path: '/slave(954)/monitor/statistics'
I0328 19:06:49.386615 5576 http.cpp:1099] HTTP GET for /slave(954)/monitor/statistics from 172.17.0.2:55096
I0328 19:06:49.386689 5576 http.cpp:936] Authorizing principal 'test-principal' to GET the '/monitor/statistics' endpoint
I0328 19:06:49.389235 5574 slave.cpp:919] Agent terminating
[ OK ] Endpoint/SlaveEndpointTest.NoAuthorizer/0 (33 ms)
[ RUN ] Endpoint/SlaveEndpointTest.NoAuthorizer/1
I0328 19:06:49.401826 5566 containerizer.cpp:304] Using isolation { environment_secret, posix/cpu, posix/mem, filesystem/posix, network/cni }
W0328 19:06:49.402334 5566 backend.cpp:76] Failed to create 'aufs' backend: AufsBackend requires root privileges
W0328 19:06:49.402359 5566 backend.cpp:76] Failed to create 'bind' backend: BindBackend requires root privileges
I0328 19:06:49.402385 5566 provisioner.cpp:299] Using default backend 'copy'
I0328 19:06:49.404279 5566 cluster.cpp:460] Creating default 'local' authorizer
I0328 19:06:49.406560 5588 slave.cpp:261] Mesos agent started on (955)@172.17.0.2:36039
I0328 19:06:49.406590 5588 slave.cpp:262] Flags at startup: --acls="" --appc_simple_discovery_uri_prefix="http://" --appc_store_dir="/tmp/Endpoint_SlaveEndpointTest_NoAuthorizer_1_5n57O6/store/appc" --authenticate_http_readonly="true" --authenticate_http_readwrite="false" --authenticatee="crammd5" --authentication_backoff_factor="1secs" --authorizer="local" --cgroups_cpu_enable_pids_and_tids_count="false" --cgroups_enable_cfs="false" --cgroups_hierarchy="/sys/fs/cgroup" --cgroups_limit_swap="false" --cgroups_root="mesos" --container_disk_watch_interval="15secs" --containerizers="mesos" --credential="/tmp/Endpoint_SlaveEndpointTest_NoAuthorizer_1_5n57O6/credential" --default_role="*" --disallow_sharing_agent_pid_namespace="false" --disk_watch_interval="1mins" --docker="docker" --docker_kill_orphans="true" --docker_registry="https://registry-1.docker.io" --docker_remove_delay="6hrs" --docker_socket="/var/run/docker.sock" --docker_stop_timeout="0ns" --docker_store_dir="/tmp/Endpoint_SlaveEndpointTest_NoAuthorizer_1_5n57O6/store/docker" --docker_volume_checkpoint_dir="/var/run/mesos/isolators/docker/volume" --enforce_container_disk_quota="false" --executor_registration_timeout="1mins" --executor_reregistration_timeout="2secs" --executor_shutdown_grace_period="5secs" --fetcher_cache_dir="/tmp/Endpoint_SlaveEndpointTest_NoAuthorizer_1_5n57O6/fetch" --fetcher_cache_size="2GB" --frameworks_home="" --gc_delay="1weeks" --gc_disk_headroom="0.1" --hadoop_home="" --help="false" --hostname_lookup="true" --http_command_executor="false" --http_credentials="/tmp/Endpoint_SlaveEndpointTest_NoAuthorizer_1_5n57O6/http_credentials" --http_heartbeat_interval="30secs" --initialize_driver_logging="true" --isolation="posix/cpu,posix/mem" --launcher="posix" --launcher_dir="/tmp/SRC/build/mesos-1.6.0/_build/sub/src" --logbufsecs="0" --logging_level="INFO" --max_completed_executors_per_framework="150" --oversubscribed_resources_interval="15secs" --perf_duration="10secs" --perf_interval="1mins" --port="5051" --qos_correction_interval_min="0ns" --quiet="false" --reconfiguration_policy="equal" --recover="reconnect" --recovery_timeout="15mins" --registration_backoff_factor="10ms" --resources="cpus:2;gpus:0;mem:1024;disk:1024;ports:[31000-32000]" --revocable_cpu_low_priority="true" --runtime_dir="/tmp/Endpoint_SlaveEndpointTest_NoAuthorizer_1_5n57O6" --sandbox_directory="/mnt/mesos/sandbox" --strict="true" --switch_user="true" --systemd_enable_support="true" --systemd_runtime_directory="/run/systemd/system" --version="false" --work_dir="/tmp/Endpoint_SlaveEndpointTest_NoAuthorizer_1_gqTm5n" --zk_session_timeout="10secs"
I0328 19:06:49.407167 5588 credentials.hpp:86] Loading credential for authentication from '/tmp/Endpoint_SlaveEndpointTest_NoAuthorizer_1_5n57O6/credential'
I0328 19:06:49.407363 5588 slave.cpp:294] Agent using credential for: test-principal
I0328 19:06:49.407392 5588 credentials.hpp:37] Loading credentials for authentication from '/tmp/Endpoint_SlaveEndpointTest_NoAuthorizer_1_5n57O6/http_credentials'
I0328 19:06:49.407712 5588 http.cpp:959] Creating default 'basic' HTTP authenticator for realm 'mesos-agent-readonly'
I0328 19:06:49.408097 5588 disk_profile_adaptor.cpp:80] Creating default disk profile adaptor module
I0328 19:06:49.409389 5588 slave.cpp:609] Agent resources: [{"name":"cpus","scalar":{"value":2.0},"type":"SCALAR"},{"name":"mem","scalar":{"value":1024.0},"type":"SCALAR"},{"name":"disk","scalar":{"value":1024.0},"type":"SCALAR"},{"name":"ports","ranges":{"range":[{"begin":31000,"end":32000}]},"type":"RANGES"}]
I0328 19:06:49.409590 5588 slave.cpp:617] Agent attributes: [ ]
I0328 19:06:49.409603 5588 slave.cpp:626] Agent hostname: b6910ea8f88b
I0328 19:06:49.409729 5567 task_status_update_manager.cpp:181] Pausing sending task status updates
I0328 19:06:49.411283 5569 state.cpp:66] Recovering state from '/tmp/Endpoint_SlaveEndpointTest_NoAuthorizer_1_gqTm5n/meta'
I0328 19:06:49.411577 5586 task_status_update_manager.cpp:207] Recovering task status update manager
I0328 19:06:49.411826 5582 containerizer.cpp:674] Recovering containerizer
I0328 19:06:49.413434 5583 provisioner.cpp:495] Provisioner recovery complete
I0328 19:06:49.413794 5567 slave.cpp:7212] Finished recovery
I0328 19:06:49.417245 5575 process.cpp:3564] Handling HTTP event for process 'slave(955)' with path: '/slave(955)/monitor/statistics.json'
I0328 19:06:49.418943 5584 http.cpp:1099] HTTP GET for /slave(955)/monitor/statistics.json from 172.17.0.2:55098
I0328 19:06:49.419018 5584 http.cpp:936] Authorizing principal 'test-principal' to GET the '/monitor/statistics.json' endpoint
I0328 19:06:49.421640 5566 slave.cpp:919] Agent terminating
[ OK ] Endpoint/SlaveEndpointTest.NoAuthorizer/1 (32 ms)
[ RUN ] Endpoint/SlaveEndpointTest.NoAuthorizer/2
I0328 19:06:49.433890 5566 containerizer.cpp:304] Using isolation { environment_secret, posix/cpu, posix/mem, filesystem/posix, network/cni }
W0328 19:06:49.434408 5566 backend.cpp:76] Failed to create 'aufs' backend: AufsBackend requires root privileges
W0328 19:06:49.434434 5566 backend.cpp:76] Failed to create 'bind' backend: BindBackend requires root privileges
I0328 19:06:49.434475 5566 provisioner.cpp:299] Using default backend 'copy'
I0328 19:06:49.436440 5566 cluster.cpp:460] Creating default 'local' authorizer
I0328 19:06:49.438637 5568 slave.cpp:261] Mesos agent started on (956)@172.17.0.2:36039
I0328 19:06:49.438658 5568 slave.cpp:262] Flags at startup: --acls="" --appc_simple_discovery_uri_prefix="http://" --appc_store_dir="/tmp/Endpoint_SlaveEndpointTest_NoAuthorizer_2_NLSo2Z/store/appc" --authenticate_http_readonly="true" --authenticate_http_readwrite="false" --authenticatee="crammd5" --authentication_backoff_factor="1secs" --authorizer="local" --cgroups_cpu_enable_pids_and_tids_count="false" --cgroups_enable_cfs="false" --cgroups_hierarchy="/sys/fs/cgroup" --cgroups_limit_swap="false" --cgroups_root="mesos" --container_disk_watch_interval="15secs" --containerizers="mesos" --credential="/tmp/Endpoint_SlaveEndpointTest_NoAuthorizer_2_NLSo2Z/credential" --default_role="*" --disallow_sharing_agent_pid_namespace="false" --disk_watch_interval="1mins" --docker="docker" --docker_kill_orphans="true" --docker_registry="https://registry-1.docker.io" --docker_remove_delay="6hrs" --docker_socket="/var/run/docker.sock" --docker_stop_timeout="0ns" --docker_store_dir="/tmp/Endpoint_SlaveEndpointTest_NoAuthorizer_2_NLSo2Z/store/docker" --docker_volume_checkpoint_dir="/var/run/mesos/isolators/docker/volume" --enforce_container_disk_quota="false" --executor_registration_timeout="1mins" --executor_reregistration_timeout="2secs" --executor_shutdown_grace_period="5secs" --fetcher_cache_dir="/tmp/Endpoint_SlaveEndpointTest_NoAuthorizer_2_NLSo2Z/fetch" --fetcher_cache_size="2GB" --frameworks_home="" --gc_delay="1weeks" --gc_disk_headroom="0.1" --hadoop_home="" --help="false" --hostname_lookup="true" --http_command_executor="false" --http_credentials="/tmp/Endpoint_SlaveEndpointTest_NoAuthorizer_2_NLSo2Z/http_credentials" --http_heartbeat_interval="30secs" --initialize_driver_logging="true" --isolation="posix/cpu,posix/mem" --launcher="posix" --launcher_dir="/tmp/SRC/build/mesos-1.6.0/_build/sub/src" --logbufsecs="0" --logging_level="INFO" --max_completed_executors_per_framework="150" --oversubscribed_resources_interval="15secs" --perf_duration="10secs" --perf_interval="1mins" --port="5051" --qos_correction_interval_min="0ns" --quiet="false" --reconfiguration_policy="equal" --recover="reconnect" --recovery_timeout="15mins" --registration_backoff_factor="10ms" --resources="cpus:2;gpus:0;mem:1024;disk:1024;ports:[31000-32000]" --revocable_cpu_low_priority="true" --runtime_dir="/tmp/Endpoint_SlaveEndpointTest_NoAuthorizer_2_NLSo2Z" --sandbox_directory="/mnt/mesos/sandbox" --strict="true" --switch_user="true" --systemd_enable_support="true" --systemd_runtime_directory="/run/systemd/system" --version="false" --work_dir="/tmp/Endpoint_SlaveEndpointTest_NoAuthorizer_2_oMTSdh" --zk_session_timeout="10secs"
I0328 19:06:49.439057 5568 credentials.hpp:86] Loading credential for authentication from '/tmp/Endpoint_SlaveEndpointTest_NoAuthorizer_2_NLSo2Z/credential'
I0328 19:06:49.439219 5568 slave.cpp:294] Agent using credential for: test-principal
I0328 19:06:49.439249 5568 credentials.hpp:37] Loading credentials for authentication from '/tmp/Endpoint_SlaveEndpointTest_NoAuthorizer_2_NLSo2Z/http_credentials'
I0328 19:06:49.439545 5568 http.cpp:959] Creating default 'basic' HTTP authenticator for realm 'mesos-agent-readonly'
I0328 19:06:49.439882 5568 disk_profile_adaptor.cpp:80] Creating default disk profile adaptor module
I0328 19:06:49.441192 5568 slave.cpp:609] Agent resources: [{"name":"cpus","scalar":{"value":2.0},"type":"SCALAR"},{"name":"mem","scalar":{"value":1024.0},"type":"SCALAR"},{"name":"disk","scalar":{"value":1024.0},"type":"SCALAR"},{"name":"ports","ranges":{"range":[{"begin":31000,"end":32000}]},"type":"RANGES"}]
I0328 19:06:49.441399 5568 slave.cpp:617] Agent attributes: [ ]
I0328 19:06:49.441421 5568 slave.cpp:626] Agent hostname: b6910ea8f88b
I0328 19:06:49.441545 5580 task_status_update_manager.cpp:181] Pausing sending task status updates
I0328 19:06:49.443063 5581 state.cpp:66] Recovering state from '/tmp/Endpoint_SlaveEndpointTest_NoAuthorizer_2_oMTSdh/meta'
I0328 19:06:49.443332 5567 task_status_update_manager.cpp:207] Recovering task status update manager
I0328 19:06:49.443543 5576 containerizer.cpp:674] Recovering containerizer
I0328 19:06:49.445235 5585 provisioner.cpp:495] Provisioner recovery complete
I0328 19:06:49.445602 5580 slave.cpp:7212] Finished recovery
I0328 19:06:49.448932 5578 process.cpp:3564] Handling HTTP event for process 'slave(956)' with path: '/slave(956)/containers'
I0328 19:06:49.450595 5582 http.cpp:1099] HTTP GET for /slave(956)/containers from 172.17.0.2:55100
I0328 19:06:49.450682 5582 http.cpp:936] Authorizing principal 'test-principal' to GET the '/containers' endpoint
I0328 19:06:49.454221 5579 slave.cpp:919] Agent terminating
[ OK ] Endpoint/SlaveEndpointTest.NoAuthorizer/2 (33 ms)
[----------] 9 tests from Endpoint/SlaveEndpointTest (293 ms total)
[----------] 2 tests from ContainerizerType/DefaultContainerDNSFlagTest
[ RUN ] ContainerizerType/DefaultContainerDNSFlagTest.ValidateFlag/0
[ OK ] ContainerizerType/DefaultContainerDNSFlagTest.ValidateFlag/0 (10 ms)
[ RUN ] ContainerizerType/DefaultContainerDNSFlagTest.ValidateFlag/1
[ OK ] ContainerizerType/DefaultContainerDNSFlagTest.ValidateFlag/1 (9 ms)
[----------] 2 tests from ContainerizerType/DefaultContainerDNSFlagTest (19 ms total)
[----------] Global test environment tear-down
[==========] 1889 tests from 194 test cases ran. (539547 ms total)
[ PASSED ] 1888 tests.
[ FAILED ] 1 test, listed below:
[ FAILED ] ExamplesTest.PythonFramework
1 FAILED TEST
YOU HAVE 22 DISABLED TESTS
I0328 19:06:49.536592 5591 process.cpp:929] Stopped the socket accept loop
Makefile:14619: recipe for target 'check-local' failed
make[4]: *** [check-local] Error 1
make[4]: Leaving directory '/tmp/SRC/build/mesos-1.6.0/_build/sub/src'
Makefile:13752: recipe for target 'check-am' failed
make[3]: *** [check-am] Error 2
make[3]: Leaving directory '/tmp/SRC/build/mesos-1.6.0/_build/sub/src'
Makefile:13756: recipe for target 'check' failed
make[2]: *** [check] Error 2
make[2]: Leaving directory '/tmp/SRC/build/mesos-1.6.0/_build/sub/src'
Makefile:774: recipe for target 'check-recursive' failed
make[1]: *** [check-recursive] Error 1
make[1]: Leaving directory '/tmp/SRC/build/mesos-1.6.0/_build/sub'
Makefile:980: recipe for target 'distcheck' failed
make: *** [distcheck] Error 1
Untagged: mesos/mesos-build:ubuntu-16.04
Untagged: mesos/mesos-build@sha256:3643a2cc107ff04ee2d7628a48cff8bee6186b98bcaa5ce36f685d28d8b04dae
Deleted: sha256:df13eb8a4c4b15c8e09329265603b7fcacc7753bc731057e91c06554acab5a10
Deleted: sha256:f50f81f71ec4d5b88ef535ef34e07a1abfe00cec71bd4518a0bee2348c0c6229
Deleted: sha256:334c2f430d63071d6f077369f301016b59d5421b28a6df435c63aa2209f480e7
Deleted: sha256:7a41f53b59bb61bde6d3dc9a41c4dd87e6ff5141b36da06529c2cb32e6733d63
Deleted: sha256:4b569c802f795bb918a504e6ce315cddecfb633aee338ee535e7cfbe5c2801a3
Deleted: sha256:77e6ddba346d8ad1e436256f6373dede5af4002006981b7d4116c561c759cefa
Deleted: sha256:8db758ab2fdb54da0aec53aeac876934337e6170f5a8c8872b3d4171e3d465b7
Deleted: sha256:a7fc6b405fe8ef71edfa6163d1dc9f1cb1df426049eefaa7d388e9df21a061ad
Deleted: sha256:5a3e35538f7f2e2727c8ac92f08c30002b9e8a77737de0dab91244344d59f69b
Deleted: sha256:ff986b10a018b48074e6d3a68b39aad8ccc002cdad912d4148c0f92b3729323e
Build step 'Execute shell' marked build as failure
Jenkins build is back to normal : Mesos-Reviewbot #22038
Posted by Apache Jenkins Server <je...@builds.apache.org>.
See <https://builds.apache.org/job/Mesos-Reviewbot/22038/display/redirect>