You are viewing a plain text version of this content. The canonical link for it is here.
Posted to dev@kafka.apache.org by Apache Jenkins Server <je...@builds.apache.org> on 2016/01/18 06:38:41 UTC
Build failed in Jenkins: kafka-trunk-jdk7 #964
See <https://builds.apache.org/job/kafka-trunk-jdk7/964/changes>
Changes:
[junrao] KAFKA-3085; BrokerChangeListener computes inconsistent live/dead broker
------------------------------------------
Started by an SCM change
[EnvInject] - Loading node environment variables.
Building remotely on H11 (Ubuntu ubuntu) in workspace <https://builds.apache.org/job/kafka-trunk-jdk7/ws/>
> git rev-parse --is-inside-work-tree # timeout=10
Fetching changes from the remote Git repository
> git config remote.origin.url https://git-wip-us.apache.org/repos/asf/kafka.git # timeout=10
Fetching upstream changes from https://git-wip-us.apache.org/repos/asf/kafka.git
> git --version # timeout=10
> git -c core.askpass=true fetch --tags --progress https://git-wip-us.apache.org/repos/asf/kafka.git +refs/heads/*:refs/remotes/origin/*
> git rev-parse refs/remotes/origin/trunk^{commit} # timeout=10
> git rev-parse refs/remotes/origin/origin/trunk^{commit} # timeout=10
Checking out Revision 60a5a523b6f7e5151d8cdc835845cfc4d2e72b52 (refs/remotes/origin/trunk)
> git config core.sparsecheckout # timeout=10
> git checkout -f 60a5a523b6f7e5151d8cdc835845cfc4d2e72b52
> git rev-list a071e3554bf626182557dfaca491afebe9c17020 # timeout=10
Setting GRADLE_2_4_RC_2_HOME=/home/jenkins/jenkins-slave/tools/hudson.plugins.gradle.GradleInstallation/Gradle_2.4-rc-2
Setting JDK_1_7U51_HOME=/home/jenkins/jenkins-slave/tools/hudson.model.JDK/jdk-1.7u51
[kafka-trunk-jdk7] $ /bin/bash -xe /tmp/hudson4971995385676276005.sh
+ /home/jenkins/jenkins-slave/tools/hudson.plugins.gradle.GradleInstallation/Gradle_2.4-rc-2/bin/gradle
To honour the JVM settings for this build a new JVM will be forked. Please consider using the daemon: http://gradle.org/docs/2.4-rc-2/userguide/gradle_daemon.html.
Building project 'core' with Scala version 2.10.6
:downloadWrapper
BUILD SUCCESSFUL
Total time: 10.803 secs
Setting GRADLE_2_4_RC_2_HOME=/home/jenkins/jenkins-slave/tools/hudson.plugins.gradle.GradleInstallation/Gradle_2.4-rc-2
Setting JDK_1_7U51_HOME=/home/jenkins/jenkins-slave/tools/hudson.model.JDK/jdk-1.7u51
[kafka-trunk-jdk7] $ /bin/bash -xe /tmp/hudson3884579114077276933.sh
+ export GRADLE_OPTS=-Xmx1024m
+ GRADLE_OPTS=-Xmx1024m
+ ./gradlew -Dorg.gradle.project.maxParallelForks=1 clean jarAll testAll
To honour the JVM settings for this build a new JVM will be forked. Please consider using the daemon: https://docs.gradle.org/2.10/userguide/gradle_daemon.html.
Building project 'core' with Scala version 2.10.6
:clean UP-TO-DATE
:clients:clean UP-TO-DATE
:connect:clean UP-TO-DATE
:core:clean UP-TO-DATE
:examples:clean UP-TO-DATE
:log4j-appender:clean UP-TO-DATE
:streams:clean UP-TO-DATE
:tools:clean UP-TO-DATE
:connect:api:clean UP-TO-DATE
:connect:file:clean UP-TO-DATE
:connect:json:clean UP-TO-DATE
:connect:runtime:clean UP-TO-DATE
:jar_core_2_10
Building project 'core' with Scala version 2.10.6
:kafka-trunk-jdk7:clients:compileJava
:jar_core_2_10 FAILED
FAILURE: Build failed with an exception.
* What went wrong:
Failed to capture snapshot of input files for task 'compileJava' during up-to-date check. See stacktrace for details.
> Could not add entry '/home/jenkins/.gradle/caches/modules-2/files-2.1/net.jpountz.lz4/lz4/1.3.0/c708bb2590c0652a642236ef45d9f99ff842a2ce/lz4-1.3.0.jar' to cache fileHashes.bin (<https://builds.apache.org/job/kafka-trunk-jdk7/ws/.gradle/2.10/taskArtifacts/fileHashes.bin).>
* Try:
Run with --stacktrace option to get the stack trace. Run with --info or --debug option to get more log output.
BUILD FAILED
Total time: 14.043 secs
Build step 'Execute shell' marked build as failure
Recording test results
Setting GRADLE_2_4_RC_2_HOME=/home/jenkins/jenkins-slave/tools/hudson.plugins.gradle.GradleInstallation/Gradle_2.4-rc-2
Setting JDK_1_7U51_HOME=/home/jenkins/jenkins-slave/tools/hudson.model.JDK/jdk-1.7u51
ERROR: Publisher 'Publish JUnit test result report' failed: No test report files were found. Configuration error?
Setting GRADLE_2_4_RC_2_HOME=/home/jenkins/jenkins-slave/tools/hudson.plugins.gradle.GradleInstallation/Gradle_2.4-rc-2
Setting JDK_1_7U51_HOME=/home/jenkins/jenkins-slave/tools/hudson.model.JDK/jdk-1.7u51
Jenkins build is back to normal : kafka-trunk-jdk7 #972
Posted by Apache Jenkins Server <je...@builds.apache.org>.
See <https://builds.apache.org/job/kafka-trunk-jdk7/972/changes>
Build failed in Jenkins: kafka-trunk-jdk7 #971
Posted by Apache Jenkins Server <je...@builds.apache.org>.
See <https://builds.apache.org/job/kafka-trunk-jdk7/971/changes>
Changes:
[wangguoz] MINOR: Fix javadoc for `PartitionInfo.leader()`
[wangguoz] MINOR: Avoid unnecessary `ConcurrentHashMap.get`
------------------------------------------
[...truncated 7016 lines...]
org.apache.kafka.connect.runtime.rest.resources.ConnectorsResourceTest > testGetConnectorConfigConnectorNotFound PASSED
org.apache.kafka.connect.runtime.rest.resources.ConnectorsResourceTest > testGetConnectorTaskConfigs PASSED
org.apache.kafka.connect.runtime.rest.resources.ConnectorsResourceTest > testGetConnectorTaskConfigsConnectorNotFound PASSED
org.apache.kafka.connect.runtime.rest.resources.ConnectorsResourceTest > testPutConnectorTaskConfigs PASSED
org.apache.kafka.connect.runtime.rest.resources.ConnectorsResourceTest > testPutConnectorTaskConfigsConnectorNotFound PASSED
org.apache.kafka.connect.util.ShutdownableThreadTest > testGracefulShutdown PASSED
org.apache.kafka.connect.util.ShutdownableThreadTest > testForcibleShutdown PASSED
org.apache.kafka.connect.util.KafkaBasedLogTest > testStartStop PASSED
org.apache.kafka.connect.util.KafkaBasedLogTest > testReloadOnStart PASSED
org.apache.kafka.connect.util.KafkaBasedLogTest > testSendAndReadToEnd PASSED
org.apache.kafka.connect.util.KafkaBasedLogTest > testConsumerError PASSED
org.apache.kafka.connect.util.KafkaBasedLogTest > testProducerError PASSED
org.apache.kafka.connect.storage.KafkaOffsetBackingStoreTest > testStartStop PASSED
org.apache.kafka.connect.storage.KafkaOffsetBackingStoreTest > testReloadOnStart PASSED
org.apache.kafka.connect.storage.KafkaOffsetBackingStoreTest > testMissingTopic PASSED
org.apache.kafka.connect.storage.KafkaOffsetBackingStoreTest > testSetFailure PASSED
org.apache.kafka.connect.storage.KafkaOffsetBackingStoreTest > testGetSet PASSED
org.apache.kafka.connect.storage.KafkaConfigStorageTest > testPutConnectorConfig PASSED
org.apache.kafka.connect.storage.KafkaConfigStorageTest > testPutTaskConfigs PASSED
org.apache.kafka.connect.storage.KafkaConfigStorageTest > testStartStop PASSED
org.apache.kafka.connect.storage.KafkaConfigStorageTest > testPutTaskConfigsDoesNotResolveAllInconsistencies PASSED
org.apache.kafka.connect.storage.KafkaConfigStorageTest > testRestore PASSED
org.apache.kafka.connect.storage.OffsetStorageWriterTest > testWriteNullKeyFlush PASSED
org.apache.kafka.connect.storage.OffsetStorageWriterTest > testNoOffsetsToFlush PASSED
org.apache.kafka.connect.storage.OffsetStorageWriterTest > testFlushFailureReplacesOffsets PASSED
org.apache.kafka.connect.storage.OffsetStorageWriterTest > testAlreadyFlushing PASSED
org.apache.kafka.connect.storage.OffsetStorageWriterTest > testCancelBeforeAwaitFlush PASSED
org.apache.kafka.connect.storage.OffsetStorageWriterTest > testCancelAfterAwaitFlush PASSED
org.apache.kafka.connect.storage.OffsetStorageWriterTest > testWriteFlush PASSED
org.apache.kafka.connect.storage.OffsetStorageWriterTest > testWriteNullValueFlush PASSED
org.apache.kafka.connect.storage.FileOffsetBackingStoreTest > testSaveRestore PASSED
org.apache.kafka.connect.storage.FileOffsetBackingStoreTest > testGetSet PASSED
:testAll
BUILD SUCCESSFUL
Total time: 1 hrs 7 mins 38.647 secs
+ ./gradlew --stacktrace docsJarAll
To honour the JVM settings for this build a new JVM will be forked. Please consider using the daemon: https://docs.gradle.org/2.10/userguide/gradle_daemon.html.
Building project 'core' with Scala version 2.10.6
:docsJar_2_10
Building project 'core' with Scala version 2.10.6
:kafka-trunk-jdk7:clients:compileJava UP-TO-DATE
:kafka-trunk-jdk7:clients:processResources UP-TO-DATE
:kafka-trunk-jdk7:clients:classes UP-TO-DATE
:kafka-trunk-jdk7:clients:determineCommitId UP-TO-DATE
:kafka-trunk-jdk7:clients:createVersionFile
:kafka-trunk-jdk7:clients:jar UP-TO-DATE
:kafka-trunk-jdk7:clients:javadoc
:docsJar_2_10 FAILED
FAILURE: Build failed with an exception.
* What went wrong:
Could not add entry '<https://builds.apache.org/job/kafka-trunk-jdk7/ws/clients/build/docs/javadoc/deprecated-list.html'> to cache fileHashes.bin (<https://builds.apache.org/job/kafka-trunk-jdk7/ws/.gradle/2.10/taskArtifacts/fileHashes.bin).>
> Corrupted FreeListBlock 663459 found in cache '<https://builds.apache.org/job/kafka-trunk-jdk7/ws/.gradle/2.10/taskArtifacts/fileHashes.bin'.>
* Try:
Run with --info or --debug option to get more log output.
* Exception is:
org.gradle.api.UncheckedIOException: Could not add entry '<https://builds.apache.org/job/kafka-trunk-jdk7/ws/clients/build/docs/javadoc/deprecated-list.html'> to cache fileHashes.bin (<https://builds.apache.org/job/kafka-trunk-jdk7/ws/.gradle/2.10/taskArtifacts/fileHashes.bin).>
at org.gradle.cache.internal.btree.BTreePersistentIndexedCache.put(BTreePersistentIndexedCache.java:155)
at org.gradle.cache.internal.DefaultMultiProcessSafePersistentIndexedCache$2.run(DefaultMultiProcessSafePersistentIndexedCache.java:51)
at org.gradle.cache.internal.DefaultFileLockManager$DefaultFileLock.doWriteAction(DefaultFileLockManager.java:173)
at org.gradle.cache.internal.DefaultFileLockManager$DefaultFileLock.writeFile(DefaultFileLockManager.java:163)
at org.gradle.cache.internal.DefaultCacheAccess$UnitOfWorkFileAccess.writeFile(DefaultCacheAccess.java:404)
at org.gradle.cache.internal.DefaultMultiProcessSafePersistentIndexedCache.put(DefaultMultiProcessSafePersistentIndexedCache.java:49)
at org.gradle.api.internal.changedetection.state.InMemoryTaskArtifactCache$1.put(InMemoryTaskArtifactCache.java:98)
at org.gradle.api.internal.changedetection.state.CachingFileSnapshotter.snapshot(CachingFileSnapshotter.java:59)
at org.gradle.api.internal.changedetection.state.CachingFileSnapshotter.snapshot(CachingFileSnapshotter.java:46)
at org.gradle.api.internal.changedetection.state.CachingFileSnapshotter.snapshot(CachingFileSnapshotter.java:29)
at org.gradle.api.internal.changedetection.state.DefaultFileCollectionSnapshotter$1.run(DefaultFileCollectionSnapshotter.java:70)
at org.gradle.internal.Factories$1.create(Factories.java:22)
at org.gradle.cache.internal.DefaultCacheAccess.useCache(DefaultCacheAccess.java:192)
at org.gradle.cache.internal.DefaultCacheAccess.useCache(DefaultCacheAccess.java:175)
at org.gradle.cache.internal.DefaultPersistentDirectoryStore.useCache(DefaultPersistentDirectoryStore.java:106)
at org.gradle.cache.internal.DefaultCacheFactory$ReferenceTrackingCache.useCache(DefaultCacheFactory.java:187)
at org.gradle.api.internal.changedetection.state.DefaultTaskArtifactStateCacheAccess.useCache(DefaultTaskArtifactStateCacheAccess.java:60)
at org.gradle.api.internal.changedetection.state.DefaultFileCollectionSnapshotter.snapshot(DefaultFileCollectionSnapshotter.java:62)
at org.gradle.api.internal.changedetection.state.OutputFilesCollectionSnapshotter.snapshot(OutputFilesCollectionSnapshotter.java:93)
at org.gradle.api.internal.changedetection.state.OutputFilesCollectionSnapshotter.snapshot(OutputFilesCollectionSnapshotter.java:44)
at org.gradle.api.internal.changedetection.rules.OutputFilesStateChangeRule$1.snapshotAfterTask(OutputFilesStateChangeRule.java:79)
at org.gradle.api.internal.changedetection.rules.CachingTaskStateChanges.snapshotAfterTask(CachingTaskStateChanges.java:84)
at org.gradle.api.internal.changedetection.rules.SummaryTaskStateChanges.snapshotAfterTask(SummaryTaskStateChanges.java:73)
at org.gradle.api.internal.changedetection.changes.DefaultTaskArtifactStateRepository$TaskArtifactStateImpl.afterTask(DefaultTaskArtifactStateRepository.java:123)
at org.gradle.api.internal.tasks.execution.SkipUpToDateTaskExecuter.execute(SkipUpToDateTaskExecuter.java:66)
at org.gradle.api.internal.tasks.execution.ValidatingTaskExecuter.execute(ValidatingTaskExecuter.java:58)
at org.gradle.api.internal.tasks.execution.SkipEmptySourceFilesTaskExecuter.execute(SkipEmptySourceFilesTaskExecuter.java:52)
at org.gradle.api.internal.tasks.execution.SkipTaskWithNoActionsExecuter.execute(SkipTaskWithNoActionsExecuter.java:52)
at org.gradle.api.internal.tasks.execution.SkipOnlyIfTaskExecuter.execute(SkipOnlyIfTaskExecuter.java:53)
at org.gradle.api.internal.tasks.execution.ExecuteAtMostOnceTaskExecuter.execute(ExecuteAtMostOnceTaskExecuter.java:43)
at org.gradle.execution.taskgraph.DefaultTaskGraphExecuter$EventFiringTaskWorker.execute(DefaultTaskGraphExecuter.java:203)
at org.gradle.execution.taskgraph.DefaultTaskGraphExecuter$EventFiringTaskWorker.execute(DefaultTaskGraphExecuter.java:185)
at org.gradle.execution.taskgraph.AbstractTaskPlanExecutor$TaskExecutorWorker.processTask(AbstractTaskPlanExecutor.java:66)
at org.gradle.execution.taskgraph.AbstractTaskPlanExecutor$TaskExecutorWorker.run(AbstractTaskPlanExecutor.java:50)
at org.gradle.execution.taskgraph.DefaultTaskPlanExecutor.process(DefaultTaskPlanExecutor.java:25)
at org.gradle.execution.taskgraph.DefaultTaskGraphExecuter.execute(DefaultTaskGraphExecuter.java:110)
at org.gradle.execution.SelectedTaskExecutionAction.execute(SelectedTaskExecutionAction.java:37)
at org.gradle.execution.DefaultBuildExecuter.execute(DefaultBuildExecuter.java:37)
at org.gradle.execution.DefaultBuildExecuter.access$000(DefaultBuildExecuter.java:23)
at org.gradle.execution.DefaultBuildExecuter$1.proceed(DefaultBuildExecuter.java:43)
at org.gradle.execution.DryRunBuildExecutionAction.execute(DryRunBuildExecutionAction.java:32)
at org.gradle.execution.DefaultBuildExecuter.execute(DefaultBuildExecuter.java:37)
at org.gradle.execution.DefaultBuildExecuter.execute(DefaultBuildExecuter.java:30)
at org.gradle.initialization.DefaultGradleLauncher$4.run(DefaultGradleLauncher.java:154)
at org.gradle.internal.Factories$1.create(Factories.java:22)
at org.gradle.internal.progress.DefaultBuildOperationExecutor.run(DefaultBuildOperationExecutor.java:90)
at org.gradle.internal.progress.DefaultBuildOperationExecutor.run(DefaultBuildOperationExecutor.java:52)
at org.gradle.initialization.DefaultGradleLauncher.doBuildStages(DefaultGradleLauncher.java:151)
at org.gradle.initialization.DefaultGradleLauncher.access$200(DefaultGradleLauncher.java:32)
at org.gradle.initialization.DefaultGradleLauncher$1.create(DefaultGradleLauncher.java:99)
at org.gradle.initialization.DefaultGradleLauncher$1.create(DefaultGradleLauncher.java:93)
at org.gradle.internal.progress.DefaultBuildOperationExecutor.run(DefaultBuildOperationExecutor.java:90)
at org.gradle.internal.progress.DefaultBuildOperationExecutor.run(DefaultBuildOperationExecutor.java:62)
at org.gradle.initialization.DefaultGradleLauncher.doBuild(DefaultGradleLauncher.java:93)
at org.gradle.initialization.DefaultGradleLauncher.run(DefaultGradleLauncher.java:82)
at org.gradle.api.tasks.GradleBuild.build(GradleBuild.java:117)
at org.gradle.internal.reflect.JavaMethod.invoke(JavaMethod.java:75)
at org.gradle.api.internal.project.taskfactory.AnnotationProcessingTaskFactory$StandardTaskAction.doExecute(AnnotationProcessingTaskFactory.java:227)
at org.gradle.api.internal.project.taskfactory.AnnotationProcessingTaskFactory$StandardTaskAction.execute(AnnotationProcessingTaskFactory.java:220)
at org.gradle.api.internal.project.taskfactory.AnnotationProcessingTaskFactory$StandardTaskAction.execute(AnnotationProcessingTaskFactory.java:209)
at org.gradle.api.internal.AbstractTask$TaskActionWrapper.execute(AbstractTask.java:585)
at org.gradle.api.internal.AbstractTask$TaskActionWrapper.execute(AbstractTask.java:568)
at org.gradle.api.internal.tasks.execution.ExecuteActionsTaskExecuter.executeAction(ExecuteActionsTaskExecuter.java:80)
at org.gradle.api.internal.tasks.execution.ExecuteActionsTaskExecuter.executeActions(ExecuteActionsTaskExecuter.java:61)
at org.gradle.api.internal.tasks.execution.ExecuteActionsTaskExecuter.execute(ExecuteActionsTaskExecuter.java:46)
at org.gradle.api.internal.tasks.execution.PostExecutionAnalysisTaskExecuter.execute(PostExecutionAnalysisTaskExecuter.java:35)
at org.gradle.api.internal.tasks.execution.SkipUpToDateTaskExecuter.execute(SkipUpToDateTaskExecuter.java:64)
at org.gradle.api.internal.tasks.execution.ValidatingTaskExecuter.execute(ValidatingTaskExecuter.java:58)
at org.gradle.api.internal.tasks.execution.SkipEmptySourceFilesTaskExecuter.execute(SkipEmptySourceFilesTaskExecuter.java:52)
at org.gradle.api.internal.tasks.execution.SkipTaskWithNoActionsExecuter.execute(SkipTaskWithNoActionsExecuter.java:52)
at org.gradle.api.internal.tasks.execution.SkipOnlyIfTaskExecuter.execute(SkipOnlyIfTaskExecuter.java:53)
at org.gradle.api.internal.tasks.execution.ExecuteAtMostOnceTaskExecuter.execute(ExecuteAtMostOnceTaskExecuter.java:43)
at org.gradle.execution.taskgraph.DefaultTaskGraphExecuter$EventFiringTaskWorker.execute(DefaultTaskGraphExecuter.java:203)
at org.gradle.execution.taskgraph.DefaultTaskGraphExecuter$EventFiringTaskWorker.execute(DefaultTaskGraphExecuter.java:185)
at org.gradle.execution.taskgraph.AbstractTaskPlanExecutor$TaskExecutorWorker.processTask(AbstractTaskPlanExecutor.java:66)
at org.gradle.execution.taskgraph.AbstractTaskPlanExecutor$TaskExecutorWorker.run(AbstractTaskPlanExecutor.java:50)
at org.gradle.execution.taskgraph.DefaultTaskPlanExecutor.process(DefaultTaskPlanExecutor.java:25)
at org.gradle.execution.taskgraph.DefaultTaskGraphExecuter.execute(DefaultTaskGraphExecuter.java:110)
at org.gradle.execution.SelectedTaskExecutionAction.execute(SelectedTaskExecutionAction.java:37)
at org.gradle.execution.DefaultBuildExecuter.execute(DefaultBuildExecuter.java:37)
at org.gradle.execution.DefaultBuildExecuter.access$000(DefaultBuildExecuter.java:23)
at org.gradle.execution.DefaultBuildExecuter$1.proceed(DefaultBuildExecuter.java:43)
at org.gradle.execution.DryRunBuildExecutionAction.execute(DryRunBuildExecutionAction.java:32)
at org.gradle.execution.DefaultBuildExecuter.execute(DefaultBuildExecuter.java:37)
at org.gradle.execution.DefaultBuildExecuter.execute(DefaultBuildExecuter.java:30)
at org.gradle.initialization.DefaultGradleLauncher$4.run(DefaultGradleLauncher.java:154)
at org.gradle.internal.Factories$1.create(Factories.java:22)
at org.gradle.internal.progress.DefaultBuildOperationExecutor.run(DefaultBuildOperationExecutor.java:90)
at org.gradle.internal.progress.DefaultBuildOperationExecutor.run(DefaultBuildOperationExecutor.java:52)
at org.gradle.initialization.DefaultGradleLauncher.doBuildStages(DefaultGradleLauncher.java:151)
at org.gradle.initialization.DefaultGradleLauncher.access$200(DefaultGradleLauncher.java:32)
at org.gradle.initialization.DefaultGradleLauncher$1.create(DefaultGradleLauncher.java:99)
at org.gradle.initialization.DefaultGradleLauncher$1.create(DefaultGradleLauncher.java:93)
at org.gradle.internal.progress.DefaultBuildOperationExecutor.run(DefaultBuildOperationExecutor.java:90)
at org.gradle.internal.progress.DefaultBuildOperationExecutor.run(DefaultBuildOperationExecutor.java:62)
at org.gradle.initialization.DefaultGradleLauncher.doBuild(DefaultGradleLauncher.java:93)
at org.gradle.initialization.DefaultGradleLauncher.run(DefaultGradleLauncher.java:82)
at org.gradle.launcher.exec.InProcessBuildActionExecuter$DefaultBuildController.run(InProcessBuildActionExecuter.java:94)
at org.gradle.tooling.internal.provider.ExecuteBuildActionRunner.run(ExecuteBuildActionRunner.java:28)
at org.gradle.launcher.exec.ChainingBuildActionRunner.run(ChainingBuildActionRunner.java:35)
at org.gradle.launcher.exec.InProcessBuildActionExecuter.execute(InProcessBuildActionExecuter.java:43)
at org.gradle.launcher.exec.InProcessBuildActionExecuter.execute(InProcessBuildActionExecuter.java:28)
at org.gradle.launcher.exec.ContinuousBuildActionExecuter.execute(ContinuousBuildActionExecuter.java:78)
at org.gradle.launcher.exec.ContinuousBuildActionExecuter.execute(ContinuousBuildActionExecuter.java:48)
at org.gradle.launcher.daemon.server.exec.ExecuteBuild.doBuild(ExecuteBuild.java:52)
at org.gradle.launcher.daemon.server.exec.BuildCommandOnly.execute(BuildCommandOnly.java:36)
at org.gradle.launcher.daemon.server.api.DaemonCommandExecution.proceed(DaemonCommandExecution.java:120)
at org.gradle.launcher.daemon.server.exec.WatchForDisconnection.execute(WatchForDisconnection.java:37)
at org.gradle.launcher.daemon.server.api.DaemonCommandExecution.proceed(DaemonCommandExecution.java:120)
at org.gradle.launcher.daemon.server.exec.ResetDeprecationLogger.execute(ResetDeprecationLogger.java:26)
at org.gradle.launcher.daemon.server.api.DaemonCommandExecution.proceed(DaemonCommandExecution.java:120)
at org.gradle.launcher.daemon.server.exec.RequestStopIfSingleUsedDaemon.execute(RequestStopIfSingleUsedDaemon.java:34)
at org.gradle.launcher.daemon.server.api.DaemonCommandExecution.proceed(DaemonCommandExecution.java:120)
at org.gradle.launcher.daemon.server.exec.ForwardClientInput$2.call(ForwardClientInput.java:74)
at org.gradle.launcher.daemon.server.exec.ForwardClientInput$2.call(ForwardClientInput.java:72)
at org.gradle.util.Swapper.swap(Swapper.java:38)
at org.gradle.launcher.daemon.server.exec.ForwardClientInput.execute(ForwardClientInput.java:72)
at org.gradle.launcher.daemon.server.api.DaemonCommandExecution.proceed(DaemonCommandExecution.java:120)
at org.gradle.launcher.daemon.server.health.DaemonHealthTracker.execute(DaemonHealthTracker.java:40)
at org.gradle.launcher.daemon.server.api.DaemonCommandExecution.proceed(DaemonCommandExecution.java:120)
at org.gradle.launcher.daemon.server.exec.LogToClient.doBuild(LogToClient.java:66)
at org.gradle.launcher.daemon.server.exec.BuildCommandOnly.execute(BuildCommandOnly.java:36)
at org.gradle.launcher.daemon.server.api.DaemonCommandExecution.proceed(DaemonCommandExecution.java:120)
at org.gradle.launcher.daemon.server.exec.EstablishBuildEnvironment.doBuild(EstablishBuildEnvironment.java:72)
at org.gradle.launcher.daemon.server.exec.BuildCommandOnly.execute(BuildCommandOnly.java:36)
at org.gradle.launcher.daemon.server.api.DaemonCommandExecution.proceed(DaemonCommandExecution.java:120)
at org.gradle.launcher.daemon.server.health.HintGCAfterBuild.execute(HintGCAfterBuild.java:41)
at org.gradle.launcher.daemon.server.api.DaemonCommandExecution.proceed(DaemonCommandExecution.java:120)
at org.gradle.launcher.daemon.server.exec.StartBuildOrRespondWithBusy$1.run(StartBuildOrRespondWithBusy.java:50)
at org.gradle.launcher.daemon.server.DaemonStateCoordinator$1.run(DaemonStateCoordinator.java:246)
at org.gradle.internal.concurrent.ExecutorPolicy$CatchAndRecordFailures.onExecute(ExecutorPolicy.java:54)
at org.gradle.internal.concurrent.StoppableExecutorImpl$1.run(StoppableExecutorImpl.java:40)
Caused by: org.gradle.cache.internal.btree.CorruptedCacheException: Corrupted FreeListBlock 663459 found in cache '<https://builds.apache.org/job/kafka-trunk-jdk7/ws/.gradle/2.10/taskArtifacts/fileHashes.bin'.>
at org.gradle.cache.internal.btree.FileBackedBlockStore$BlockImpl.blockCorruptedException(FileBackedBlockStore.java:247)
at org.gradle.cache.internal.btree.FileBackedBlockStore$BlockImpl.read(FileBackedBlockStore.java:210)
at org.gradle.cache.internal.btree.FileBackedBlockStore.read(FileBackedBlockStore.java:98)
at org.gradle.cache.internal.btree.CachingBlockStore.read(CachingBlockStore.java:84)
at org.gradle.cache.internal.btree.FreeListBlockStore.read(FreeListBlockStore.java:78)
at org.gradle.cache.internal.btree.FreeListBlockStore$FreeListBlock.getNextBlock(FreeListBlockStore.java:204)
at org.gradle.cache.internal.btree.FreeListBlockStore$FreeListBlock.alloc(FreeListBlockStore.java:221)
at org.gradle.cache.internal.btree.FreeListBlockStore.attach(FreeListBlockStore.java:88)
at org.gradle.cache.internal.btree.FreeListBlockStore.write(FreeListBlockStore.java:82)
at org.gradle.cache.internal.btree.StateCheckBlockStore.write(StateCheckBlockStore.java:66)
at org.gradle.cache.internal.btree.BTreePersistentIndexedCache.put(BTreePersistentIndexedCache.java:150)
... 131 more
BUILD FAILED
Total time: 27.179 secs
Build step 'Execute shell' marked build as failure
Recording test results
Setting GRADLE_2_4_RC_2_HOME=/jenkins/tools/hudson.plugins.gradle.GradleInstallation/Gradle_2.4-rc-2
Setting JDK_1_7U51_HOME=/jenkins/tools/hudson.model.JDK/jdk-1.7u51
Setting GRADLE_2_4_RC_2_HOME=/jenkins/tools/hudson.plugins.gradle.GradleInstallation/Gradle_2.4-rc-2
Setting JDK_1_7U51_HOME=/jenkins/tools/hudson.model.JDK/jdk-1.7u51
Build failed in Jenkins: kafka-trunk-jdk7 #970
Posted by Apache Jenkins Server <je...@builds.apache.org>.
See <https://builds.apache.org/job/kafka-trunk-jdk7/970/changes>
Changes:
[wangguoz] MINOR: MemoryRecords.sizeInBytes throws NPE when non-writable.
------------------------------------------
Started by an SCM change
[EnvInject] - Loading node environment variables.
Building remotely on H11 (Ubuntu ubuntu) in workspace <https://builds.apache.org/job/kafka-trunk-jdk7/ws/>
> git rev-parse --is-inside-work-tree # timeout=10
Fetching changes from the remote Git repository
> git config remote.origin.url https://git-wip-us.apache.org/repos/asf/kafka.git # timeout=10
Fetching upstream changes from https://git-wip-us.apache.org/repos/asf/kafka.git
> git --version # timeout=10
> git -c core.askpass=true fetch --tags --progress https://git-wip-us.apache.org/repos/asf/kafka.git +refs/heads/*:refs/remotes/origin/*
> git rev-parse refs/remotes/origin/trunk^{commit} # timeout=10
> git rev-parse refs/remotes/origin/origin/trunk^{commit} # timeout=10
Checking out Revision 0a7f2bf335e426b12f717ec7f6d51779d56fe59b (refs/remotes/origin/trunk)
> git config core.sparsecheckout # timeout=10
> git checkout -f 0a7f2bf335e426b12f717ec7f6d51779d56fe59b
> git rev-list b1d325b3c09cd95d69a66fac4a3760f57d3062c9 # timeout=10
Setting GRADLE_2_4_RC_2_HOME=/home/jenkins/jenkins-slave/tools/hudson.plugins.gradle.GradleInstallation/Gradle_2.4-rc-2
Setting JDK_1_7U51_HOME=/home/jenkins/jenkins-slave/tools/hudson.model.JDK/jdk-1.7u51
[kafka-trunk-jdk7] $ /bin/bash -xe /tmp/hudson1216900852919579306.sh
+ /home/jenkins/jenkins-slave/tools/hudson.plugins.gradle.GradleInstallation/Gradle_2.4-rc-2/bin/gradle
To honour the JVM settings for this build a new JVM will be forked. Please consider using the daemon: http://gradle.org/docs/2.4-rc-2/userguide/gradle_daemon.html.
Building project 'core' with Scala version 2.10.6
:downloadWrapper
BUILD SUCCESSFUL
Total time: 12.989 secs
Setting GRADLE_2_4_RC_2_HOME=/home/jenkins/jenkins-slave/tools/hudson.plugins.gradle.GradleInstallation/Gradle_2.4-rc-2
Setting JDK_1_7U51_HOME=/home/jenkins/jenkins-slave/tools/hudson.model.JDK/jdk-1.7u51
[kafka-trunk-jdk7] $ /bin/bash -xe /tmp/hudson8403242952437616517.sh
+ export GRADLE_OPTS=-Xmx1024m
+ GRADLE_OPTS=-Xmx1024m
+ ./gradlew -Dorg.gradle.project.maxParallelForks=1 clean jarAll testAll
To honour the JVM settings for this build a new JVM will be forked. Please consider using the daemon: https://docs.gradle.org/2.10/userguide/gradle_daemon.html.
Building project 'core' with Scala version 2.10.6
:clean UP-TO-DATE
:clients:clean UP-TO-DATE
:connect:clean UP-TO-DATE
:core:clean UP-TO-DATE
:examples:clean UP-TO-DATE
:log4j-appender:clean UP-TO-DATE
:streams:clean UP-TO-DATE
:tools:clean UP-TO-DATE
:connect:api:clean UP-TO-DATE
:connect:file:clean UP-TO-DATE
:connect:json:clean UP-TO-DATE
:connect:runtime:clean UP-TO-DATE
:jar_core_2_10
Building project 'core' with Scala version 2.10.6
:kafka-trunk-jdk7:clients:compileJava
:jar_core_2_10 FAILED
FAILURE: Build failed with an exception.
* What went wrong:
Failed to capture snapshot of input files for task 'compileJava' during up-to-date check. See stacktrace for details.
> Could not add entry '/home/jenkins/.gradle/caches/modules-2/files-2.1/net.jpountz.lz4/lz4/1.3.0/c708bb2590c0652a642236ef45d9f99ff842a2ce/lz4-1.3.0.jar' to cache fileHashes.bin (<https://builds.apache.org/job/kafka-trunk-jdk7/ws/.gradle/2.10/taskArtifacts/fileHashes.bin).>
* Try:
Run with --stacktrace option to get the stack trace. Run with --info or --debug option to get more log output.
BUILD FAILED
Total time: 13.803 secs
Build step 'Execute shell' marked build as failure
Recording test results
Setting GRADLE_2_4_RC_2_HOME=/home/jenkins/jenkins-slave/tools/hudson.plugins.gradle.GradleInstallation/Gradle_2.4-rc-2
Setting JDK_1_7U51_HOME=/home/jenkins/jenkins-slave/tools/hudson.model.JDK/jdk-1.7u51
ERROR: Publisher 'Publish JUnit test result report' failed: No test report files were found. Configuration error?
Setting GRADLE_2_4_RC_2_HOME=/home/jenkins/jenkins-slave/tools/hudson.plugins.gradle.GradleInstallation/Gradle_2.4-rc-2
Setting JDK_1_7U51_HOME=/home/jenkins/jenkins-slave/tools/hudson.model.JDK/jdk-1.7u51
Build failed in Jenkins: kafka-trunk-jdk7 #969
Posted by Apache Jenkins Server <je...@builds.apache.org>.
See <https://builds.apache.org/job/kafka-trunk-jdk7/969/changes>
Changes:
[cshapi] KAFKA-3012: Avoid reserved.broker.max.id collisions on upgrade
[cshapi] KAFKA-3091: Broker persists generated ID even when the ID can't be used
------------------------------------------
Started by an SCM change
[EnvInject] - Loading node environment variables.
Building remotely on ubuntu3 (Ubuntu ubuntu legacy-ubuntu) in workspace <https://builds.apache.org/job/kafka-trunk-jdk7/ws/>
> git rev-parse --is-inside-work-tree # timeout=10
Fetching changes from the remote Git repository
> git config remote.origin.url https://git-wip-us.apache.org/repos/asf/kafka.git # timeout=10
Fetching upstream changes from https://git-wip-us.apache.org/repos/asf/kafka.git
> git --version # timeout=10
> git -c core.askpass=true fetch --tags --progress https://git-wip-us.apache.org/repos/asf/kafka.git +refs/heads/*:refs/remotes/origin/*
> git rev-parse refs/remotes/origin/trunk^{commit} # timeout=10
> git rev-parse refs/remotes/origin/origin/trunk^{commit} # timeout=10
Checking out Revision b1d325b3c09cd95d69a66fac4a3760f57d3062c9 (refs/remotes/origin/trunk)
> git config core.sparsecheckout # timeout=10
> git checkout -f b1d325b3c09cd95d69a66fac4a3760f57d3062c9
> git rev-list c06542edeadb99fc5adddcea422d411e3ac96171 # timeout=10
Setting GRADLE_2_4_RC_2_HOME=/home/jenkins/jenkins-slave/tools/hudson.plugins.gradle.GradleInstallation/Gradle_2.4-rc-2
Setting JDK_1_7U51_HOME=/home/jenkins/jenkins-slave/tools/hudson.model.JDK/jdk-1.7u51
[kafka-trunk-jdk7] $ /bin/bash -xe /tmp/hudson3389102295753617517.sh
+ /home/jenkins/jenkins-slave/tools/hudson.plugins.gradle.GradleInstallation/Gradle_2.4-rc-2/bin/gradle
To honour the JVM settings for this build a new JVM will be forked. Please consider using the daemon: http://gradle.org/docs/2.4-rc-2/userguide/gradle_daemon.html.
Building project 'core' with Scala version 2.10.6
:downloadWrapper
BUILD SUCCESSFUL
Total time: 14.007 secs
Setting GRADLE_2_4_RC_2_HOME=/home/jenkins/jenkins-slave/tools/hudson.plugins.gradle.GradleInstallation/Gradle_2.4-rc-2
Setting JDK_1_7U51_HOME=/home/jenkins/jenkins-slave/tools/hudson.model.JDK/jdk-1.7u51
[kafka-trunk-jdk7] $ /bin/bash -xe /tmp/hudson887670863062624186.sh
+ export GRADLE_OPTS=-Xmx1024m
+ GRADLE_OPTS=-Xmx1024m
+ ./gradlew -Dorg.gradle.project.maxParallelForks=1 clean jarAll testAll
To honour the JVM settings for this build a new JVM will be forked. Please consider using the daemon: https://docs.gradle.org/2.10/userguide/gradle_daemon.html.
Building project 'core' with Scala version 2.10.6
:clean UP-TO-DATE
:clients:clean UP-TO-DATE
:connect:clean UP-TO-DATE
:core:clean UP-TO-DATE
:examples:clean UP-TO-DATE
:log4j-appender:clean UP-TO-DATE
:streams:clean UP-TO-DATE
:tools:clean UP-TO-DATE
:connect:api:clean UP-TO-DATE
:connect:file:clean UP-TO-DATE
:connect:json:clean UP-TO-DATE
:connect:runtime:clean UP-TO-DATE
:jar_core_2_10
Building project 'core' with Scala version 2.10.6
:kafka-trunk-jdk7:clients:compileJava
:jar_core_2_10 FAILED
FAILURE: Build failed with an exception.
* What went wrong:
Failed to capture snapshot of input files for task 'compileJava' during up-to-date check. See stacktrace for details.
> Could not add entry '/home/jenkins/.gradle/caches/modules-2/files-2.1/net.jpountz.lz4/lz4/1.3.0/c708bb2590c0652a642236ef45d9f99ff842a2ce/lz4-1.3.0.jar' to cache fileHashes.bin (/x1/jenkins/jenkins-slave/workspace/kafka-trunk-jdk7/.gradle/2.10/taskArtifacts/fileHashes.bin).
* Try:
Run with --stacktrace option to get the stack trace. Run with --info or --debug option to get more log output.
BUILD FAILED
Total time: 14.421 secs
Build step 'Execute shell' marked build as failure
Recording test results
Setting GRADLE_2_4_RC_2_HOME=/home/jenkins/jenkins-slave/tools/hudson.plugins.gradle.GradleInstallation/Gradle_2.4-rc-2
Setting JDK_1_7U51_HOME=/home/jenkins/jenkins-slave/tools/hudson.model.JDK/jdk-1.7u51
ERROR: Publisher 'Publish JUnit test result report' failed: No test report files were found. Configuration error?
Setting GRADLE_2_4_RC_2_HOME=/home/jenkins/jenkins-slave/tools/hudson.plugins.gradle.GradleInstallation/Gradle_2.4-rc-2
Setting JDK_1_7U51_HOME=/home/jenkins/jenkins-slave/tools/hudson.model.JDK/jdk-1.7u51
Build failed in Jenkins: kafka-trunk-jdk7 #968
Posted by Apache Jenkins Server <je...@builds.apache.org>.
See <https://builds.apache.org/job/kafka-trunk-jdk7/968/changes>
Changes:
[cshapi] KAFKA-3119: Adding -daemon option to zookeeper-server-start.sh USAGE,
------------------------------------------
Started by an SCM change
[EnvInject] - Loading node environment variables.
Building remotely on ubuntu-6 (docker Ubuntu ubuntu) in workspace <https://builds.apache.org/job/kafka-trunk-jdk7/ws/>
> git rev-parse --is-inside-work-tree # timeout=10
Fetching changes from the remote Git repository
> git config remote.origin.url https://git-wip-us.apache.org/repos/asf/kafka.git # timeout=10
Fetching upstream changes from https://git-wip-us.apache.org/repos/asf/kafka.git
> git --version # timeout=10
> git -c core.askpass=true fetch --tags --progress https://git-wip-us.apache.org/repos/asf/kafka.git +refs/heads/*:refs/remotes/origin/*
> git rev-parse refs/remotes/origin/trunk^{commit} # timeout=10
> git rev-parse refs/remotes/origin/origin/trunk^{commit} # timeout=10
Checking out Revision c06542edeadb99fc5adddcea422d411e3ac96171 (refs/remotes/origin/trunk)
> git config core.sparsecheckout # timeout=10
> git checkout -f c06542edeadb99fc5adddcea422d411e3ac96171
> git rev-list f75e3350259c6df11719ee0a55f5780c136f3d26 # timeout=10
Setting GRADLE_2_4_RC_2_HOME=/home/jenkins/jenkins-slave/tools/hudson.plugins.gradle.GradleInstallation/Gradle_2.4-rc-2
Setting JDK_1_7U51_HOME=/home/jenkins/jenkins-slave/tools/hudson.model.JDK/jdk-1.7u51
[kafka-trunk-jdk7] $ /bin/bash -xe /tmp/hudson1858968121347450230.sh
+ /home/jenkins/jenkins-slave/tools/hudson.plugins.gradle.GradleInstallation/Gradle_2.4-rc-2/bin/gradle
To honour the JVM settings for this build a new JVM will be forked. Please consider using the daemon: http://gradle.org/docs/2.4-rc-2/userguide/gradle_daemon.html.
Building project 'core' with Scala version 2.10.6
:downloadWrapper
BUILD SUCCESSFUL
Total time: 18.961 secs
Setting GRADLE_2_4_RC_2_HOME=/home/jenkins/jenkins-slave/tools/hudson.plugins.gradle.GradleInstallation/Gradle_2.4-rc-2
Setting JDK_1_7U51_HOME=/home/jenkins/jenkins-slave/tools/hudson.model.JDK/jdk-1.7u51
[kafka-trunk-jdk7] $ /bin/bash -xe /tmp/hudson2728762399487649722.sh
+ export GRADLE_OPTS=-Xmx1024m
+ GRADLE_OPTS=-Xmx1024m
+ ./gradlew -Dorg.gradle.project.maxParallelForks=1 clean jarAll testAll
To honour the JVM settings for this build a new JVM will be forked. Please consider using the daemon: https://docs.gradle.org/2.10/userguide/gradle_daemon.html.
Building project 'core' with Scala version 2.10.6
:clean UP-TO-DATE
:clients:clean
:connect:clean UP-TO-DATE
:core:clean
:examples:clean UP-TO-DATE
:log4j-appender:clean UP-TO-DATE
:streams:clean UP-TO-DATE
:tools:clean UP-TO-DATE
:connect:api:clean UP-TO-DATE
:connect:file:clean UP-TO-DATE
:connect:json:clean UP-TO-DATE
:connect:runtime:clean UP-TO-DATE
:jar_core_2_10
Building project 'core' with Scala version 2.10.6
:kafka-trunk-jdk7:clients:compileJava
:jar_core_2_10 FAILED
FAILURE: Build failed with an exception.
* What went wrong:
Failed to capture snapshot of input files for task 'compileJava' during up-to-date check. See stacktrace for details.
> Could not add entry '/home/jenkins/.gradle/caches/modules-2/files-2.1/net.jpountz.lz4/lz4/1.3.0/c708bb2590c0652a642236ef45d9f99ff842a2ce/lz4-1.3.0.jar' to cache fileHashes.bin (<https://builds.apache.org/job/kafka-trunk-jdk7/ws/.gradle/2.10/taskArtifacts/fileHashes.bin).>
* Try:
Run with --stacktrace option to get the stack trace. Run with --info or --debug option to get more log output.
BUILD FAILED
Total time: 19.13 secs
Build step 'Execute shell' marked build as failure
Recording test results
Setting GRADLE_2_4_RC_2_HOME=/home/jenkins/jenkins-slave/tools/hudson.plugins.gradle.GradleInstallation/Gradle_2.4-rc-2
Setting JDK_1_7U51_HOME=/home/jenkins/jenkins-slave/tools/hudson.model.JDK/jdk-1.7u51
ERROR: Publisher 'Publish JUnit test result report' failed: No test report files were found. Configuration error?
Setting GRADLE_2_4_RC_2_HOME=/home/jenkins/jenkins-slave/tools/hudson.plugins.gradle.GradleInstallation/Gradle_2.4-rc-2
Setting JDK_1_7U51_HOME=/home/jenkins/jenkins-slave/tools/hudson.model.JDK/jdk-1.7u51
Build failed in Jenkins: kafka-trunk-jdk7 #967
Posted by Apache Jenkins Server <je...@builds.apache.org>.
See <https://builds.apache.org/job/kafka-trunk-jdk7/967/changes>
Changes:
[wangguoz] MINOR: complete built-in stream aggregate functions
------------------------------------------
Started by an SCM change
[EnvInject] - Loading node environment variables.
Building remotely on H11 (Ubuntu ubuntu) in workspace <https://builds.apache.org/job/kafka-trunk-jdk7/ws/>
> git rev-parse --is-inside-work-tree # timeout=10
Fetching changes from the remote Git repository
> git config remote.origin.url https://git-wip-us.apache.org/repos/asf/kafka.git # timeout=10
Fetching upstream changes from https://git-wip-us.apache.org/repos/asf/kafka.git
> git --version # timeout=10
> git -c core.askpass=true fetch --tags --progress https://git-wip-us.apache.org/repos/asf/kafka.git +refs/heads/*:refs/remotes/origin/*
> git rev-parse refs/remotes/origin/trunk^{commit} # timeout=10
> git rev-parse refs/remotes/origin/origin/trunk^{commit} # timeout=10
Checking out Revision f75e3350259c6df11719ee0a55f5780c136f3d26 (refs/remotes/origin/trunk)
> git config core.sparsecheckout # timeout=10
> git checkout -f f75e3350259c6df11719ee0a55f5780c136f3d26
> git rev-list a62eb5993f5517a64dd1020b0a9bbd1012f7ee67 # timeout=10
Setting GRADLE_2_4_RC_2_HOME=/home/jenkins/jenkins-slave/tools/hudson.plugins.gradle.GradleInstallation/Gradle_2.4-rc-2
Setting JDK_1_7U51_HOME=/home/jenkins/jenkins-slave/tools/hudson.model.JDK/jdk-1.7u51
[kafka-trunk-jdk7] $ /bin/bash -xe /tmp/hudson8042821834585232054.sh
+ /home/jenkins/jenkins-slave/tools/hudson.plugins.gradle.GradleInstallation/Gradle_2.4-rc-2/bin/gradle
To honour the JVM settings for this build a new JVM will be forked. Please consider using the daemon: http://gradle.org/docs/2.4-rc-2/userguide/gradle_daemon.html.
Building project 'core' with Scala version 2.10.6
:downloadWrapper
BUILD SUCCESSFUL
Total time: 11.842 secs
Setting GRADLE_2_4_RC_2_HOME=/home/jenkins/jenkins-slave/tools/hudson.plugins.gradle.GradleInstallation/Gradle_2.4-rc-2
Setting JDK_1_7U51_HOME=/home/jenkins/jenkins-slave/tools/hudson.model.JDK/jdk-1.7u51
[kafka-trunk-jdk7] $ /bin/bash -xe /tmp/hudson5061097624990509790.sh
+ export GRADLE_OPTS=-Xmx1024m
+ GRADLE_OPTS=-Xmx1024m
+ ./gradlew -Dorg.gradle.project.maxParallelForks=1 clean jarAll testAll
To honour the JVM settings for this build a new JVM will be forked. Please consider using the daemon: https://docs.gradle.org/2.10/userguide/gradle_daemon.html.
Building project 'core' with Scala version 2.10.6
:clean UP-TO-DATE
:clients:clean UP-TO-DATE
:connect:clean UP-TO-DATE
:core:clean UP-TO-DATE
:examples:clean UP-TO-DATE
:log4j-appender:clean UP-TO-DATE
:streams:clean UP-TO-DATE
:tools:clean UP-TO-DATE
:connect:api:clean UP-TO-DATE
:connect:file:clean UP-TO-DATE
:connect:json:clean UP-TO-DATE
:connect:runtime:clean UP-TO-DATE
:jar_core_2_10
Building project 'core' with Scala version 2.10.6
:kafka-trunk-jdk7:clients:compileJava
:jar_core_2_10 FAILED
FAILURE: Build failed with an exception.
* What went wrong:
Failed to capture snapshot of input files for task 'compileJava' during up-to-date check. See stacktrace for details.
> Could not add entry '/home/jenkins/.gradle/caches/modules-2/files-2.1/net.jpountz.lz4/lz4/1.3.0/c708bb2590c0652a642236ef45d9f99ff842a2ce/lz4-1.3.0.jar' to cache fileHashes.bin (<https://builds.apache.org/job/kafka-trunk-jdk7/ws/.gradle/2.10/taskArtifacts/fileHashes.bin).>
* Try:
Run with --stacktrace option to get the stack trace. Run with --info or --debug option to get more log output.
BUILD FAILED
Total time: 16.084 secs
Build step 'Execute shell' marked build as failure
Recording test results
Setting GRADLE_2_4_RC_2_HOME=/home/jenkins/jenkins-slave/tools/hudson.plugins.gradle.GradleInstallation/Gradle_2.4-rc-2
Setting JDK_1_7U51_HOME=/home/jenkins/jenkins-slave/tools/hudson.model.JDK/jdk-1.7u51
ERROR: Publisher 'Publish JUnit test result report' failed: No test report files were found. Configuration error?
Setting GRADLE_2_4_RC_2_HOME=/home/jenkins/jenkins-slave/tools/hudson.plugins.gradle.GradleInstallation/Gradle_2.4-rc-2
Setting JDK_1_7U51_HOME=/home/jenkins/jenkins-slave/tools/hudson.model.JDK/jdk-1.7u51
Build failed in Jenkins: kafka-trunk-jdk7 #966
Posted by Apache Jenkins Server <je...@builds.apache.org>.
See <https://builds.apache.org/job/kafka-trunk-jdk7/966/changes>
Changes:
[wangguoz] KAFKA-3104: add windowed aggregation to KStream
------------------------------------------
[...truncated 2771 lines...]
kafka.server.OffsetCommitTest > testOffsetExpiration PASSED
kafka.server.OffsetCommitTest > testNonExistingTopicOffsetCommit PASSED
kafka.server.PlaintextReplicaFetchTest > testReplicaFetcherThread PASSED
kafka.server.SaslPlaintextReplicaFetchTest > testReplicaFetcherThread PASSED
kafka.server.LogOffsetTest > testGetOffsetsBeforeEarliestTime PASSED
kafka.server.LogOffsetTest > testGetOffsetsForUnknownTopic PASSED
kafka.server.LogOffsetTest > testEmptyLogsGetOffsets PASSED
kafka.server.LogOffsetTest > testGetOffsetsBeforeLatestTime PASSED
kafka.server.LogOffsetTest > testGetOffsetsBeforeNow PASSED
kafka.server.AdvertiseBrokerTest > testBrokerAdvertiseToZK PASSED
kafka.server.ServerStartupTest > testBrokerCreatesZKChroot PASSED
kafka.server.ServerStartupTest > testConflictBrokerRegistration PASSED
kafka.server.DelayedOperationTest > testRequestPurge PASSED
kafka.server.DelayedOperationTest > testRequestExpiry PASSED
kafka.server.DelayedOperationTest > testRequestSatisfaction PASSED
kafka.server.LeaderElectionTest > testLeaderElectionWithStaleControllerEpoch PASSED
kafka.server.LeaderElectionTest > testLeaderElectionAndEpoch PASSED
kafka.server.DynamicConfigChangeTest > testProcessNotification PASSED
kafka.server.DynamicConfigChangeTest > testClientQuotaConfigChange PASSED
kafka.server.DynamicConfigChangeTest > testConfigChangeOnNonExistingTopic PASSED
kafka.server.DynamicConfigChangeTest > testConfigChange PASSED
kafka.server.HighwatermarkPersistenceTest > testHighWatermarkPersistenceMultiplePartitions PASSED
kafka.server.HighwatermarkPersistenceTest > testHighWatermarkPersistenceSinglePartition PASSED
kafka.server.LogRecoveryTest > testHWCheckpointNoFailuresMultipleLogSegments PASSED
kafka.server.LogRecoveryTest > testHWCheckpointWithFailuresMultipleLogSegments PASSED
kafka.server.LogRecoveryTest > testHWCheckpointNoFailuresSingleLogSegment PASSED
kafka.server.LogRecoveryTest > testHWCheckpointWithFailuresSingleLogSegment PASSED
kafka.integration.SaslPlaintextTopicMetadataTest > testIsrAfterBrokerShutDownAndJoinsBack PASSED
kafka.integration.SaslPlaintextTopicMetadataTest > testAutoCreateTopicWithCollision PASSED
kafka.integration.SaslPlaintextTopicMetadataTest > testAliveBrokerListWithNoTopics PASSED
kafka.integration.SaslPlaintextTopicMetadataTest > testAutoCreateTopic PASSED
kafka.integration.SaslPlaintextTopicMetadataTest > testGetAllTopicMetadata PASSED
kafka.integration.SaslPlaintextTopicMetadataTest > testAliveBrokersListWithNoTopicsAfterNewBrokerStartup PASSED
kafka.integration.SaslPlaintextTopicMetadataTest > testBasicTopicMetadata PASSED
kafka.integration.SaslPlaintextTopicMetadataTest > testTopicMetadataRequest PASSED
kafka.integration.SaslPlaintextTopicMetadataTest > testAliveBrokersListWithNoTopicsAfterABrokerShutdown PASSED
kafka.integration.PrimitiveApiTest > testMultiProduce PASSED
kafka.integration.PrimitiveApiTest > testDefaultEncoderProducerAndFetch PASSED
kafka.integration.PrimitiveApiTest > testFetchRequestCanProperlySerialize PASSED
kafka.integration.PrimitiveApiTest > testPipelinedProduceRequests PASSED
kafka.integration.PrimitiveApiTest > testProduceAndMultiFetch PASSED
kafka.integration.PrimitiveApiTest > testDefaultEncoderProducerAndFetchWithCompression PASSED
kafka.integration.PrimitiveApiTest > testConsumerEmptyTopic PASSED
kafka.integration.PrimitiveApiTest > testEmptyFetchRequest PASSED
kafka.integration.PlaintextTopicMetadataTest > testIsrAfterBrokerShutDownAndJoinsBack PASSED
kafka.integration.PlaintextTopicMetadataTest > testAutoCreateTopicWithCollision PASSED
kafka.integration.PlaintextTopicMetadataTest > testAliveBrokerListWithNoTopics PASSED
kafka.integration.PlaintextTopicMetadataTest > testAutoCreateTopic PASSED
kafka.integration.PlaintextTopicMetadataTest > testGetAllTopicMetadata PASSED
kafka.integration.PlaintextTopicMetadataTest > testAliveBrokersListWithNoTopicsAfterNewBrokerStartup PASSED
kafka.integration.PlaintextTopicMetadataTest > testBasicTopicMetadata PASSED
kafka.integration.PlaintextTopicMetadataTest > testTopicMetadataRequest PASSED
kafka.integration.PlaintextTopicMetadataTest > testAliveBrokersListWithNoTopicsAfterABrokerShutdown PASSED
kafka.integration.SslTopicMetadataTest > testIsrAfterBrokerShutDownAndJoinsBack PASSED
kafka.integration.SslTopicMetadataTest > testAutoCreateTopicWithCollision PASSED
kafka.integration.SslTopicMetadataTest > testAliveBrokerListWithNoTopics PASSED
kafka.integration.SslTopicMetadataTest > testAutoCreateTopic PASSED
kafka.integration.SslTopicMetadataTest > testGetAllTopicMetadata PASSED
kafka.integration.SslTopicMetadataTest > testAliveBrokersListWithNoTopicsAfterNewBrokerStartup PASSED
kafka.integration.SslTopicMetadataTest > testBasicTopicMetadata PASSED
kafka.integration.SslTopicMetadataTest > testTopicMetadataRequest PASSED
kafka.integration.SslTopicMetadataTest > testAliveBrokersListWithNoTopicsAfterABrokerShutdown PASSED
kafka.integration.RollingBounceTest > testRollingBounce PASSED
kafka.integration.AutoOffsetResetTest > testResetToLatestWhenOffsetTooLow PASSED
kafka.integration.AutoOffsetResetTest > testResetToEarliestWhenOffsetTooLow PASSED
kafka.integration.AutoOffsetResetTest > testResetToEarliestWhenOffsetTooHigh PASSED
kafka.integration.AutoOffsetResetTest > testResetToLatestWhenOffsetTooHigh PASSED
kafka.integration.MinIsrConfigTest > testDefaultKafkaConfig PASSED
kafka.integration.UncleanLeaderElectionTest > testUncleanLeaderElectionEnabled PASSED
kafka.integration.UncleanLeaderElectionTest > testCleanLeaderElectionDisabledByTopicOverride PASSED
kafka.integration.UncleanLeaderElectionTest > testUncleanLeaderElectionDisabled PASSED
kafka.integration.UncleanLeaderElectionTest > testUncleanLeaderElectionInvalidTopicOverride PASSED
kafka.integration.UncleanLeaderElectionTest > testUncleanLeaderElectionEnabledByTopicOverride PASSED
kafka.integration.FetcherTest > testFetcher PASSED
kafka.integration.SaslSslTopicMetadataTest > testIsrAfterBrokerShutDownAndJoinsBack PASSED
kafka.integration.SaslSslTopicMetadataTest > testAutoCreateTopicWithCollision PASSED
kafka.integration.SaslSslTopicMetadataTest > testAliveBrokerListWithNoTopics PASSED
kafka.integration.SaslSslTopicMetadataTest > testAutoCreateTopic PASSED
kafka.integration.SaslSslTopicMetadataTest > testGetAllTopicMetadata PASSED
kafka.integration.SaslSslTopicMetadataTest > testAliveBrokersListWithNoTopicsAfterNewBrokerStartup PASSED
kafka.integration.SaslSslTopicMetadataTest > testBasicTopicMetadata PASSED
kafka.integration.SaslSslTopicMetadataTest > testTopicMetadataRequest PASSED
kafka.integration.SaslSslTopicMetadataTest > testAliveBrokersListWithNoTopicsAfterABrokerShutdown PASSED
kafka.utils.timer.TimerTaskListTest > testAll PASSED
kafka.utils.timer.TimerTest > testAlreadyExpiredTask PASSED
kafka.utils.timer.TimerTest > testTaskExpiration PASSED
kafka.utils.JsonTest > testJsonEncoding PASSED
kafka.utils.ReplicationUtilsTest > testUpdateLeaderAndIsr PASSED
kafka.utils.ReplicationUtilsTest > testGetLeaderIsrAndEpochForPartition PASSED
kafka.utils.IteratorTemplateTest > testIterator PASSED
kafka.utils.UtilsTest > testAbs PASSED
kafka.utils.UtilsTest > testReplaceSuffix PASSED
kafka.utils.UtilsTest > testCircularIterator PASSED
kafka.utils.UtilsTest > testReadBytes PASSED
kafka.utils.UtilsTest > testCsvList PASSED
kafka.utils.UtilsTest > testReadInt PASSED
kafka.utils.UtilsTest > testCsvMap PASSED
kafka.utils.UtilsTest > testInLock PASSED
kafka.utils.UtilsTest > testSwallow PASSED
kafka.utils.SchedulerTest > testMockSchedulerNonPeriodicTask PASSED
kafka.utils.SchedulerTest > testMockSchedulerPeriodicTask PASSED
kafka.utils.SchedulerTest > testNonPeriodicTask PASSED
kafka.utils.SchedulerTest > testRestart PASSED
kafka.utils.SchedulerTest > testReentrantTaskInMockScheduler PASSED
kafka.utils.SchedulerTest > testPeriodicTask PASSED
kafka.utils.ByteBoundedBlockingQueueTest > testByteBoundedBlockingQueue PASSED
kafka.utils.CommandLineUtilsTest > testParseEmptyArg PASSED
kafka.utils.CommandLineUtilsTest > testParseSingleArg PASSED
kafka.utils.CommandLineUtilsTest > testParseArgs PASSED
integration.kafka.api.AdminClientTest > testDescribeGroup PASSED
integration.kafka.api.AdminClientTest > testDescribeConsumerGroup PASSED
integration.kafka.api.AdminClientTest > testListGroups PASSED
integration.kafka.api.AdminClientTest > testDescribeConsumerGroupForNonExistentGroup PASSED
650 tests completed, 1 failed
:kafka-trunk-jdk7:core:test FAILED
:test_core_2_11 FAILED
FAILURE: Build failed with an exception.
* What went wrong:
Execution failed for task ':core:test'.
> There were failing tests. See the report at: file://<https://builds.apache.org/job/kafka-trunk-jdk7/ws/core/build/reports/tests/index.html>
* Try:
Run with --stacktrace option to get the stack trace. Run with --info or --debug option to get more log output.
BUILD FAILED
Total time: 1 hrs 34 mins 25.96 secs
Build step 'Execute shell' marked build as failure
Recording test results
Setting GRADLE_2_4_RC_2_HOME=/home/jenkins/jenkins-slave/tools/hudson.plugins.gradle.GradleInstallation/Gradle_2.4-rc-2
Setting JDK_1_7U51_HOME=/home/jenkins/jenkins-slave/tools/hudson.model.JDK/jdk-1.7u51
Setting GRADLE_2_4_RC_2_HOME=/home/jenkins/jenkins-slave/tools/hudson.plugins.gradle.GradleInstallation/Gradle_2.4-rc-2
Setting JDK_1_7U51_HOME=/home/jenkins/jenkins-slave/tools/hudson.model.JDK/jdk-1.7u51
Build failed in Jenkins: kafka-trunk-jdk7 #965
Posted by Apache Jenkins Server <je...@builds.apache.org>.
See <https://builds.apache.org/job/kafka-trunk-jdk7/965/changes>
Changes:
[me] KAFKA-3105: Use `Utils.atomicMoveWithFallback` instead of `File.rename`
[wangguoz] KAFKA-2695: limited support for nullable byte arrays
[cshapi] KAFKA-3098: "partition.assignment.strategy" appears twice in
[cshapi] KAFKA-3095: Add documentation on format of
[cshapi] KAFKA-2999: Errors enum should be a 1 to 1 mapping of error codes andâ¦
------------------------------------------
Started by an SCM change
[EnvInject] - Loading node environment variables.
Building remotely on H11 (Ubuntu ubuntu) in workspace <https://builds.apache.org/job/kafka-trunk-jdk7/ws/>
> git rev-parse --is-inside-work-tree # timeout=10
Fetching changes from the remote Git repository
> git config remote.origin.url https://git-wip-us.apache.org/repos/asf/kafka.git # timeout=10
Fetching upstream changes from https://git-wip-us.apache.org/repos/asf/kafka.git
> git --version # timeout=10
> git -c core.askpass=true fetch --tags --progress https://git-wip-us.apache.org/repos/asf/kafka.git +refs/heads/*:refs/remotes/origin/*
> git rev-parse refs/remotes/origin/trunk^{commit} # timeout=10
> git rev-parse refs/remotes/origin/origin/trunk^{commit} # timeout=10
Checking out Revision cc3570d1a28354acd082c41a15d9c9efde540b16 (refs/remotes/origin/trunk)
> git config core.sparsecheckout # timeout=10
> git checkout -f cc3570d1a28354acd082c41a15d9c9efde540b16
> git rev-list 60a5a523b6f7e5151d8cdc835845cfc4d2e72b52 # timeout=10
Setting GRADLE_2_4_RC_2_HOME=/home/jenkins/jenkins-slave/tools/hudson.plugins.gradle.GradleInstallation/Gradle_2.4-rc-2
Setting JDK_1_7U51_HOME=/home/jenkins/jenkins-slave/tools/hudson.model.JDK/jdk-1.7u51
[kafka-trunk-jdk7] $ /bin/bash -xe /tmp/hudson2550414145662441381.sh
+ /home/jenkins/jenkins-slave/tools/hudson.plugins.gradle.GradleInstallation/Gradle_2.4-rc-2/bin/gradle
To honour the JVM settings for this build a new JVM will be forked. Please consider using the daemon: http://gradle.org/docs/2.4-rc-2/userguide/gradle_daemon.html.
Building project 'core' with Scala version 2.10.6
:downloadWrapper
BUILD SUCCESSFUL
Total time: 12.561 secs
Setting GRADLE_2_4_RC_2_HOME=/home/jenkins/jenkins-slave/tools/hudson.plugins.gradle.GradleInstallation/Gradle_2.4-rc-2
Setting JDK_1_7U51_HOME=/home/jenkins/jenkins-slave/tools/hudson.model.JDK/jdk-1.7u51
[kafka-trunk-jdk7] $ /bin/bash -xe /tmp/hudson7773322669939547522.sh
+ export GRADLE_OPTS=-Xmx1024m
+ GRADLE_OPTS=-Xmx1024m
+ ./gradlew -Dorg.gradle.project.maxParallelForks=1 clean jarAll testAll
To honour the JVM settings for this build a new JVM will be forked. Please consider using the daemon: https://docs.gradle.org/2.10/userguide/gradle_daemon.html.
Building project 'core' with Scala version 2.10.6
:clean UP-TO-DATE
:clients:clean UP-TO-DATE
:connect:clean UP-TO-DATE
:core:clean UP-TO-DATE
:examples:clean UP-TO-DATE
:log4j-appender:clean UP-TO-DATE
:streams:clean UP-TO-DATE
:tools:clean UP-TO-DATE
:connect:api:clean UP-TO-DATE
:connect:file:clean UP-TO-DATE
:connect:json:clean UP-TO-DATE
:connect:runtime:clean UP-TO-DATE
:jar_core_2_10
Building project 'core' with Scala version 2.10.6
:kafka-trunk-jdk7:clients:compileJava
:jar_core_2_10 FAILED
FAILURE: Build failed with an exception.
* What went wrong:
Failed to capture snapshot of input files for task 'compileJava' during up-to-date check. See stacktrace for details.
> Could not add entry '/home/jenkins/.gradle/caches/modules-2/files-2.1/net.jpountz.lz4/lz4/1.3.0/c708bb2590c0652a642236ef45d9f99ff842a2ce/lz4-1.3.0.jar' to cache fileHashes.bin (<https://builds.apache.org/job/kafka-trunk-jdk7/ws/.gradle/2.10/taskArtifacts/fileHashes.bin).>
* Try:
Run with --stacktrace option to get the stack trace. Run with --info or --debug option to get more log output.
BUILD FAILED
Total time: 16.025 secs
Build step 'Execute shell' marked build as failure
Recording test results
Setting GRADLE_2_4_RC_2_HOME=/home/jenkins/jenkins-slave/tools/hudson.plugins.gradle.GradleInstallation/Gradle_2.4-rc-2
Setting JDK_1_7U51_HOME=/home/jenkins/jenkins-slave/tools/hudson.model.JDK/jdk-1.7u51
ERROR: Publisher 'Publish JUnit test result report' failed: No test report files were found. Configuration error?
Setting GRADLE_2_4_RC_2_HOME=/home/jenkins/jenkins-slave/tools/hudson.plugins.gradle.GradleInstallation/Gradle_2.4-rc-2
Setting JDK_1_7U51_HOME=/home/jenkins/jenkins-slave/tools/hudson.model.JDK/jdk-1.7u51