You are viewing a plain text version of this content. The canonical link for it is here.
Posted to dev@jmeter.apache.org by Apache Jenkins Server <je...@builds.apache.org> on 2016/12/21 20:06:59 UTC

Build failed in Jenkins: JMeter-trunk #5616

See <https://builds.apache.org/job/JMeter-trunk/5616/>

------------------------------------------
[...truncated 1071 lines...]
  [javadoc] Loading source files for package org.apache.jmeter.validation...
  [javadoc] Loading source files for package org.apache.jmeter.visualizers.backend...
  [javadoc] Loading source files for package org.apache.jmeter.visualizers.backend.graphite...
  [javadoc] Loading source files for package org.apache.jmeter.visualizers.utils...
  [javadoc] Loading source files for package org.apache.jmeter.protocol.http.config...
  [javadoc] Loading source files for package org.apache.jmeter.protocol.http.config.gui...
  [javadoc] Loading source files for package org.apache.jmeter.protocol.http.control...
  [javadoc] Loading source files for package org.apache.jmeter.protocol.http.control.gui...
  [javadoc] Loading source files for package org.apache.jmeter.protocol.http.gui...
  [javadoc] Loading source files for package org.apache.jmeter.protocol.http.modifier...
  [javadoc] Loading source files for package org.apache.jmeter.protocol.http.modifier.gui...
  [javadoc] Loading source files for package org.apache.jmeter.protocol.http.parser...
  [javadoc] Loading source files for package org.apache.jmeter.protocol.http.proxy...
  [javadoc] Loading source files for package org.apache.jmeter.protocol.http.proxy.gui...
  [javadoc] Loading source files for package org.apache.jmeter.protocol.http.sampler...
  [javadoc] Loading source files for package org.apache.jmeter.protocol.http.util...
  [javadoc] Loading source files for package org.apache.jmeter.protocol.http.util.accesslog...
  [javadoc] Loading source files for package org.apache.jmeter.protocol.http.visualizers...
  [javadoc] Loading source files for package org.apache.jmeter.protocol.ftp.config.gui...
  [javadoc] Loading source files for package org.apache.jmeter.protocol.ftp.control.gui...
  [javadoc] Loading source files for package org.apache.jmeter.protocol.ftp.sampler...
  [javadoc] Loading source files for package org.apache.jmeter.protocol.jdbc...
  [javadoc] Loading source files for package org.apache.jmeter.protocol.jdbc.config...
  [javadoc] Loading source files for package org.apache.jmeter.protocol.jdbc.processor...
  [javadoc] Loading source files for package org.apache.jmeter.protocol.jdbc.sampler...
  [javadoc] Loading source files for package org.apache.jmeter.protocol.java.config...
  [javadoc] Loading source files for package org.apache.jmeter.protocol.java.config.gui...
  [javadoc] Loading source files for package org.apache.jmeter.protocol.java.control.gui...
  [javadoc] Loading source files for package org.apache.jmeter.protocol.java.sampler...
  [javadoc] Loading source files for package org.apache.jmeter.protocol.java.test...
  [javadoc] Loading source files for package org.apache.jorphan.collections...
  [javadoc] Loading source files for package org.apache.jorphan.exec...
  [javadoc] Loading source files for package org.apache.jorphan.gui...
  [javadoc] Loading source files for package org.apache.jorphan.gui.layout...
  [javadoc] Loading source files for package org.apache.jorphan.io...
  [javadoc] Loading source files for package org.apache.jorphan.logging...
  [javadoc] Loading source files for package org.apache.jorphan.math...
  [javadoc] Loading source files for package org.apache.jorphan.reflect...
  [javadoc] Loading source files for package org.apache.jorphan.test...
  [javadoc] Loading source files for package org.apache.jorphan.util...
  [javadoc] Loading source files for package org.apache.jmeter.protocol.ldap.config.gui...
  [javadoc] Loading source files for package org.apache.jmeter.protocol.ldap.control.gui...
  [javadoc] Loading source files for package org.apache.jmeter.protocol.ldap.sampler...
  [javadoc] Loading source files for package org.apache.jmeter.protocol.tcp.config.gui...
  [javadoc] Loading source files for package org.apache.jmeter.protocol.tcp.control.gui...
  [javadoc] Loading source files for package org.apache.jmeter.protocol.tcp.sampler...
  [javadoc] Loading source files for package org.apache.jmeter.examples.sampler...
  [javadoc] Loading source files for package org.apache.jmeter.examples.sampler.gui...
  [javadoc] Loading source files for package org.apache.jmeter.examples.testbeans.example1...
  [javadoc] Loading source files for package org.apache.jmeter.examples.testbeans.example2...
  [javadoc] Loading source files for package org.apache.jmeter.examples.testbeans.example3...
  [javadoc] Loading source files for package org.apache.jmeter.protocol.mail.sampler...
  [javadoc] Loading source files for package org.apache.jmeter.protocol.mail.sampler.gui...
  [javadoc] Loading source files for package org.apache.jmeter.protocol.smtp.sampler...
  [javadoc] Loading source files for package org.apache.jmeter.protocol.smtp.sampler.gui...
  [javadoc] Loading source files for package org.apache.jmeter.protocol.smtp.sampler.protocol...
  [javadoc] Loading source files for package org.apache.jmeter.protocol.smtp.sampler.tools...
  [javadoc] Loading source files for package org.apache.jmeter.protocol.jms...
  [javadoc] Loading source files for package org.apache.jmeter.protocol.jms.client...
  [javadoc] Loading source files for package org.apache.jmeter.protocol.jms.control.gui...
  [javadoc] Loading source files for package org.apache.jmeter.protocol.jms.sampler...
  [javadoc] Loading source files for package org.apache.jmeter.protocol.system...
  [javadoc] Loading source files for package org.apache.jmeter.protocol.system.gui...
  [javadoc] Loading source files for package org.apache.jmeter.protocol.mongodb.config...
  [javadoc] Loading source files for package org.apache.jmeter.protocol.mongodb.mongo...
  [javadoc] Loading source files for package org.apache.jmeter.protocol.mongodb.sampler...
  [javadoc] Loading source files for package org.apache.jmeter.logging...
  [javadoc] Constructing Javadoc information...
  [javadoc] Standard Doclet version 1.8.0_102
  [javadoc] Building tree for all the packages and classes...
  [javadoc] <https://builds.apache.org/job/JMeter-trunk/ws/trunk/src/core/org/apache/jmeter/engine/DistributedRunner.java>:232: warning: no description for @throws
  [javadoc]      * @throws RemoteException
  [javadoc]        ^
  [javadoc] <https://builds.apache.org/job/JMeter-trunk/ws/trunk/src/core/org/apache/jmeter/engine/DistributedRunner.java>:233: warning: no description for @throws
  [javadoc]      * @throws NotBoundException
  [javadoc]        ^
  [javadoc] <https://builds.apache.org/job/JMeter-trunk/ws/trunk/src/core/org/apache/jmeter/engine/DistributedRunner.java>:234: warning: no description for @throws
  [javadoc]      * @throws MalformedURLException
  [javadoc]        ^
  [javadoc] <https://builds.apache.org/job/JMeter-trunk/ws/trunk/src/core/org/apache/jmeter/gui/action/AbstractActionWithNoRunningTest.java>:51: warning: no description for @throws
  [javadoc]      * @throws IllegalUserActionException
  [javadoc]        ^
  [javadoc] <https://builds.apache.org/job/JMeter-trunk/ws/trunk/src/core/org/apache/jmeter/gui/util/JTextScrollPane.java>:74: warning: no description for @param
  [javadoc]      * @param foldIndicatorEnabled 
  [javadoc]        ^
  [javadoc] <https://builds.apache.org/job/JMeter-trunk/ws/trunk/src/core/org/apache/jmeter/report/core/AbstractSampleWriter.java>:63: error: @param name not found
  [javadoc]      * @param writer
  [javadoc]               ^
  [javadoc] <https://builds.apache.org/job/JMeter-trunk/ws/trunk/src/core/org/apache/jmeter/report/core/AbstractSampleWriter.java>:67: warning: no @param for newWriter
  [javadoc]     public void setWriter(Writer newWriter) {
  [javadoc]                 ^
  [javadoc] <https://builds.apache.org/job/JMeter-trunk/ws/trunk/src/core/org/apache/jmeter/report/core/Sample.java>:105: warning: no @param for <TData>
  [javadoc]     public <TData> TData getData(Class<TData> clazz, int index, String fieldName) {
  [javadoc]                          ^
  [javadoc] <https://builds.apache.org/job/JMeter-trunk/ws/trunk/src/core/org/apache/jmeter/report/core/Sample.java>:123: warning: no @param for <TData>
  [javadoc]     public <TData> TData getData(Class<TData> clazz, String name) {
  [javadoc]                          ^
  [javadoc] <https://builds.apache.org/job/JMeter-trunk/ws/trunk/src/core/org/apache/jmeter/report/dashboard/AbstractDataExporter.java>:50: warning: no @param for <TValue>
  [javadoc]     protected static <TValue> TValue findValue(Class<TValue> clazz, String data,
  [javadoc]                                      ^
  [javadoc] <https://builds.apache.org/job/JMeter-trunk/ws/trunk/src/core/org/apache/jmeter/report/processor/ResultData.java>:33: warning: no @param for <TVisit>
  [javadoc]     <TVisit> TVisit accept(ResultDataVisitor<TVisit> visitor);
  [javadoc]                     ^
  [javadoc] <https://builds.apache.org/job/JMeter-trunk/ws/trunk/src/core/org/apache/jmeter/report/processor/ResultData.java>:33: warning: no @return
  [javadoc]     <TVisit> TVisit accept(ResultDataVisitor<TVisit> visitor);
  [javadoc]                     ^
  [javadoc] <https://builds.apache.org/job/JMeter-trunk/ws/trunk/src/protocol/http/org/apache/jmeter/protocol/http/sampler/LazySchemeSocketFactory.java>:74: warning: no description for @throws
  [javadoc]      * @throws IOException
  [javadoc]        ^
  [javadoc] <https://builds.apache.org/job/JMeter-trunk/ws/trunk/src/protocol/http/org/apache/jmeter/protocol/http/sampler/LazySchemeSocketFactory.java>:83: warning: no description for @param
  [javadoc]      * @param sock
  [javadoc]        ^
  [javadoc] <https://builds.apache.org/job/JMeter-trunk/ws/trunk/src/protocol/http/org/apache/jmeter/protocol/http/sampler/LazySchemeSocketFactory.java>:84: warning: no description for @param
  [javadoc]      * @param remoteAddress
  [javadoc]        ^
  [javadoc] <https://builds.apache.org/job/JMeter-trunk/ws/trunk/src/protocol/http/org/apache/jmeter/protocol/http/sampler/LazySchemeSocketFactory.java>:85: warning: no description for @param
  [javadoc]      * @param localAddress
  [javadoc]        ^
  [javadoc] <https://builds.apache.org/job/JMeter-trunk/ws/trunk/src/protocol/http/org/apache/jmeter/protocol/http/sampler/LazySchemeSocketFactory.java>:86: warning: no description for @param
  [javadoc]      * @param params
  [javadoc]        ^
  [javadoc] <https://builds.apache.org/job/JMeter-trunk/ws/trunk/src/protocol/http/org/apache/jmeter/protocol/http/sampler/LazySchemeSocketFactory.java>:88: warning: no description for @throws
  [javadoc]      * @throws IOException
  [javadoc]        ^
  [javadoc] <https://builds.apache.org/job/JMeter-trunk/ws/trunk/src/protocol/http/org/apache/jmeter/protocol/http/sampler/LazySchemeSocketFactory.java>:89: warning: no description for @throws
  [javadoc]      * @throws UnknownHostException
  [javadoc]        ^
  [javadoc] <https://builds.apache.org/job/JMeter-trunk/ws/trunk/src/protocol/http/org/apache/jmeter/protocol/http/sampler/LazySchemeSocketFactory.java>:90: warning: no description for @throws
  [javadoc]      * @throws ConnectTimeoutException
  [javadoc]        ^
  [javadoc] <https://builds.apache.org/job/JMeter-trunk/ws/trunk/src/protocol/http/org/apache/jmeter/protocol/http/sampler/LazySchemeSocketFactory.java>:101: warning: no description for @param
  [javadoc]      * @param sock
  [javadoc]        ^
  [javadoc] <https://builds.apache.org/job/JMeter-trunk/ws/trunk/src/protocol/http/org/apache/jmeter/protocol/http/sampler/LazySchemeSocketFactory.java>:103: warning: no description for @throws
  [javadoc]      * @throws IllegalArgumentException
  [javadoc]        ^
  [javadoc] <https://builds.apache.org/job/JMeter-trunk/ws/trunk/src/protocol/http/org/apache/jmeter/protocol/http/sampler/LazySchemeSocketFactory.java>:113: warning: no description for @param
  [javadoc]      * @param target 
  [javadoc]        ^
  [javadoc] <https://builds.apache.org/job/JMeter-trunk/ws/trunk/src/protocol/http/org/apache/jmeter/protocol/http/sampler/LazySchemeSocketFactory.java>:114: warning: no description for @param
  [javadoc]      * @param port 
  [javadoc]        ^
  [javadoc] Building index for all the packages and classes...
  [javadoc] Building index for all classes...
  [javadoc] Generating <https://builds.apache.org/job/JMeter-trunk/ws/trunk/docs/api/help-doc.html...>
  [javadoc] 1 error
  [javadoc] 23 warnings

compile-tests:
    [javac] Compiling 138 source files to <https://builds.apache.org/job/JMeter-trunk/ws/trunk/build/test>
    [javac] Note: Some input files use or override a deprecated API.
    [javac] Note: Recompile with -Xlint:deprecation for details.

_test:
     [echo] 
     [echo]    gump.run = false
     [echo]    java.awt.headless = true
     [echo]    test.headless = true
     [echo]    user.dir = <https://builds.apache.org/job/JMeter-trunk/ws/trunk>
     [echo]    basedir = <https://builds.apache.org/job/JMeter-trunk/ws/trunk>
     [echo]    test dir = build/test
     [echo]    test dir gump = build/test
     [echo]    testsaveservice.saveout = ${testsaveservice.saveout}
     [echo]    test.encoding = UTF-8
     [echo]     
     [java] Setting JMeterHome: <https://builds.apache.org/job/JMeter-trunk/ws/trunk>
     [java] Setting up logging props using file: <https://builds.apache.org/job/JMeter-trunk/ws/trunk/bin/jmeter.properties>
     [java] Writing log file to: <https://builds.apache.org/job/JMeter-trunk/ws/trunk/bin/jmeter.log>
     [java] Using initializeProperties() from org.apache.jmeter.util.JMeterUtils
     [java] Setting up initial properties using: <https://builds.apache.org/job/JMeter-trunk/ws/trunk/bin/jmeter.properties>
     [java] Initializing Properties: <https://builds.apache.org/job/JMeter-trunk/ws/trunk/bin/jmeter.properties>
     [java] Writing log file to: <https://builds.apache.org/job/JMeter-trunk/ws/trunk/bin/jmeter.log>
     [java] JMeterVersion=3.2-SNAPSHOT
     [java] java.version=1.8.0_102
     [java] java.home=/usr/local/asfpackages/java/jdk1.8.0_102/jre
     [java] file.encoding=UTF-8
     [java] default encoding=UTF-8
     [java] user.dir=<https://builds.apache.org/job/JMeter-trunk/ws/trunk/bin>
     [java] Locale=en_US
     [java] os.name=Linux
     [java] os.version=3.13.0-98-generic
     [java] JCE max key length = 128
     [java] +++++++++++
     [java] java.awt.headless=true
     [java] java.awt.graphicsenv=sun.awt.X11GraphicsEnvironment
     [java] ------------
     [java] Searching junit tests in : build/test
     [java] o.a.j.junit.JMeterTest INFO: JMeterGUIComponent: skipping some tests org.apache.jmeter.testbeans.gui.TestBeanGUI
     [java] o.a.j.junit.JMeterTest Error creating org.apache.jmeter.config.gui.RowDetailDialog java.awt.HeadlessException
     [java] o.a.j.junit.JMeterTest Error creating org.apache.jmeter.functions.gui.FunctionHelper java.awt.HeadlessException
     [java] o.a.j.junit.JMeterTest Error creating org.apache.jmeter.gui.MainFrame java.awt.HeadlessException
     [java] o.a.j.junit.JMeterTest Error creating org.apache.jmeter.gui.SavePropertyDialog java.awt.HeadlessException
     [java] o.a.j.junit.JMeterTest Error creating org.apache.jmeter.gui.action.SearchTreeDialog java.awt.HeadlessException
     [java] o.a.j.junit.JMeterTest Error creating org.apache.jmeter.gui.action.SelectTemplatesDialog java.awt.HeadlessException
     [java] o.a.j.junit.JMeterTest Error creating org.apache.jmeter.gui.util.EscapeDialog java.awt.HeadlessException
     [java] o.a.j.junit.JMeterTest Error creating org.apache.jmeter.gui.util.JSyntaxTextArea java.awt.HeadlessException
     [java] o.a.j.junit.JMeterTest WARN: java.io.Serializable: NoSuchMethodException  org.apache.jmeter.protocol.http.parser.CSSParseExceptionCallback, missing empty Constructor or Constructor with Object parameter
     [java] ...................................................................................................................................................................................................................................................................................................................................................................................................................................................................................................................................................................................................................................................................................................................................................................................................................................................................................................................................................................................................................................................................................................................................................................................................E......................................................................................................................................................................................................................................................................................................................................................................................................................................................................................................................................................................................................................................................................................................................................................................................................................................................................................................................................................................................................................................................................................................................................................................................................................................................................I.......................................................................................................................................................................................................................................................
     [java] Time: 68.416
     [java] There was 1 failure:
     [java] 1) testCacheHttpClientBug51932(org.apache.jmeter.protocol.http.control.TestCacheManagerHC4)
     [java] java.lang.AssertionError: Should not find valid entry
     [java] 	at org.junit.Assert.fail(Assert.java:88)
     [java] 	at org.junit.Assert.assertTrue(Assert.java:41)
     [java] 	at org.junit.Assert.assertFalse(Assert.java:64)
     [java] 	at org.apache.jmeter.protocol.http.control.TestCacheManagerBase.testCacheHttpClientBug51932(TestCacheManagerBase.java:290)
     [java] 	at sun.reflect.NativeMethodAccessorImpl.invoke0(Native Method)
     [java] 	at sun.reflect.NativeMethodAccessorImpl.invoke(NativeMethodAccessorImpl.java:62)
     [java] 	at sun.reflect.DelegatingMethodAccessorImpl.invoke(DelegatingMethodAccessorImpl.java:43)
     [java] 	at java.lang.reflect.Method.invoke(Method.java:498)
     [java] 	at org.junit.runners.model.FrameworkMethod$1.runReflectiveCall(FrameworkMethod.java:50)
     [java] 	at org.junit.internal.runners.model.ReflectiveCallable.run(ReflectiveCallable.java:12)
     [java] 	at org.junit.runners.model.FrameworkMethod.invokeExplosively(FrameworkMethod.java:47)
     [java] 	at org.junit.internal.runners.statements.InvokeMethod.evaluate(InvokeMethod.java:17)
     [java] 	at org.junit.internal.runners.statements.RunBefores.evaluate(RunBefores.java:26)
     [java] 	at org.junit.internal.runners.statements.RunAfters.evaluate(RunAfters.java:27)
     [java] 	at org.junit.runners.ParentRunner.runLeaf(ParentRunner.java:325)
     [java] 	at org.junit.runners.BlockJUnit4ClassRunner.runChild(BlockJUnit4ClassRunner.java:78)
     [java] 	at org.junit.runners.BlockJUnit4ClassRunner.runChild(BlockJUnit4ClassRunner.java:57)
     [java] 	at org.junit.runners.ParentRunner$3.run(ParentRunner.java:290)
     [java] 	at org.junit.runners.ParentRunner$1.schedule(ParentRunner.java:71)
     [java] 	at org.junit.runners.ParentRunner.runChildren(ParentRunner.java:288)
     [java] 	at org.junit.runners.ParentRunner.access$000(ParentRunner.java:58)
     [java] 	at org.junit.runners.ParentRunner$2.evaluate(ParentRunner.java:268)
     [java] 	at org.junit.runners.ParentRunner.run(ParentRunner.java:363)
     [java] 	at org.junit.runners.Suite.runChild(Suite.java:128)
     [java] 	at org.junit.runners.Suite.runChild(Suite.java:27)
     [java] 	at org.junit.runners.ParentRunner$3.run(ParentRunner.java:290)
     [java] 	at org.junit.runners.ParentRunner$1.schedule(ParentRunner.java:71)
     [java] 	at org.junit.runners.ParentRunner.runChildren(ParentRunner.java:288)
     [java] 	at org.junit.runners.ParentRunner.access$000(ParentRunner.java:58)
     [java] 	at org.junit.runners.ParentRunner$2.evaluate(ParentRunner.java:268)
     [java] 	at org.junit.runners.ParentRunner.run(ParentRunner.java:363)
     [java] 	at org.junit.runner.JUnitCore.run(JUnitCore.java:137)
     [java] 	at org.junit.runner.JUnitCore.run(JUnitCore.java:115)
     [java] 	at org.apache.jorphan.test.AllTests.main(AllTests.java:222)
     [java] 
     [java] FAILURES!!!
     [java] Tests run: 2624,  Failures: 1
     [java] 

BUILD FAILED
<https://builds.apache.org/job/JMeter-trunk/ws/trunk/build.xml>:2756: Java returned: 1

Total time: 2 minutes 53 seconds
Build step 'Invoke Ant' marked build as failure
[locks-and-latches] Releasing all the locks
[locks-and-latches] All the locks released
Archiving artifacts

Jenkins build is back to normal : JMeter-trunk #5618

Posted by Apache Jenkins Server <je...@builds.apache.org>.
See <https://builds.apache.org/job/JMeter-trunk/5618/>


Build failed in Jenkins: JMeter-trunk #5617

Posted by Apache Jenkins Server <je...@builds.apache.org>.
See <https://builds.apache.org/job/JMeter-trunk/5617/changes>

Changes:

[pmouawad] Comment on issue

------------------------------------------
[...truncated 1869 lines...]
     [echo] Checksum OK: xmlpull-1.1.3.1.jar

_check_jarfile:

_check_exists:

_checkMD5:
     [echo] Checksum OK: xpp3_min-1.1.4c.jar

_check_jarfile:

_check_exists:

_checkMD5:
     [echo] Checksum OK: xstream-1.4.9.jar

_check_jarfile:

_check_exists:

_checkMD5:
     [echo] Checksum OK: org.jacoco.ant-0.7.7.201606060606-nodeps.jar

_check_jarfile:

_check_exists:

_checkMD5:
     [echo] Checksum OK: sonarqube-ant-task-2.5.jar

_check_jarfile:

_distribution:
     [echo] Creating JMeter distribution apache-jmeter-3.2-SNAPSHOT 1775561

_filter:
      [tar] Building tar: <https://builds.apache.org/job/JMeter-trunk/5617/artifact/trunk/dist/apache-jmeter-3.2-SNAPSHOT.tar>
     [gzip] Building: <https://builds.apache.org/job/JMeter-trunk/5617/artifact/trunk/dist/apache-jmeter-3.2-SNAPSHOT.tgz>
   [delete] Deleting: <https://builds.apache.org/job/JMeter-trunk/5617/artifact/trunk/dist/apache-jmeter-3.2-SNAPSHOT.tar>

_hash:
     [echo] Creating MD5 for dist/apache-jmeter-3.2-SNAPSHOT.tgz
     [echo] Creating SHA for dist/apache-jmeter-3.2-SNAPSHOT.tgz

_filter:
     [echo] Converting work files to eol=crlf in dist/crlf
    [mkdir] Created dir: <https://builds.apache.org/job/JMeter-trunk/ws/trunk/dist/crlf>
     [copy] Copying 1524 files to <https://builds.apache.org/job/JMeter-trunk/ws/trunk/dist/crlf>
      [zip] Building zip: <https://builds.apache.org/job/JMeter-trunk/5617/artifact/trunk/dist/apache-jmeter-3.2-SNAPSHOT.zip>

_hash:
     [echo] Creating MD5 for dist/apache-jmeter-3.2-SNAPSHOT.zip
     [echo] Creating SHA for dist/apache-jmeter-3.2-SNAPSHOT.zip
   [delete] Deleting directory <https://builds.apache.org/job/JMeter-trunk/ws/trunk/dist/crlf>

_filter:
      [tar] Building tar: <https://builds.apache.org/job/JMeter-trunk/5617/artifact/trunk/dist/apache-jmeter-3.2-SNAPSHOT_src.tar>
     [gzip] Building: <https://builds.apache.org/job/JMeter-trunk/5617/artifact/trunk/dist/apache-jmeter-3.2-SNAPSHOT_src.tgz>
   [delete] Deleting: <https://builds.apache.org/job/JMeter-trunk/5617/artifact/trunk/dist/apache-jmeter-3.2-SNAPSHOT_src.tar>

_hash:
     [echo] Creating MD5 for dist/apache-jmeter-3.2-SNAPSHOT_src.tgz
     [echo] Creating SHA for dist/apache-jmeter-3.2-SNAPSHOT_src.tgz

_filter:
     [echo] Converting work files to eol=crlf in dist/crlf
    [mkdir] Created dir: <https://builds.apache.org/job/JMeter-trunk/ws/trunk/dist/crlf>
     [copy] Copying 1586 files to <https://builds.apache.org/job/JMeter-trunk/ws/trunk/dist/crlf>
      [zip] Building zip: <https://builds.apache.org/job/JMeter-trunk/5617/artifact/trunk/dist/apache-jmeter-3.2-SNAPSHOT_src.zip>

_hash:
     [echo] Creating MD5 for dist/apache-jmeter-3.2-SNAPSHOT_src.zip
     [echo] Creating SHA for dist/apache-jmeter-3.2-SNAPSHOT_src.zip
   [delete] Deleting directory <https://builds.apache.org/job/JMeter-trunk/ws/trunk/dist/crlf>

nightly:

_check_3rdparty:

_message_3rdParty:

compile-slf4j_logkit:

init-version:
     [echo] jmeter.version = 3.2-SNAPSHOT
     [echo] display.version = 3.2-SNAPSHOT
     [echo] implementation.version = 3.2-SNAPSHOT

compile-jorphan:

compile-core:

compile-components:

compile-functions:

compile-http:

compile-ftp:

compile-jdbc:

compile-java:

compile-ldap:

create-mail-dir:

compile-mail:

compile-tcp:

compile-protocols:

compile-junit:

compile-jms:

compile-native:

compile-mongodb:

compile:

compile-tests:

prepare-resources:
     [copy] Copying 3 files to <https://builds.apache.org/job/JMeter-trunk/ws/trunk/build/res/META-INF>

package-only:
      [jar] Building jar: <https://builds.apache.org/job/JMeter-trunk/ws/trunk/bin/ApacheJMeter.jar>
      [jar] Building jar: <https://builds.apache.org/job/JMeter-trunk/ws/trunk/lib/ext/ApacheJMeter_core.jar>
      [jar] Building jar: <https://builds.apache.org/job/JMeter-trunk/ws/trunk/lib/ext/ApacheJMeter_components.jar>
      [jar] Building jar: <https://builds.apache.org/job/JMeter-trunk/ws/trunk/lib/ext/ApacheJMeter_functions.jar>
      [jar] Building jar: <https://builds.apache.org/job/JMeter-trunk/ws/trunk/lib/ext/ApacheJMeter_http.jar>
      [jar] Building jar: <https://builds.apache.org/job/JMeter-trunk/ws/trunk/lib/ext/ApacheJMeter_ftp.jar>
      [jar] Building jar: <https://builds.apache.org/job/JMeter-trunk/ws/trunk/lib/ext/ApacheJMeter_jdbc.jar>
      [jar] Building jar: <https://builds.apache.org/job/JMeter-trunk/ws/trunk/lib/ext/ApacheJMeter_java.jar>
      [jar] Building jar: <https://builds.apache.org/job/JMeter-trunk/ws/trunk/lib/bshclient.jar>
      [jar] Building jar: <https://builds.apache.org/job/JMeter-trunk/ws/trunk/lib/ext/ApacheJMeter_junit.jar>
      [jar] Building jar: <https://builds.apache.org/job/JMeter-trunk/ws/trunk/lib/junit/test.jar>
      [jar] Building jar: <https://builds.apache.org/job/JMeter-trunk/ws/trunk/lib/ext/ApacheJMeter_ldap.jar>
      [jar] Building jar: <https://builds.apache.org/job/JMeter-trunk/ws/trunk/lib/ext/ApacheJMeter_mail.jar>
      [jar] Building jar: <https://builds.apache.org/job/JMeter-trunk/ws/trunk/lib/ext/ApacheJMeter_tcp.jar>
      [jar] Building jar: <https://builds.apache.org/job/JMeter-trunk/ws/trunk/lib/ext/ApacheJMeter_jms.jar>
      [jar] Building jar: <https://builds.apache.org/job/JMeter-trunk/ws/trunk/lib/ext/ApacheJMeter_native.jar>
      [jar] Building jar: <https://builds.apache.org/job/JMeter-trunk/ws/trunk/lib/ext/ApacheJMeter_mongodb.jar>
      [jar] Building jar: <https://builds.apache.org/job/JMeter-trunk/ws/trunk/lib/ApacheJMeter_slf4j_logkit.jar>
      [jar] Building jar: <https://builds.apache.org/job/JMeter-trunk/ws/trunk/lib/jorphan.jar>

package:

_test:
     [echo] 
     [echo]    gump.run = false
     [echo]    java.awt.headless = true
     [echo]    test.headless = true
     [echo]    user.dir = <https://builds.apache.org/job/JMeter-trunk/ws/trunk>
     [echo]    basedir = <https://builds.apache.org/job/JMeter-trunk/ws/trunk>
     [echo]    test dir = build/test
     [echo]    test dir gump = build/test
     [echo]    testsaveservice.saveout = ${testsaveservice.saveout}
     [echo]    test.encoding = UTF-8
     [echo]     
     [java] Setting JMeterHome: <https://builds.apache.org/job/JMeter-trunk/ws/trunk>
     [java] Setting up logging props using file: <https://builds.apache.org/job/JMeter-trunk/ws/trunk/bin/jmeter.properties>
     [java] Writing log file to: <https://builds.apache.org/job/JMeter-trunk/ws/trunk/bin/jmeter.log>
     [java] Using initializeProperties() from org.apache.jmeter.util.JMeterUtils
     [java] Setting up initial properties using: <https://builds.apache.org/job/JMeter-trunk/ws/trunk/bin/jmeter.properties>
     [java] Initializing Properties: <https://builds.apache.org/job/JMeter-trunk/ws/trunk/bin/jmeter.properties>
     [java] Writing log file to: <https://builds.apache.org/job/JMeter-trunk/ws/trunk/bin/jmeter.log>
     [java] JMeterVersion=3.2-SNAPSHOT
     [java] java.version=1.8.0_102
     [java] java.home=/usr/local/asfpackages/java/jdk1.8.0_102/jre
     [java] file.encoding=UTF-8
     [java] default encoding=UTF-8
     [java] user.dir=<https://builds.apache.org/job/JMeter-trunk/ws/trunk/bin>
     [java] Locale=en_US
     [java] os.name=Linux
     [java] os.version=3.13.0-98-generic
     [java] JCE max key length = 128
     [java] +++++++++++
     [java] java.awt.headless=true
     [java] java.awt.graphicsenv=sun.awt.X11GraphicsEnvironment
     [java] ------------
     [java] Searching junit tests in : build/test
     [java] o.a.j.junit.JMeterTest INFO: JMeterGUIComponent: skipping some tests org.apache.jmeter.testbeans.gui.TestBeanGUI
     [java] o.a.j.junit.JMeterTest Error creating org.apache.jmeter.config.gui.RowDetailDialog java.awt.HeadlessException
     [java] o.a.j.junit.JMeterTest Error creating org.apache.jmeter.functions.gui.FunctionHelper java.awt.HeadlessException
     [java] o.a.j.junit.JMeterTest Error creating org.apache.jmeter.gui.MainFrame java.awt.HeadlessException
     [java] o.a.j.junit.JMeterTest Error creating org.apache.jmeter.gui.SavePropertyDialog java.awt.HeadlessException
     [java] o.a.j.junit.JMeterTest Error creating org.apache.jmeter.gui.action.SearchTreeDialog java.awt.HeadlessException
     [java] o.a.j.junit.JMeterTest Error creating org.apache.jmeter.gui.action.SelectTemplatesDialog java.awt.HeadlessException
     [java] o.a.j.junit.JMeterTest Error creating org.apache.jmeter.gui.util.EscapeDialog java.awt.HeadlessException
     [java] o.a.j.junit.JMeterTest Error creating org.apache.jmeter.gui.util.JSyntaxTextArea java.awt.HeadlessException
     [java] o.a.j.junit.JMeterTest WARN: java.io.Serializable: NoSuchMethodException  org.apache.jmeter.protocol.http.parser.CSSParseExceptionCallback, missing empty Constructor or Constructor with Object parameter
     [java] ......................................................................................................................................................................................................................................................................................................................................................................................................................................................................................................................................................................................................................................................................................................................................................................................................................................................................................................................................................................................................................................................................................................................................................................................................................E...................................................................................................................................................................................................................................................................................................................................................................................................................................................................................................................................................................................................................................................................................................................................................................................................................................................................................................................................................................................................................................................................................................................................................................................................................................................I.......................................................................................................................................................................................................................................................
     [java] Time: 67.493
     [java] There was 1 failure:
     [java] 1) testPrivateCache(org.apache.jmeter.protocol.http.control.TestCacheManagerHC4)
     [java] java.lang.AssertionError: Should not find valid entry
     [java] 	at org.junit.Assert.fail(Assert.java:88)
     [java] 	at org.junit.Assert.assertTrue(Assert.java:41)
     [java] 	at org.junit.Assert.assertFalse(Assert.java:64)
     [java] 	at org.apache.jmeter.protocol.http.control.TestCacheManagerBase.testPrivateCache(TestCacheManagerBase.java:211)
     [java] 	at sun.reflect.NativeMethodAccessorImpl.invoke0(Native Method)
     [java] 	at sun.reflect.NativeMethodAccessorImpl.invoke(NativeMethodAccessorImpl.java:62)
     [java] 	at sun.reflect.DelegatingMethodAccessorImpl.invoke(DelegatingMethodAccessorImpl.java:43)
     [java] 	at java.lang.reflect.Method.invoke(Method.java:498)
     [java] 	at org.junit.runners.model.FrameworkMethod$1.runReflectiveCall(FrameworkMethod.java:50)
     [java] 	at org.junit.internal.runners.model.ReflectiveCallable.run(ReflectiveCallable.java:12)
     [java] 	at org.junit.runners.model.FrameworkMethod.invokeExplosively(FrameworkMethod.java:47)
     [java] 	at org.junit.internal.runners.statements.InvokeMethod.evaluate(InvokeMethod.java:17)
     [java] 	at org.junit.internal.runners.statements.RunBefores.evaluate(RunBefores.java:26)
     [java] 	at org.junit.internal.runners.statements.RunAfters.evaluate(RunAfters.java:27)
     [java] 	at org.junit.runners.ParentRunner.runLeaf(ParentRunner.java:325)
     [java] 	at org.junit.runners.BlockJUnit4ClassRunner.runChild(BlockJUnit4ClassRunner.java:78)
     [java] 	at org.junit.runners.BlockJUnit4ClassRunner.runChild(BlockJUnit4ClassRunner.java:57)
     [java] 	at org.junit.runners.ParentRunner$3.run(ParentRunner.java:290)
     [java] 	at org.junit.runners.ParentRunner$1.schedule(ParentRunner.java:71)
     [java] 	at org.junit.runners.ParentRunner.runChildren(ParentRunner.java:288)
     [java] 	at org.junit.runners.ParentRunner.access$000(ParentRunner.java:58)
     [java] 	at org.junit.runners.ParentRunner$2.evaluate(ParentRunner.java:268)
     [java] 	at org.junit.runners.ParentRunner.run(ParentRunner.java:363)
     [java] 	at org.junit.runners.Suite.runChild(Suite.java:128)
     [java] 	at org.junit.runners.Suite.runChild(Suite.java:27)
     [java] 	at org.junit.runners.ParentRunner$3.run(ParentRunner.java:290)
     [java] 	at org.junit.runners.ParentRunner$1.schedule(ParentRunner.java:71)
     [java] 	at org.junit.runners.ParentRunner.runChildren(ParentRunner.java:288)
     [java] 	at org.junit.runners.ParentRunner.access$000(ParentRunner.java:58)
     [java] 	at org.junit.runners.ParentRunner$2.evaluate(ParentRunner.java:268)
     [java] 	at org.junit.runners.ParentRunner.run(ParentRunner.java:363)
     [java] 	at org.junit.runner.JUnitCore.run(JUnitCore.java:137)
     [java] 	at org.junit.runner.JUnitCore.run(JUnitCore.java:115)
     [java] 	at org.apache.jorphan.test.AllTests.main(AllTests.java:222)
     [java] 
     [java] FAILURES!!!
     [java] Tests run: 2624,  Failures: 1
     [java] 

BUILD FAILED
<https://builds.apache.org/job/JMeter-trunk/ws/trunk/build.xml>:2756: Java returned: 1

Total time: 6 minutes 17 seconds
Build step 'Invoke Ant' marked build as failure
[locks-and-latches] Releasing all the locks
[locks-and-latches] All the locks released
Archiving artifacts
Compressed 125.45 MB of artifacts by 28.2% relative to #5614