You are viewing a plain text version of this content. The canonical link for it is here.
Posted to dev@brooklyn.apache.org by Apache Jenkins Server <je...@builds.apache.org> on 2018/01/19 16:22:55 UTC

Build failed in Jenkins: brooklyn-master-build-docker #166

See <https://builds.apache.org/job/brooklyn-master-build-docker/166/display/redirect>

------------------------------------------
[...truncated 7.04 MB...]
	at org.apache.brooklyn.core.test.entity.LocalManagementContextForTests$Builder.build(LocalManagementContextForTests.java:185)
	at org.apache.brooklyn.camp.brooklyn.AbstractYamlTest.newTestManagementContext(AbstractYamlTest.java:117)
	at org.apache.brooklyn.camp.brooklyn.AbstractYamlTest$1.newMgmtContext(AbstractYamlTest.java:103)
	at org.apache.brooklyn.camp.brooklyn.BrooklynCampPlatformLauncherAbstract.launch(BrooklynCampPlatformLauncherAbstract.java:48)
	at org.apache.brooklyn.camp.brooklyn.AbstractYamlTest.setUpPlatform(AbstractYamlTest.java:106)
	at org.apache.brooklyn.camp.brooklyn.AbstractYamlTest.setUp(AbstractYamlTest.java:95)
	at sun.reflect.GeneratedMethodAccessor93.invoke(Unknown Source)
	at sun.reflect.DelegatingMethodAccessorImpl.invoke(DelegatingMethodAccessorImpl.java:43)
	at java.lang.reflect.Method.invoke(Method.java:498)
	at org.testng.internal.MethodInvocationHelper.invokeMethod(MethodInvocationHelper.java:104)
	at org.testng.internal.Invoker.invokeConfigurationMethod(Invoker.java:515)
	at org.testng.internal.Invoker.invokeConfigurations(Invoker.java:217)
	at org.testng.internal.Invoker.invokeMethod(Invoker.java:590)
	at org.testng.internal.Invoker.invokeTestMethod(Invoker.java:851)
	at org.testng.internal.Invoker.invokeTestMethods(Invoker.java:1177)
	at org.testng.internal.TestMethodWorker.invokeTestMethods(TestMethodWorker.java:129)
	at org.testng.internal.TestMethodWorker.run(TestMethodWorker.java:112)
	at org.testng.TestRunner.privateRun(TestRunner.java:756)
	at org.testng.TestRunner.run(TestRunner.java:610)
	at org.testng.SuiteRunner.runTest(SuiteRunner.java:387)
	at org.testng.SuiteRunner.runSequentially(SuiteRunner.java:382)
	at org.testng.SuiteRunner.privateRun(SuiteRunner.java:340)
	at org.testng.SuiteRunner.run(SuiteRunner.java:289)
	at org.testng.SuiteRunnerWorker.runSuite(SuiteRunnerWorker.java:52)
	at org.testng.SuiteRunnerWorker.run(SuiteRunnerWorker.java:86)
	at org.testng.TestNG.runSuitesSequentially(TestNG.java:1293)
	at org.testng.TestNG.runSuitesLocally(TestNG.java:1218)
	at org.testng.TestNG.runSuites(TestNG.java:1133)
	at org.testng.TestNG.run(TestNG.java:1104)
	at org.apache.maven.surefire.testng.TestNGExecutor.run(TestNGExecutor.java:132)
	at org.apache.maven.surefire.testng.TestNGDirectoryTestSuite.executeMulti(TestNGDirectoryTestSuite.java:193)
	at org.apache.maven.surefire.testng.TestNGDirectoryTestSuite.execute(TestNGDirectoryTestSuite.java:94)
	at org.apache.maven.surefire.testng.TestNGProvider.invoke(TestNGProvider.java:147)
	at org.apache.maven.surefire.booter.ForkedBooter.invokeProviderInSameClassLoader(ForkedBooter.java:290)
	at org.apache.maven.surefire.booter.ForkedBooter.runSuitesInProcess(ForkedBooter.java:242)
	at org.apache.maven.surefire.booter.ForkedBooter.main(ForkedBooter.java:121)

2018-01-19 16:22:14,281 WARN  Management Context LocalManagementContext[?-bKWJCEcM] running, creation stacktrace:
java.lang.Throwable: for construction stacktrace
	at org.apache.brooklyn.core.mgmt.internal.LocalManagementContext.<init>(LocalManagementContext.java:141)
	at org.apache.brooklyn.core.mgmt.internal.LocalManagementContext.<init>(LocalManagementContext.java:163)
	at org.apache.brooklyn.core.mgmt.internal.LocalManagementContext.<init>(LocalManagementContext.java:159)
	at org.apache.brooklyn.core.test.entity.LocalManagementContextForTests.<init>(LocalManagementContextForTests.java:45)
	at org.apache.brooklyn.core.test.entity.LocalManagementContextForTests$Builder.build(LocalManagementContextForTests.java:185)
	at org.apache.brooklyn.camp.brooklyn.AbstractYamlTest.newTestManagementContext(AbstractYamlTest.java:117)
	at org.apache.brooklyn.camp.brooklyn.AbstractYamlTest$1.newMgmtContext(AbstractYamlTest.java:103)
	at org.apache.brooklyn.camp.brooklyn.BrooklynCampPlatformLauncherAbstract.launch(BrooklynCampPlatformLauncherAbstract.java:48)
	at org.apache.brooklyn.camp.brooklyn.AbstractYamlTest.setUpPlatform(AbstractYamlTest.java:106)
	at org.apache.brooklyn.camp.brooklyn.AbstractYamlTest.setUp(AbstractYamlTest.java:95)
	at sun.reflect.GeneratedMethodAccessor93.invoke(Unknown Source)
	at sun.reflect.DelegatingMethodAccessorImpl.invoke(DelegatingMethodAccessorImpl.java:43)
	at java.lang.reflect.Method.invoke(Method.java:498)
	at org.testng.internal.MethodInvocationHelper.invokeMethod(MethodInvocationHelper.java:104)
	at org.testng.internal.Invoker.invokeConfigurationMethod(Invoker.java:515)
	at org.testng.internal.Invoker.invokeConfigurations(Invoker.java:217)
	at org.testng.internal.Invoker.invokeMethod(Invoker.java:590)
	at org.testng.internal.Invoker.invokeTestMethod(Invoker.java:851)
	at org.testng.internal.Invoker.invokeTestMethods(Invoker.java:1177)
	at org.testng.internal.TestMethodWorker.invokeTestMethods(TestMethodWorker.java:129)
	at org.testng.internal.TestMethodWorker.run(TestMethodWorker.java:112)
	at org.testng.TestRunner.privateRun(TestRunner.java:756)
	at org.testng.TestRunner.run(TestRunner.java:610)
	at org.testng.SuiteRunner.runTest(SuiteRunner.java:387)
	at org.testng.SuiteRunner.runSequentially(SuiteRunner.java:382)
	at org.testng.SuiteRunner.privateRun(SuiteRunner.java:340)
	at org.testng.SuiteRunner.run(SuiteRunner.java:289)
	at org.testng.SuiteRunnerWorker.runSuite(SuiteRunnerWorker.java:52)
	at org.testng.SuiteRunnerWorker.run(SuiteRunnerWorker.java:86)
	at org.testng.TestNG.runSuitesSequentially(TestNG.java:1293)
	at org.testng.TestNG.runSuitesLocally(TestNG.java:1218)
	at org.testng.TestNG.runSuites(TestNG.java:1133)
	at org.testng.TestNG.run(TestNG.java:1104)
	at org.apache.maven.surefire.testng.TestNGExecutor.run(TestNGExecutor.java:132)
	at org.apache.maven.surefire.testng.TestNGDirectoryTestSuite.executeMulti(TestNGDirectoryTestSuite.java:193)
	at org.apache.maven.surefire.testng.TestNGDirectoryTestSuite.execute(TestNGDirectoryTestSuite.java:94)
	at org.apache.maven.surefire.testng.TestNGProvider.invoke(TestNGProvider.java:147)
	at org.apache.maven.surefire.booter.ForkedBooter.invokeProviderInSameClassLoader(ForkedBooter.java:290)
	at org.apache.maven.surefire.booter.ForkedBooter.runSuitesInProcess(ForkedBooter.java:242)
	at org.apache.maven.surefire.booter.ForkedBooter.main(ForkedBooter.java:121)

2018-01-19 16:22:14,281 INFO  BrooklynLeakListener.onFinish attempting to terminate all extant ManagementContexts: name=Surefire test; includedGroups=[]; excludedGroups=[Integration, Acceptance, Live, Live-sanity, WIP, Broken]; suiteName=Surefire suite; outDir=/usr/build/brooklyn-server/camp/camp-brooklyn/target/surefire-reports/Surefire suite: 4 ManagementContexts terminated
2018-01-19 16:22:14,282 INFO  TESTNG 
===============================================
    Surefire test
    Tests run: 795, Failures: 1, Skips: 0
===============================================
[GC (Allocation Failure)  404051K->180629K(765952K), 0.0784700 secs]
Tests run: 795, Failures: 1, Errors: 0, Skipped: 0, Time elapsed: 159.263 sec <<< FAILURE! - in TestSuite
testDisableSshPolling(org.apache.brooklyn.camp.brooklyn.VanillaSoftwareProcessYamlTest)  Time elapsed: 31.324 sec  <<< FAILURE!
java.lang.AssertionError: failed succeeds-eventually, 75 attempts, 30001ms elapsed: AssertionError: actual=[starting, running]; expected=[created, starting, running]: lists don't have the same size expected [3] but found [2]
	at org.apache.brooklyn.camp.brooklyn.VanillaSoftwareProcessYamlTest.assertEventsEqualEventually(VanillaSoftwareProcessYamlTest.java:261)
	at org.apache.brooklyn.camp.brooklyn.VanillaSoftwareProcessYamlTest.testDisableSshPolling(VanillaSoftwareProcessYamlTest.java:173)
Caused by: java.lang.AssertionError: actual=[starting, running]; expected=[created, starting, running]: lists don't have the same size expected [3] but found [2]
	at org.apache.brooklyn.camp.brooklyn.VanillaSoftwareProcessYamlTest.assertIterablesEqual(VanillaSoftwareProcessYamlTest.java:278)
	at org.apache.brooklyn.camp.brooklyn.VanillaSoftwareProcessYamlTest.access$100(VanillaSoftwareProcessYamlTest.java:64)
	at org.apache.brooklyn.camp.brooklyn.VanillaSoftwareProcessYamlTest.assertEventsEqualEventually(VanillaSoftwareProcessYamlTest.java:261)
	at org.apache.brooklyn.camp.brooklyn.VanillaSoftwareProcessYamlTest.testDisableSshPolling(VanillaSoftwareProcessYamlTest.java:173)


Results :

Failed tests: 
  VanillaSoftwareProcessYamlTest.testDisableSshPolling:173->assertEventsEqualEventually:261 failed succeeds-eventually, 75 attempts, 30001ms elapsed: AssertionError: actual=[starting, running]; expected=[created, starting, running]: lists don't have the same size expected [3] but found [2]

Tests run: 795, Failures: 1, Errors: 0, Skipped: 0

[INFO] ------------------------------------------------------------------------
[INFO] Reactor Summary:
[INFO] 
[INFO] Brooklyn REST JavaScript Web GUI ................... SUCCESS [ 43.996 s]
[INFO] Brooklyn Server Root ............................... SUCCESS [  0.186 s]
[INFO] Brooklyn Parent Project ............................ SUCCESS [  3.159 s]
[INFO] Brooklyn Test Support Utilities .................... SUCCESS [  3.329 s]
[INFO] Brooklyn Logback Includable Configuration .......... SUCCESS [  0.345 s]
[INFO] Brooklyn Common Utilities .......................... SUCCESS [ 22.792 s]
[INFO] Brooklyn API ....................................... SUCCESS [  1.400 s]
[INFO] CAMP Server Parent Project ......................... SUCCESS [  0.769 s]
[INFO] CAMP Base .......................................... SUCCESS [  2.739 s]
[INFO] Brooklyn Test Support .............................. SUCCESS [  0.759 s]
[INFO] Brooklyn REST Swagger Apidoc Utilities ............. SUCCESS [  1.108 s]
[INFO] Brooklyn Logback Configuration ..................... SUCCESS [  0.168 s]
[INFO] CAMP Server ........................................ SUCCESS [  5.628 s]
[INFO] Brooklyn Felix Runtime ............................. SUCCESS [  3.765 s]
[INFO] Brooklyn Groovy Utilities .......................... SUCCESS [  2.666 s]
[INFO] Brooklyn Core ...................................... SUCCESS [03:10 min]
[INFO] Brooklyn Policies .................................. SUCCESS [ 32.321 s]
[INFO] Brooklyn WinRM Software Entities ................... SUCCESS [  9.934 s]
[INFO] Brooklyn Secure JMXMP Agent ........................ SUCCESS [  9.092 s]
[INFO] Brooklyn JMX RMI Agent ............................. SUCCESS [  0.360 s]
[INFO] Brooklyn Jclouds Location Targets .................. SUCCESS [ 37.370 s]
[INFO] Brooklyn Software Base ............................. SUCCESS [01:17 min]
[INFO] Brooklyn CAMP ...................................... FAILURE [02:46 min]
[INFO] Brooklyn Launcher Common ........................... SKIPPED
[INFO] Brooklyn REST API .................................. SKIPPED
[INFO] Brooklyn REST Resources ............................ SKIPPED
[INFO] Brooklyn REST Server ............................... SKIPPED
[INFO] Brooklyn Launcher .................................. SKIPPED
[INFO] Brooklyn Container Location Targets ................ SKIPPED
[INFO] Brooklyn Command Line Interface .................... SKIPPED
[INFO] Brooklyn Test Framework ............................ SKIPPED
[INFO] Brooklyn OSGi init ................................. SKIPPED
[INFO] Brooklyn OSGi start ................................ SKIPPED
[INFO] Brooklyn Karaf ..................................... SKIPPED
[INFO] Jetty config fragment .............................. SKIPPED
[INFO] Apache Http Component extension .................... SKIPPED
[INFO] Brooklyn Karaf Features ............................ SKIPPED
[INFO] Brooklyn Karaf Shell Commands ...................... SKIPPED
[INFO] Brooklyn Library Root .............................. SKIPPED
[INFO] Brooklyn CM Chef ................................... SKIPPED
[INFO] Brooklyn CM SaltStack .............................. SKIPPED
[INFO] Brooklyn CM Ansible ................................ SKIPPED
[INFO] Brooklyn CM Integration Root ....................... SKIPPED
[INFO] Brooklyn Network Software Entities ................. SKIPPED
[INFO] Brooklyn OSGi Software Entities .................... SKIPPED
[INFO] Brooklyn Database Software Entities ................ SKIPPED
[INFO] Brooklyn Web App Software Entities ................. SKIPPED
[INFO] Brooklyn Messaging Software Entities ............... SKIPPED
[INFO] Brooklyn NoSQL Data Store Software Entities ........ SKIPPED
[INFO] Brooklyn Monitoring Software Entities .............. SKIPPED
[INFO] Brooklyn Web App Software Entities ................. SKIPPED
[INFO] Brooklyn QA ........................................ SKIPPED
[INFO] Brooklyn Examples Aggregator Project ............... SKIPPED
[INFO] Brooklyn Examples Aggregator Project - Webapps ..... SKIPPED
[INFO] hello-world-webapp Maven Webapp .................... SKIPPED
[INFO] hello-world-sql-webapp Maven Webapp ................ SKIPPED
[INFO] Brooklyn Simple Web Cluster Example ................ SKIPPED
[INFO] Brooklyn Library Karaf integration ................. SKIPPED
[INFO] Brooklyn Library Catalog ........................... SKIPPED
[INFO] Brooklyn Library Karaf Features .................... SKIPPED
[INFO] Brooklyn Client .................................... SKIPPED
[INFO] Brooklyn Client Command Line Interface ............. SKIPPED
[INFO] Brooklyn REST java Client .......................... SKIPPED
[INFO] Brooklyn Downstream Project Parent ................. SKIPPED
[INFO] Brooklyn Dist Root ................................. SKIPPED
[INFO] Brooklyn All Things ................................ SKIPPED
[INFO] Brooklyn Distribution .............................. SKIPPED
[INFO] Brooklyn Karaf Distribution Parent ................. SKIPPED
[INFO] Brooklyn Karaf Server Configuration ................ SKIPPED
[INFO] Brooklyn Dist Karaf Features ....................... SKIPPED
[INFO] Brooklyn Karaf Distribution ........................ SKIPPED
[INFO] Brooklyn Karaf pax-exam itest ...................... SKIPPED
[INFO] Brooklyn Vagrant Getting Started Environment ....... SKIPPED
[INFO] Brooklyn Quick-Start Project Archetype ............. SKIPPED
[INFO] Brooklyn Shared Package Files ...................... SKIPPED
[INFO] Brooklyn RPM Package ............................... SKIPPED
[INFO] Brooklyn DEB Package ............................... SKIPPED
[INFO] Brooklyn Root ...................................... SKIPPED
[INFO] ------------------------------------------------------------------------
[INFO] BUILD FAILURE
[INFO] ------------------------------------------------------------------------
[INFO] Total time: 10:28 min
[INFO] Finished at: 2018-01-19T16:22:15Z
[INFO] Final Memory: 126M/677M
[INFO] ------------------------------------------------------------------------
[ERROR] Failed to execute goal org.apache.maven.plugins:maven-surefire-plugin:2.19.1:test (default-test) on project brooklyn-camp: There are test failures.
[ERROR] 
[ERROR] Please refer to /usr/build/brooklyn-server/camp/camp-brooklyn/target/surefire-reports for the individual test results.
[ERROR] -> [Help 1]
[ERROR] 
[ERROR] To see the full stack trace of the errors, re-run Maven with the -e switch.
[ERROR] Re-run Maven using the -X switch to enable full debug logging.
[ERROR] 
[ERROR] For more information about the errors and possible solutions, please read the following articles:
[ERROR] [Help 1] http://cwiki.apache.org/confluence/display/MAVEN/MojoFailureException
[ERROR] 
[ERROR] After correcting the problems, you can resume the build with the command
[ERROR]   mvn <goals> -rf :brooklyn-camp
Build step 'Execute shell' marked build as failure
Recording test results
TestNG Reports Processing: START
Looking for TestNG results report in workspace using pattern: **/testng-results.xml
testng-results.xml was last modified before this build started. Ignoring it.
testng-results.xml was last modified before this build started. Ignoring it.
testng-results.xml was last modified before this build started. Ignoring it.
testng-results.xml was last modified before this build started. Ignoring it.
testng-results.xml was last modified before this build started. Ignoring it.
testng-results.xml was last modified before this build started. Ignoring it.
testng-results.xml was last modified before this build started. Ignoring it.
testng-results.xml was last modified before this build started. Ignoring it.
testng-results.xml was last modified before this build started. Ignoring it.
testng-results.xml was last modified before this build started. Ignoring it.
testng-results.xml was last modified before this build started. Ignoring it.
testng-results.xml was last modified before this build started. Ignoring it.
testng-results.xml was last modified before this build started. Ignoring it.
testng-results.xml was last modified before this build started. Ignoring it.
testng-results.xml was last modified before this build started. Ignoring it.
testng-results.xml was last modified before this build started. Ignoring it.
testng-results.xml was last modified before this build started. Ignoring it.
testng-results.xml was last modified before this build started. Ignoring it.
testng-results.xml was last modified before this build started. Ignoring it.
testng-results.xml was last modified before this build started. Ignoring it.
testng-results.xml was last modified before this build started. Ignoring it.
testng-results.xml was last modified before this build started. Ignoring it.
testng-results.xml was last modified before this build started. Ignoring it.
Saving reports...
Processing '/x1/jenkins/jenkins-home/jobs/brooklyn-master-build-docker/builds/166/testng/testng-results-1.xml'
Processing '/x1/jenkins/jenkins-home/jobs/brooklyn-master-build-docker/builds/166/testng/testng-results-10.xml'
Processing '/x1/jenkins/jenkins-home/jobs/brooklyn-master-build-docker/builds/166/testng/testng-results-11.xml'
Processing '/x1/jenkins/jenkins-home/jobs/brooklyn-master-build-docker/builds/166/testng/testng-results-2.xml'
Processing '/x1/jenkins/jenkins-home/jobs/brooklyn-master-build-docker/builds/166/testng/testng-results-3.xml'
Processing '/x1/jenkins/jenkins-home/jobs/brooklyn-master-build-docker/builds/166/testng/testng-results-4.xml'
Processing '/x1/jenkins/jenkins-home/jobs/brooklyn-master-build-docker/builds/166/testng/testng-results-5.xml'
Processing '/x1/jenkins/jenkins-home/jobs/brooklyn-master-build-docker/builds/166/testng/testng-results-6.xml'
Processing '/x1/jenkins/jenkins-home/jobs/brooklyn-master-build-docker/builds/166/testng/testng-results-7.xml'
Processing '/x1/jenkins/jenkins-home/jobs/brooklyn-master-build-docker/builds/166/testng/testng-results-8.xml'
Processing '/x1/jenkins/jenkins-home/jobs/brooklyn-master-build-docker/builds/166/testng/testng-results-9.xml'
Processing '/x1/jenkins/jenkins-home/jobs/brooklyn-master-build-docker/builds/166/testng/testng-results.xml'
0.023256% of tests failed, which exceeded threshold of 0%. Marking build as UNSTABLE
TestNG Reports Processing: FINISH

Jenkins build is back to normal : brooklyn-master-build-docker #168

Posted by Apache Jenkins Server <je...@builds.apache.org>.
See <https://builds.apache.org/job/brooklyn-master-build-docker/168/display/redirect>


Build failed in Jenkins: brooklyn-master-build-docker #167

Posted by Apache Jenkins Server <je...@builds.apache.org>.
See <https://builds.apache.org/job/brooklyn-master-build-docker/167/display/redirect>

------------------------------------------
Started by timer
[EnvInject] - Loading node environment variables.
Building remotely on H32 (ubuntu xenial) in workspace <https://builds.apache.org/job/brooklyn-master-build-docker/ws/>
 > git rev-parse --is-inside-work-tree # timeout=10
Fetching changes from the remote Git repository
 > git config remote.origin.url https://git-wip-us.apache.org/repos/asf/brooklyn.git # timeout=10
Fetching upstream changes from https://git-wip-us.apache.org/repos/asf/brooklyn.git
 > git --version # timeout=10
 > git fetch --tags --progress https://git-wip-us.apache.org/repos/asf/brooklyn.git +refs/heads/*:refs/remotes/origin/*
 > git rev-parse origin/master^{commit} # timeout=10
Checking out Revision 48dbcc3c42ac3e216db94c30edbfe98519a79d1d (origin/master)
 > git config core.sparsecheckout # timeout=10
 > git checkout -f 48dbcc3c42ac3e216db94c30edbfe98519a79d1d
Commit message: "This closes #13"
 > git rev-list 48dbcc3c42ac3e216db94c30edbfe98519a79d1d # timeout=10
 > git remote # timeout=10
 > git submodule init # timeout=10
 > git submodule sync # timeout=10
 > git config --get remote.origin.url # timeout=10
 > git submodule init # timeout=10
 > git config -f .gitmodules --get-regexp ^submodule\.(.*)\.url # timeout=10
 > git config --get submodule.brooklyn-ui.url # timeout=10
 > git config -f .gitmodules --get submodule.brooklyn-ui.path # timeout=10
 > git submodule update --init --recursive --remote brooklyn-ui
 > git config --get submodule.brooklyn-server.url # timeout=10
 > git config -f .gitmodules --get submodule.brooklyn-server.path # timeout=10
 > git submodule update --init --recursive --remote brooklyn-server
 > git config --get submodule.brooklyn-library.url # timeout=10
 > git config -f .gitmodules --get submodule.brooklyn-library.path # timeout=10
 > git submodule update --init --recursive --remote brooklyn-library
 > git config --get submodule.brooklyn-dist.url # timeout=10
 > git config -f .gitmodules --get submodule.brooklyn-dist.path # timeout=10
 > git submodule update --init --recursive --remote brooklyn-dist
 > git config --get submodule.brooklyn-docs.url # timeout=10
 > git config -f .gitmodules --get submodule.brooklyn-docs.path # timeout=10
 > git submodule update --init --recursive --remote brooklyn-docs
 > git config --get submodule.brooklyn-client.url # timeout=10
 > git config -f .gitmodules --get submodule.brooklyn-client.path # timeout=10
 > git submodule update --init --recursive --remote brooklyn-client
[brooklyn-master-build-docker] $ /bin/bash -xe /tmp/jenkins3384212819065683743.sh
+ git submodule update --remote --merge --recursive
[brooklyn-master-build-docker] $ /bin/bash -xe /tmp/jenkins1913422134780772156.sh
+ docker run -i --rm --name brooklyn -v /home/jenkins/.m2:/root/.m2 -v <https://builds.apache.org/job/brooklyn-master-build-docker/ws/>:/usr/build -w /usr/build tbouron/brooklyn-build:latest mvn clean install
Unable to find image 'tbouron/brooklyn-build:latest' locally
latest: Pulling from tbouron/brooklyn-build
bc95e04b23c0: Pulling fs layer
3cbd22648d7b: Pulling fs layer
689a1b344d36: Pulling fs layer
21d8309ec350: Pulling fs layer
c133b2f9ec79: Pulling fs layer
3736776b7752: Pulling fs layer
cd13b5d2bfb5: Pulling fs layer
21d8309ec350: Waiting
6ea5cfef258b: Pulling fs layer
5e888488e399: Pulling fs layer
c712bfa9287a: Pulling fs layer
1a3f58fe0740: Pulling fs layer
98622bcd384c: Pulling fs layer
c133b2f9ec79: Waiting
5e888488e399: Waiting
3736776b7752: Waiting
c712bfa9287a: Waiting
1a3f58fe0740: Waiting
cd13b5d2bfb5: Waiting
98622bcd384c: Waiting
689a1b344d36: Download complete
3cbd22648d7b: Verifying Checksum
3cbd22648d7b: Download complete
bc95e04b23c0: Verifying Checksum
bc95e04b23c0: Download complete
21d8309ec350: Verifying Checksum
21d8309ec350: Download complete
3736776b7752: Verifying Checksum
cd13b5d2bfb5: Verifying Checksum
cd13b5d2bfb5: Download complete
5e888488e399: Verifying Checksum
5e888488e399: Download complete
6ea5cfef258b: Verifying Checksum
6ea5cfef258b: Download complete
c712bfa9287a: Verifying Checksum
c712bfa9287a: Download complete
c133b2f9ec79: Verifying Checksum
c133b2f9ec79: Download complete
1a3f58fe0740: Verifying Checksum
1a3f58fe0740: Download complete
bc95e04b23c0: Pull complete
3cbd22648d7b: Pull complete
689a1b344d36: Pull complete
21d8309ec350: Pull complete
98622bcd384c: Verifying Checksum
98622bcd384c: Download complete
c133b2f9ec79: Pull complete
3736776b7752: Pull complete
cd13b5d2bfb5: Pull complete
6ea5cfef258b: Pull complete
5e888488e399: Pull complete
c712bfa9287a: Pull complete
1a3f58fe0740: Pull complete
98622bcd384c: Pull complete
Digest: sha256:95242c5d7a5931fe564240cd2481a1e691afdc6877eddb357e9b9316517f6ab2
Status: Downloaded newer image for tbouron/brooklyn-build:latest
[INFO] Scanning for projects...
[ERROR] [ERROR] Some problems were encountered while processing the POMs:
[ERROR] Child module /usr/build/brooklyn-dist/downstream-parent/pom.xml of /usr/build/brooklyn-dist/pom.xml does not exist @ 
 @ 
[ERROR] The build could not read 1 project -> [Help 1]
[ERROR]   
[ERROR]   The project org.apache.brooklyn:brooklyn-dist-root:1.0.0-SNAPSHOT (/usr/build/brooklyn-dist/pom.xml) has 1 error
[ERROR]     Child module /usr/build/brooklyn-dist/downstream-parent/pom.xml of /usr/build/brooklyn-dist/pom.xml does not exist
[ERROR] 
[ERROR] To see the full stack trace of the errors, re-run Maven with the -e switch.
[ERROR] Re-run Maven using the -X switch to enable full debug logging.
[ERROR] 
[ERROR] For more information about the errors and possible solutions, please read the following articles:
[ERROR] [Help 1] http://cwiki.apache.org/confluence/display/MAVEN/ProjectBuildingException
Build step 'Execute shell' marked build as failure
Recording test results
ERROR: Step ?Publish JUnit test result report? failed: Test reports were found but none of them are new. Did leafNodes run? 
For example, <https://builds.apache.org/job/brooklyn-master-build-docker/ws/brooklyn-client/java/target/surefire-reports/junitreports/TEST-org.apache.brooklyn.rest.client.BrooklynApiGetEntityTest.xml> is 1 mo 5 days old

TestNG Reports Processing: START
Looking for TestNG results report in workspace using pattern: **/testng-results.xml
testng-results.xml was last modified before this build started. Ignoring it.
testng-results.xml was last modified before this build started. Ignoring it.
testng-results.xml was last modified before this build started. Ignoring it.
testng-results.xml was last modified before this build started. Ignoring it.
testng-results.xml was last modified before this build started. Ignoring it.
testng-results.xml was last modified before this build started. Ignoring it.
testng-results.xml was last modified before this build started. Ignoring it.
testng-results.xml was last modified before this build started. Ignoring it.
testng-results.xml was last modified before this build started. Ignoring it.
testng-results.xml was last modified before this build started. Ignoring it.
testng-results.xml was last modified before this build started. Ignoring it.
testng-results.xml was last modified before this build started. Ignoring it.
testng-results.xml was last modified before this build started. Ignoring it.
testng-results.xml was last modified before this build started. Ignoring it.
testng-results.xml was last modified before this build started. Ignoring it.
testng-results.xml was last modified before this build started. Ignoring it.
testng-results.xml was last modified before this build started. Ignoring it.
testng-results.xml was last modified before this build started. Ignoring it.
testng-results.xml was last modified before this build started. Ignoring it.
testng-results.xml was last modified before this build started. Ignoring it.
testng-results.xml was last modified before this build started. Ignoring it.
testng-results.xml was last modified before this build started. Ignoring it.
testng-results.xml was last modified before this build started. Ignoring it.
testng-results.xml was last modified before this build started. Ignoring it.
testng-results.xml was last modified before this build started. Ignoring it.
testng-results.xml was last modified before this build started. Ignoring it.
testng-results.xml was last modified before this build started. Ignoring it.
testng-results.xml was last modified before this build started. Ignoring it.
testng-results.xml was last modified before this build started. Ignoring it.
testng-results.xml was last modified before this build started. Ignoring it.
testng-results.xml was last modified before this build started. Ignoring it.
testng-results.xml was last modified before this build started. Ignoring it.
testng-results.xml was last modified before this build started. Ignoring it.
testng-results.xml was last modified before this build started. Ignoring it.
testng-results.xml was last modified before this build started. Ignoring it.
Saving reports...
Found matching files but did not find any TestNG results.