You are viewing a plain text version of this content. The canonical link for it is here.
Posted to commits@flex.apache.org by fl...@gmail.com on 2016/12/12 17:45:50 UTC
Build failed in Jenkins: FlexJS ASDoc Example #2
See <http://apacheflexbuild.cloudapp.net:8080/job/FlexJS%20ASDoc%20Example/2/>
------------------------------------------
Started by user Alex Harui
Building remotely on flex_sdk_slave2 in workspace <http://apacheflexbuild.cloudapp.net:8080/job/FlexJS%20ASDoc%20Example/2/artifact/>
> C:\Program Files (x86)\Git\cmd\git.exe rev-parse --is-inside-work-tree # timeout=10
Fetching changes from the remote Git repository
> C:\Program Files (x86)\Git\cmd\git.exe config remote.origin.url https://git-wip-us.apache.org/repos/asf/flex-asjs.git # timeout=10
Fetching upstream changes from https://git-wip-us.apache.org/repos/asf/flex-asjs.git
> C:\Program Files (x86)\Git\cmd\git.exe --version # timeout=10
> C:\Program Files (x86)\Git\cmd\git.exe fetch --tags --progress https://git-wip-us.apache.org/repos/asf/flex-asjs.git +refs/heads/*:refs/remotes/origin/*
> C:\Program Files (x86)\Git\cmd\git.exe rev-parse "origin/develop^{commit}" # timeout=10
Checking out Revision e28de643dfe1ac8d61c34a08c4dff86c7e02b4a0 (origin/develop)
> C:\Program Files (x86)\Git\cmd\git.exe config core.sparsecheckout # timeout=10
> C:\Program Files (x86)\Git\cmd\git.exe checkout -f e28de643dfe1ac8d61c34a08c4dff86c7e02b4a0
> C:\Program Files (x86)\Git\cmd\git.exe rev-list e28de643dfe1ac8d61c34a08c4dff86c7e02b4a0 # timeout=10
[ASDoc] $ cmd.exe /C "c:\Jenkins\tools\hudson.tasks.Ant_AntInstallation\c_apache-ant-1.9.3\bin\ant.bat -file build.xml '"-DFLEXJS_HOME=""C:Program Files (x86)Jenkinsjobslex-asjsworkspace"""' -Dplayerglobal.version=11.7 main && exit %%ERRORLEVEL%%"
Buildfile: <http://apacheflexbuild.cloudapp.net:8080/job/FlexJS%20ASDoc%20Example/2/artifact/examples/flexjs/ASDoc/build.xml>
build_example.compile:
[echo] Compiling ASDoc.swf
[echo] FLEX_HOME: "C:Program Files (x86)Jenkinsjobslex-asjsworkspace"
[mxmlc] Error: Could not find or load main class ${mxmlc.jvm.args}
[mxmlc] Picked up JAVA_TOOL_OPTIONS: -Dfile.encoding=UTF8
BUILD FAILED
<http://apacheflexbuild.cloudapp.net:8080/job/FlexJS%20ASDoc%20Example/2/artifact/examples/build_example.xml>:135: The following error occurred while executing this line:
<http://apacheflexbuild.cloudapp.net:8080/job/FlexJS%20ASDoc%20Example/2/artifact/examples/build_example.xml>:374: Warning: Could not find file <http://apacheflexbuild.cloudapp.net:8080/job/FlexJS%20ASDoc%20Example/2/artifact/examples/flexjs/ASDoc/"C>:Program Files (x86)Jenkinsjobslex-asjsworkspace"\templates\swfobject\index.template.html to copy.
Total time: 2 seconds
Picked up JAVA_TOOL_OPTIONS: -Dfile.encoding=UTF8
Build step 'Invoke Ant' marked build as failure
Skipped archiving because build is not successful
Jenkins build is back to normal : FlexJS ASDoc Example #6
Posted by fl...@gmail.com.
See <http://apacheflexbuild.cloudapp.net:8080/job/FlexJS%20ASDoc%20Example/6/>
Build failed in Jenkins: FlexJS ASDoc Example #5
Posted by fl...@gmail.com.
See <http://apacheflexbuild.cloudapp.net:8080/job/FlexJS%20ASDoc%20Example/5/>
------------------------------------------
Started by user Alex Harui
Building remotely on flex_sdk_slave2 in workspace <http://apacheflexbuild.cloudapp.net:8080/job/FlexJS%20ASDoc%20Example/5/artifact/>
> C:\Program Files (x86)\Git\cmd\git.exe rev-parse --is-inside-work-tree # timeout=10
Fetching changes from the remote Git repository
> C:\Program Files (x86)\Git\cmd\git.exe config remote.origin.url https://git-wip-us.apache.org/repos/asf/flex-asjs.git # timeout=10
Fetching upstream changes from https://git-wip-us.apache.org/repos/asf/flex-asjs.git
> C:\Program Files (x86)\Git\cmd\git.exe --version # timeout=10
> C:\Program Files (x86)\Git\cmd\git.exe fetch --tags --progress https://git-wip-us.apache.org/repos/asf/flex-asjs.git +refs/heads/*:refs/remotes/origin/*
> C:\Program Files (x86)\Git\cmd\git.exe rev-parse "origin/develop^{commit}" # timeout=10
Checking out Revision e28de643dfe1ac8d61c34a08c4dff86c7e02b4a0 (origin/develop)
> C:\Program Files (x86)\Git\cmd\git.exe config core.sparsecheckout # timeout=10
> C:\Program Files (x86)\Git\cmd\git.exe checkout -f e28de643dfe1ac8d61c34a08c4dff86c7e02b4a0
> C:\Program Files (x86)\Git\cmd\git.exe rev-list e28de643dfe1ac8d61c34a08c4dff86c7e02b4a0 # timeout=10
[ASDoc] $ cmd.exe /C "c:\Jenkins\tools\hudson.tasks.Ant_AntInstallation\c_apache-ant-1.9.3\bin\ant.bat -file build.xml -DFLEXJS_HOME=C:\Jenkinsworkspacelex-asjs -Dplayerglobal.version=11.7 main && exit %%ERRORLEVEL%%"
Buildfile: <http://apacheflexbuild.cloudapp.net:8080/job/FlexJS%20ASDoc%20Example/5/artifact/examples/flexjs/ASDoc/build.xml>
BUILD FAILED
Target "lex-asjs" does not exist in the project "asdoc".
Total time: 1 second
Picked up JAVA_TOOL_OPTIONS: -Dfile.encoding=UTF8
Build step 'Invoke Ant' marked build as failure
Skipped archiving because build is not successful
Build failed in Jenkins: FlexJS ASDoc Example #4
Posted by fl...@gmail.com.
See <http://apacheflexbuild.cloudapp.net:8080/job/FlexJS%20ASDoc%20Example/4/>
------------------------------------------
Started by user Alex Harui
Building remotely on flex_sdk_slave2 in workspace <http://apacheflexbuild.cloudapp.net:8080/job/FlexJS%20ASDoc%20Example/4/artifact/>
> C:\Program Files (x86)\Git\cmd\git.exe rev-parse --is-inside-work-tree # timeout=10
Fetching changes from the remote Git repository
> C:\Program Files (x86)\Git\cmd\git.exe config remote.origin.url https://git-wip-us.apache.org/repos/asf/flex-asjs.git # timeout=10
Fetching upstream changes from https://git-wip-us.apache.org/repos/asf/flex-asjs.git
> C:\Program Files (x86)\Git\cmd\git.exe --version # timeout=10
> C:\Program Files (x86)\Git\cmd\git.exe fetch --tags --progress https://git-wip-us.apache.org/repos/asf/flex-asjs.git +refs/heads/*:refs/remotes/origin/*
> C:\Program Files (x86)\Git\cmd\git.exe rev-parse "origin/develop^{commit}" # timeout=10
Checking out Revision e28de643dfe1ac8d61c34a08c4dff86c7e02b4a0 (origin/develop)
> C:\Program Files (x86)\Git\cmd\git.exe config core.sparsecheckout # timeout=10
> C:\Program Files (x86)\Git\cmd\git.exe checkout -f e28de643dfe1ac8d61c34a08c4dff86c7e02b4a0
> C:\Program Files (x86)\Git\cmd\git.exe rev-list e28de643dfe1ac8d61c34a08c4dff86c7e02b4a0 # timeout=10
[ASDoc] $ cmd.exe /C "c:\Jenkins\tools\hudson.tasks.Ant_AntInstallation\c_apache-ant-1.9.3\bin\ant.bat -file build.xml -DFLEXJS_HOME=C:\Jenkinsworkspacelex-asjs -Dplayerglobal.version=11.7 main && exit %%ERRORLEVEL%%"
Buildfile: <http://apacheflexbuild.cloudapp.net:8080/job/FlexJS%20ASDoc%20Example/4/artifact/examples/flexjs/ASDoc/build.xml>
BUILD FAILED
Target "lex-asjs" does not exist in the project "asdoc".
Total time: 1 second
Picked up JAVA_TOOL_OPTIONS: -Dfile.encoding=UTF8
Build step 'Invoke Ant' marked build as failure
Skipped archiving because build is not successful
Build failed in Jenkins: FlexJS ASDoc Example #3
Posted by fl...@gmail.com.
See <http://apacheflexbuild.cloudapp.net:8080/job/FlexJS%20ASDoc%20Example/3/>
------------------------------------------
Started by user Alex Harui
Building remotely on flex_sdk_slave2 in workspace <http://apacheflexbuild.cloudapp.net:8080/job/FlexJS%20ASDoc%20Example/3/artifact/>
> C:\Program Files (x86)\Git\cmd\git.exe rev-parse --is-inside-work-tree # timeout=10
Fetching changes from the remote Git repository
> C:\Program Files (x86)\Git\cmd\git.exe config remote.origin.url https://git-wip-us.apache.org/repos/asf/flex-asjs.git # timeout=10
Fetching upstream changes from https://git-wip-us.apache.org/repos/asf/flex-asjs.git
> C:\Program Files (x86)\Git\cmd\git.exe --version # timeout=10
> C:\Program Files (x86)\Git\cmd\git.exe fetch --tags --progress https://git-wip-us.apache.org/repos/asf/flex-asjs.git +refs/heads/*:refs/remotes/origin/*
> C:\Program Files (x86)\Git\cmd\git.exe rev-parse "origin/develop^{commit}" # timeout=10
Checking out Revision e28de643dfe1ac8d61c34a08c4dff86c7e02b4a0 (origin/develop)
> C:\Program Files (x86)\Git\cmd\git.exe config core.sparsecheckout # timeout=10
> C:\Program Files (x86)\Git\cmd\git.exe checkout -f e28de643dfe1ac8d61c34a08c4dff86c7e02b4a0
> C:\Program Files (x86)\Git\cmd\git.exe rev-list e28de643dfe1ac8d61c34a08c4dff86c7e02b4a0 # timeout=10
[ASDoc] $ cmd.exe /C "c:\Jenkins\tools\hudson.tasks.Ant_AntInstallation\c_apache-ant-1.9.3\bin\ant.bat -file build.xml '"-DFLEXJS_HOME=""C:\Program Files (x86)\Jenkins\jobs\flex-asjs\workspace"""' -Dplayerglobal.version=11.7 main && exit %%ERRORLEVEL%%"
Buildfile: <http://apacheflexbuild.cloudapp.net:8080/job/FlexJS%20ASDoc%20Example/3/artifact/examples/flexjs/ASDoc/build.xml>
build_example.compile:
[echo] Compiling ASDoc.swf
[echo] FLEX_HOME: "C:\Program Files (x86)\Jenkins\jobs\flex-asjs\workspace"
[mxmlc] Error: Could not find or load main class ${mxmlc.jvm.args}
[mxmlc] Picked up JAVA_TOOL_OPTIONS: -Dfile.encoding=UTF8
BUILD FAILED
<http://apacheflexbuild.cloudapp.net:8080/job/FlexJS%20ASDoc%20Example/3/artifact/examples/build_example.xml>:135: The following error occurred while executing this line:
<http://apacheflexbuild.cloudapp.net:8080/job/FlexJS%20ASDoc%20Example/3/artifact/examples/build_example.xml>:374: Warning: Could not find file <http://apacheflexbuild.cloudapp.net:8080/job/FlexJS%20ASDoc%20Example/3/artifact/examples/flexjs/ASDoc/"C>:\Program Files (x86)\Jenkins\jobs\flex-asjs\workspace"\templates\swfobject\index.template.html to copy.
Total time: 2 seconds
Picked up JAVA_TOOL_OPTIONS: -Dfile.encoding=UTF8
Build step 'Invoke Ant' marked build as failure
Skipped archiving because build is not successful