You are viewing a plain text version of this content. The canonical link for it is here.
Posted to commits@karaf.apache.org by Apache Jenkins Server <je...@builds.apache.org> on 2012/03/20 01:34:44 UTC

Build failed in Jenkins: Karaf #1006

See <https://builds.apache.org/job/Karaf/1006/>

------------------------------------------
[...truncated 4378 lines...]
[INFO] 
[INFO] --- maven-site-plugin:3.0:attach-descriptor (attach-descriptor) @ bundle ---
[INFO] Installing <https://builds.apache.org/job/Karaf/ws/karaf/bundle/pom.xml> to <https://builds.apache.org/job/Karaf/ws/.repository/org/apache/karaf/bundle/bundle/3.0.0-SNAPSHOT/bundle-3.0.0-SNAPSHOT.pom>
[INFO] 
[INFO] --- maven-install-plugin:2.3.1:install (default-install) @ bundle ---
[JENKINS] Archiving <https://builds.apache.org/job/Karaf/ws/karaf/bundle/pom.xml> to /home/hudson/hudson/jobs/Karaf/modules/org.apache.karaf.bundle$bundle/builds/2012-03-20_00-31-48/archive/org.apache.karaf.bundle/bundle/3.0.0-SNAPSHOT/bundle-3.0.0-SNAPSHOT.pom
[INFO]                                                                         
[INFO] ------------------------------------------------------------------------
[INFO] Building Apache Karaf :: Bundle :: Core 3.0.0-SNAPSHOT
[INFO] ------------------------------------------------------------------------
[INFO] 
[INFO] --- maven-clean-plugin:2.4.1:clean (default-clean) @ org.apache.karaf.bundle.core ---
[INFO] 
[INFO] --- maven-enforcer-plugin:1.0.1:enforce (enforce-maven) @ org.apache.karaf.bundle.core ---
[INFO] 
[INFO] --- maven-bundle-plugin:2.3.7:cleanVersions (cleanVersions) @ org.apache.karaf.bundle.core ---
[INFO] 
[INFO] --- maven-remote-resources-plugin:1.2.1:process (default) @ org.apache.karaf.bundle.core ---
[debug] execute contextualize
[INFO] [INFO] Using 'UTF-8' encoding to copy filtered resources.
[INFO] Copying 2 resources
[INFO] Copying 1 resource
[INFO] Copying 3 resources

[INFO] --- maven-resources-plugin:2.5:resources (default-resources) @ org.apache.karaf.bundle.core ---
[INFO] [INFO] Compiling 4 source files to <https://builds.apache.org/job/Karaf/ws/karaf/bundle/core/target/classes>

[INFO] --- maven-compiler-plugin:2.3.2:compile (default-compile) @ org.apache.karaf.bundle.core ---
[INFO] -------------------------------------------------------------
[ERROR] COMPILATION ERROR : 
[INFO] -------------------------------------------------------------
[ERROR] <https://builds.apache.org/job/Karaf/ws/karaf/bundle/core/src/main/java/org/apache/karaf/bundle/core/BundleStateService.java>:[27,4] cannot find symbol
symbol  : class BundleState
location: interface org.apache.karaf.bundle.core.BundleStateService
[ERROR] <https://builds.apache.org/job/Karaf/ws/karaf/bundle/core/src/main/java/org/apache/karaf/bundle/core/internal/BlueprintListener.java>:[24,35] cannot find symbol
symbol  : class BundleState
location: package org.apache.karaf.bundle.core
[ERROR] <https://builds.apache.org/job/Karaf/ws/karaf/bundle/core/src/main/java/org/apache/karaf/bundle/core/internal/BlueprintListener.java>:[87,11] cannot find symbol
symbol  : class BundleState
location: class org.apache.karaf.bundle.core.internal.BlueprintListener
[ERROR] <https://builds.apache.org/job/Karaf/ws/karaf/bundle/core/src/main/java/org/apache/karaf/bundle/core/internal/BlueprintListener.java>:[108,12] cannot find symbol
symbol  : class BundleState
location: class org.apache.karaf.bundle.core.internal.BlueprintListener
[ERROR] <https://builds.apache.org/job/Karaf/ws/karaf/bundle/core/src/main/java/org/apache/karaf/bundle/core/internal/BlueprintListener.java>:[89,8] cannot find symbol
symbol  : class BundleState
location: class org.apache.karaf.bundle.core.internal.BlueprintListener
[ERROR] <https://builds.apache.org/job/Karaf/ws/karaf/bundle/core/src/main/java/org/apache/karaf/bundle/core/internal/BlueprintListener.java>:[90,54] cannot find symbol
symbol  : variable BundleState
location: class org.apache.karaf.bundle.core.internal.BlueprintListener
[ERROR] <https://builds.apache.org/job/Karaf/ws/karaf/bundle/core/src/main/java/org/apache/karaf/bundle/core/internal/BlueprintListener.java>:[95,12] cannot find symbol
symbol  : class BundleState
location: class org.apache.karaf.bundle.core.internal.BlueprintListener
[ERROR] <https://builds.apache.org/job/Karaf/ws/karaf/bundle/core/src/main/java/org/apache/karaf/bundle/core/internal/BlueprintListener.java>:[110,19] cannot find symbol
symbol  : variable BundleState
location: class org.apache.karaf.bundle.core.internal.BlueprintListener
[ERROR] <https://builds.apache.org/job/Karaf/ws/karaf/bundle/core/src/main/java/org/apache/karaf/bundle/core/internal/BlueprintListener.java>:[114,19] cannot find symbol
symbol  : variable BundleState
location: class org.apache.karaf.bundle.core.internal.BlueprintListener
[ERROR] <https://builds.apache.org/job/Karaf/ws/karaf/bundle/core/src/main/java/org/apache/karaf/bundle/core/internal/BlueprintListener.java>:[116,19] cannot find symbol
symbol  : variable BundleState
location: class org.apache.karaf.bundle.core.internal.BlueprintListener
[ERROR] <https://builds.apache.org/job/Karaf/ws/karaf/bundle/core/src/main/java/org/apache/karaf/bundle/core/internal/BlueprintListener.java>:[118,19] cannot find symbol
symbol  : variable BundleState
location: class org.apache.karaf.bundle.core.internal.BlueprintListener
[ERROR] <https://builds.apache.org/job/Karaf/ws/karaf/bundle/core/src/main/java/org/apache/karaf/bundle/core/internal/BlueprintListener.java>:[120,19] cannot find symbol
symbol  : variable BundleState
location: class org.apache.karaf.bundle.core.internal.BlueprintListener
[ERROR] <https://builds.apache.org/job/Karaf/ws/karaf/bundle/core/src/main/java/org/apache/karaf/bundle/core/internal/BlueprintListener.java>:[122,19] cannot find symbol
symbol  : variable BundleState
location: class org.apache.karaf.bundle.core.internal.BlueprintListener
[ERROR] <https://builds.apache.org/job/Karaf/ws/karaf/bundle/core/src/main/java/org/apache/karaf/bundle/core/internal/BlueprintListener.java>:[124,19] cannot find symbol
symbol  : variable BundleState
location: class org.apache.karaf.bundle.core.internal.BlueprintListener
[ERROR] <https://builds.apache.org/job/Karaf/ws/karaf/bundle/core/src/main/java/org/apache/karaf/bundle/core/internal/BlueprintListener.java>:[126,19] cannot find symbol
symbol  : variable BundleState
location: class org.apache.karaf.bundle.core.internal.BlueprintListener
[ERROR] <https://builds.apache.org/job/Karaf/ws/karaf/bundle/core/src/main/java/org/apache/karaf/bundle/core/internal/BlueprintListener.java>:[128,19] cannot find symbol
symbol  : variable BundleState
location: class org.apache.karaf.bundle.core.internal.BlueprintListener
[INFO] 16 errors 
[INFO] -------------------------------------------------------------
[JENKINS] Archiving <https://builds.apache.org/job/Karaf/ws/karaf/bundle/core/pom.xml> to /home/hudson/hudson/jobs/Karaf/modules/org.apache.karaf.bundle$org.apache.karaf.bundle.core/builds/2012-03-20_00-31-48/archive/org.apache.karaf.bundle/org.apache.karaf.bundle.core/3.0.0-SNAPSHOT/org.apache.karaf.bundle.core-3.0.0-SNAPSHOT.pom
[INFO] ------------------------------------------------------------------------
[INFO] Reactor Summary:
[INFO] 
[INFO] Apache Karaf ...................................... SUCCESS [32.865s]
[INFO] Apache Karaf :: Main .............................. SUCCESS [28.580s]
[INFO] Apache Karaf :: JAAS .............................. SUCCESS [1.275s]
[INFO] Apache Karaf :: JAAS :: Boot ...................... SUCCESS [4.898s]
[INFO] Apache Karaf :: JAAS :: Config .................... SUCCESS [6.460s]
[INFO] Apache Karaf :: JAAS :: Modules ................... SUCCESS [4.281s]
[INFO] Apache Karaf :: Shell ............................. SUCCESS [0.807s]
[INFO] Apache Karaf :: Shell :: Console .................. SUCCESS [5.335s]
[INFO] Apache Karaf :: Util .............................. SUCCESS [3.279s]
[INFO] Apache Karaf :: Region ............................ SUCCESS [0.866s]
[INFO] Apache Karaf :: Region :: Core .................... SUCCESS [2.062s]
[INFO] Apache Karaf :: Features .......................... SUCCESS [0.829s]
[INFO] Apache Karaf :: Features :: Core .................. SUCCESS [10.214s]
[INFO] Apache Karaf :: Features :: Command ............... SUCCESS [2.742s]
[INFO] Apache Karaf :: Features :: Management ............ SUCCESS [2.865s]
[INFO] Apache Karaf :: Features :: OBR Resolver .......... SUCCESS [2.937s]
[INFO] Apache Karaf :: KAR ............................... SUCCESS [0.842s]
[INFO] Apache Karaf :: KAR :: Core ....................... SUCCESS [2.115s]
[INFO] Apache Karaf :: KAR :: Command .................... SUCCESS [2.118s]
[INFO] Apache Karaf :: KAR :: Management ................. SUCCESS [2.014s]
[INFO] Apache Karaf :: Region :: Shell Commands .......... SUCCESS [2.318s]
[INFO] Apache Karaf :: Region :: Persistence ............. SUCCESS [3.574s]
[INFO] Apache Karaf :: Bundle ............................ SUCCESS [1.090s]
[INFO] Apache Karaf :: Bundle :: Core .................... FAILURE [1.639s]
[INFO] Apache Karaf :: Bundle :: Commands ................ SKIPPED
[INFO] Apache Karaf :: Bundle :: Management .............. SKIPPED
[INFO] Apache Karaf :: Bundle :: SpringStateService ...... SKIPPED
[INFO] Apache Karaf :: ConfigAdmin ....................... SKIPPED
[INFO] Apache Karaf :: ConfigAdmin :: Core ............... SKIPPED
[INFO] Apache Karaf :: ConfigAdmin :: Commands ........... SKIPPED
[INFO] Apache Karaf :: Config :: Management .............. SKIPPED
[INFO] Apache Karaf :: Instance .......................... SKIPPED
[INFO] Apache Karaf :: Instance :: Core .................. SKIPPED
[INFO] Apache Karaf :: Instance :: Command ............... SKIPPED
[INFO] Apache Karaf :: Instance :: Management ............ SKIPPED
[INFO] Apache Karaf :: Deployer .......................... SKIPPED
[INFO] Apache Karaf :: Deployer :: Spring ................ SKIPPED
[INFO] Apache Karaf :: Deployer :: Blueprint ............. SKIPPED
[INFO] Apache Karaf :: Deployer :: Features .............. SKIPPED
[INFO] Apache Karaf :: Deployer :: Karaf Archive (.kar) .. SKIPPED
[INFO] Apache Karaf :: Deployer :: Wrap Non OSGi Jar ..... SKIPPED
[INFO] Apache Karaf :: Shell :: Various Commands ......... SKIPPED
[INFO] Apache Karaf :: Shell :: Development Commands ..... SKIPPED
[INFO] Apache Karaf :: Shell :: Http Commands ............ SKIPPED
[INFO] Apache Karaf :: Shell :: Log Commands ............. SKIPPED
[INFO] Apache Karaf :: Shell :: OBR Commands ............. SKIPPED
[INFO] Apache Karaf :: Shell :: Services Commands ........ SKIPPED
[INFO] Apache Karaf :: Shell :: SSH ...................... SKIPPED
[INFO] Apache Karaf :: JAAS :: Jasypt Encryption ......... SKIPPED
[INFO] Apache Karaf :: Jaas :: Command ................... SKIPPED
[INFO] Apache Karaf :: Client ............................ SKIPPED
[INFO] Apache Karaf :: Management ........................ SKIPPED
[INFO] Apache Karaf :: Management ........................ SKIPPED
[INFO] Apache Karaf :: Management :: MBeans .............. SKIPPED
[INFO] Apache Karaf :: Management :: MBeans :: Services .. SKIPPED
[INFO] Apache Karaf :: Management :: MBeans :: Packages .. SKIPPED
[INFO] Apache Karaf :: Management :: MBeans :: Dev ....... SKIPPED
[INFO] Apache Karaf :: Management :: MBeans :: HTTP ...... SKIPPED
[INFO] Apache Karaf :: Management :: MBeans :: Log ....... SKIPPED
[INFO] Apache Karaf :: Management :: MBeans :: OBR ....... SKIPPED
[INFO] Apache Karaf :: System ............................ SKIPPED
[INFO] Apache Karaf :: System :: Core .................... SKIPPED
[INFO] Apache Karaf :: System :: Shell Commands .......... SKIPPED
[INFO] Apache Karaf :: System :: Management .............. SKIPPED
[INFO] Apache Karaf :: Web ............................... SKIPPED
[INFO] Apache Karaf :: Web :: Core ....................... SKIPPED
[INFO] Apache Karaf :: Web :: Commands ................... SKIPPED
[INFO] Apache Karaf :: Web :: Management ................. SKIPPED
[INFO] Apache Karaf :: Wrapper ........................... SKIPPED
[INFO] Apache Karaf :: Wrapper :: Core ................... SKIPPED
[INFO] Apache Karaf :: Wrapper :: Shell Commands ......... SKIPPED
[INFO] Apache Karaf :: Wrapper :: Management ............. SKIPPED
[INFO] Apache Karaf :: Web Console ....................... SKIPPED
[INFO] Apache Karaf :: Web Console :: Console ............ SKIPPED
[INFO] Apache Karaf :: Web Console :: Branding ........... SKIPPED
[INFO] Apache Karaf :: Web Console :: Features Plugin .... SKIPPED
[INFO] Apache Karaf :: Web Console :: Gogo Plugin ........ SKIPPED
[INFO] Apache Karaf :: Web Console :: HTTP Plugin ........ SKIPPED
[INFO] Apache Karaf :: Web Console :: Instance Plugin .... SKIPPED
[INFO] Apache Karaf :: Exception ......................... SKIPPED
[INFO] Apache Karaf :: Scheduler ......................... SKIPPED
[INFO] Apache Karaf :: Scheduler :: Core ................. SKIPPED
[INFO] Apache Karaf :: Declarative Services (DS) ......... SKIPPED
[INFO] Apache Karaf :: SCR :: Shell Commands ............. SKIPPED
[INFO] Apache Karaf :: SCR :: Management MBeans .......... SKIPPED
[INFO] Apache Karaf :: SCR :: Examples ................... SKIPPED
[INFO] Apache Karaf :: Tooling ........................... SKIPPED
[INFO] Apache Karaf :: Tooling :: Maven Karaf Plugin ..... SKIPPED
[INFO] Apache Karaf :: Tooling :: Exam Testing Framework . SKIPPED
[INFO] Apache Karaf :: Tooling :: Exam Test Framework Options  SKIPPED
[INFO] Apache Karaf :: Tooling :: Exam Test Framework Container  SKIPPED
[INFO] Apache Karaf :: Assemblies ........................ SKIPPED
[INFO] Apache Karaf :: Assemblies :: Features ............ SKIPPED
[INFO] Apache Karaf :: Assemblies :: Features :: Framework  SKIPPED
[INFO] Apache Karaf :: Diagnostic ........................ SKIPPED
[INFO] Apache Karaf :: Diagnostic :: Core ................ SKIPPED
[INFO] Apache Karaf :: Diagnostic :: Common .............. SKIPPED
[INFO] Apache Karaf :: Diagnostic :: Command ............. SKIPPED
[INFO] Apache Karaf :: Diagnostic :: Management .......... SKIPPED
[INFO] Apache Karaf :: Assemblies :: Features :: Standard  SKIPPED
[INFO] Apache Karaf :: Assemblies :: Features :: Spring .. SKIPPED
[INFO] Apache Karaf :: Assemblies :: Features :: Enterprise  SKIPPED
[INFO] Apache Karaf :: Assemblies :: Default Distribution  SKIPPED
[INFO] Apache Karaf :: Tooling :: Exam Test Framework Regression Tests  SKIPPED
[INFO] Apache Karaf :: Assemblies :: Minimal Distribution  SKIPPED
[INFO] Apache Karaf :: Integration Tests ................. SKIPPED
[INFO] Apache Karaf :: Integration Tests :: ITests ....... SKIPPED
[INFO] Apache Karaf :: Integration Tests :: Kit Tests .... SKIPPED
[INFO] Apache Karaf :: Archetypes ........................ SKIPPED
[INFO] Apache Karaf :: Archetypes :: Assembly Archetype .. SKIPPED
[INFO] Apache Karaf :: Archetypes :: Command Archetype ... SKIPPED
[INFO] Apache Karaf :: Archetypes :: Feature Archetype ... SKIPPED
[INFO] Apache Karaf :: Archetypes :: Kar Archetype ....... SKIPPED
[INFO] Apache Karaf :: Archetypes :: Bundle Archetype .... SKIPPED
[INFO] Apache Karaf :: Archetypes :: Blueprint Archetype . SKIPPED
[INFO] Apache Karaf :: Manual ............................ SKIPPED
[INFO] ------------------------------------------------------------------------
[INFO] BUILD FAILURE
[INFO] ------------------------------------------------------------------------
[INFO] Total time: 2:39.013s
[INFO] Finished at: Tue Mar 20 00:34:39 UTC 2012
[INFO] Final Memory: 120M/408M
[INFO] ------------------------------------------------------------------------
mavenExecutionResult exceptions not empty
message : Failed to execute goal org.apache.maven.plugins:maven-compiler-plugin:2.3.2:compile (default-compile) on project org.apache.karaf.bundle.core: Compilation failure
cause : Compilation failure
Stack trace : 
org.apache.maven.lifecycle.LifecycleExecutionException: Failed to execute goal org.apache.maven.plugins:maven-compiler-plugin:2.3.2:compile (default-compile) on project org.apache.karaf.bundle.core: Compilation failure
	at org.apache.maven.lifecycle.internal.MojoExecutor.execute(MojoExecutor.java:213)
	at org.apache.maven.lifecycle.internal.MojoExecutor.execute(MojoExecutor.java:153)
	at org.apache.maven.lifecycle.internal.MojoExecutor.execute(MojoExecutor.java:145)
	at org.apache.maven.lifecycle.internal.LifecycleModuleBuilder.buildProject(LifecycleModuleBuilder.java:84)
	at org.apache.maven.lifecycle.internal.LifecycleModuleBuilder.buildProject(LifecycleModuleBuilder.java:59)
	at org.apache.maven.lifecycle.internal.LifecycleStarter.singleThreadedBuild(LifecycleStarter.java:183)
	at org.apache.maven.lifecycle.internal.LifecycleStarter.execute(LifecycleStarter.java:161)
	at org.apache.maven.DefaultMaven.doExecute(DefaultMaven.java:319)
	at org.apache.maven.DefaultMaven.execute(DefaultMaven.java:156)
	at org.jvnet.hudson.maven3.launcher.Maven3Launcher.main(Maven3Launcher.java:79)
	at sun.reflect.NativeMethodAccessorImpl.invoke0(Native Method)
	at sun.reflect.NativeMethodAccessorImpl.invoke(NativeMethodAccessorImpl.java:39)
	at sun.reflect.DelegatingMethodAccessorImpl.invoke(DelegatingMethodAccessorImpl.java:25)
	at java.lang.reflect.Method.invoke(Method.java:597)
	at org.codehaus.plexus.classworlds.launcher.Launcher.launchStandard(Launcher.java:329)
	at org.codehaus.plexus.classworlds.launcher.Launcher.launch(Launcher.java:239)
	at org.jvnet.hudson.maven3.agent.Maven3Main.launch(Maven3Main.java:158)
	at hudson.maven.Maven3Builder.call(Maven3Builder.java:104)
	at hudson.maven.Maven3Builder.call(Maven3Builder.java:70)
	at hudson.remoting.UserRequest.perform(UserRequest.java:118)
	at hudson.remoting.UserRequest.perform(UserRequest.java:48)
	at hudson.remoting.Request$2.run(Request.java:287)
	at hudson.remoting.InterceptingExecutorService$1.call(InterceptingExecutorService.java:72)
	at java.util.concurrent.FutureTask$Sync.innerRun(FutureTask.java:303)
	at java.util.concurrent.FutureTask.run(FutureTask.java:138)
	at java.util.concurrent.ThreadPoolExecutor$Worker.runTask(ThreadPoolExecutor.java:886)
	at java.util.concurrent.ThreadPoolExecutor$Worker.run(ThreadPoolExecutor.java:908)
	at java.lang.Thread.run(Thread.java:662)
Caused by: org.apache.maven.plugin.CompilationFailureException: Compilation failure
	at org.apache.maven.plugin.AbstractCompilerMojo.execute(AbstractCompilerMojo.java:656)
	at org.apache.maven.plugin.CompilerMojo.execute(CompilerMojo.java:128)
	at org.apache.maven.plugin.DefaultBuildPluginManager.executeMojo(DefaultBuildPluginManager.java:101)
	at org.apache.maven.lifecycle.internal.MojoExecutor.execute(MojoExecutor.java:209)
	... 27 more
Sending e-mails to: commits@karaf.apache.org
channel stopped

Jenkins build is still unstable: Karaf #1024

Posted by Apache Jenkins Server <je...@builds.apache.org>.
See <https://builds.apache.org/job/Karaf/1024/>


Jenkins build is unstable: Karaf #1023

Posted by Apache Jenkins Server <je...@builds.apache.org>.
See <https://builds.apache.org/job/Karaf/1023/>


Build failed in Jenkins: Karaf #1022

Posted by Apache Jenkins Server <je...@builds.apache.org>.
See <https://builds.apache.org/job/Karaf/1022/>

------------------------------------------
Started by an SCM change
Building remotely on ubuntu3 in workspace <https://builds.apache.org/job/Karaf/ws/>
hudson.util.IOException2: remote file operation failed: <https://builds.apache.org/job/Karaf/ws/> at hudson.remoting.Channel@cb11cb2:ubuntu3
	at hudson.FilePath.act(FilePath.java:828)
	at hudson.FilePath.act(FilePath.java:814)
	at hudson.scm.SubversionSCM.checkout(SubversionSCM.java:743)
	at hudson.scm.SubversionSCM.checkout(SubversionSCM.java:685)
	at hudson.model.AbstractProject.checkout(AbstractProject.java:1212)
	at hudson.model.AbstractBuild$AbstractRunner.checkout(AbstractBuild.java:579)
	at hudson.model.AbstractBuild$AbstractRunner.run(AbstractBuild.java:468)
	at hudson.model.Run.run(Run.java:1410)
	at hudson.maven.MavenModuleSetBuild.run(MavenModuleSetBuild.java:481)
	at hudson.model.ResourceController.execute(ResourceController.java:88)
	at hudson.model.Executor.run(Executor.java:238)
Caused by: java.io.IOException: Remote call on ubuntu3 failed
	at hudson.remoting.Channel.call(Channel.java:690)
	at hudson.FilePath.act(FilePath.java:821)
	... 10 more
Caused by: java.lang.LinkageError: loader (instance of  hudson/remoting/RemoteClassLoader): attempted  duplicate class definition for name: "hudson/model/Descriptor"
	at java.lang.ClassLoader.defineClass1(Native Method)
	at java.lang.ClassLoader.defineClassCond(ClassLoader.java:631)
	at java.lang.ClassLoader.defineClass(ClassLoader.java:615)
	at java.lang.ClassLoader.defineClass(ClassLoader.java:465)
	at hudson.remoting.RemoteClassLoader.loadClassFile(RemoteClassLoader.java:152)
	at hudson.remoting.RemoteClassLoader.findClass(RemoteClassLoader.java:131)
	at java.lang.ClassLoader.loadClass(ClassLoader.java:306)
	at java.lang.ClassLoader.loadClass(ClassLoader.java:247)
	at java.lang.Class.getDeclaredFields0(Native Method)
	at java.lang.Class.privateGetDeclaredFields(Class.java:2291)
	at java.lang.Class.getDeclaredField(Class.java:1880)
	at java.io.ObjectStreamClass.getDeclaredSUID(ObjectStreamClass.java:1610)
	at java.io.ObjectStreamClass.access$700(ObjectStreamClass.java:52)
	at java.io.ObjectStreamClass$2.run(ObjectStreamClass.java:425)
	at java.security.AccessController.doPrivileged(Native Method)
	at java.io.ObjectStreamClass.<init>(ObjectStreamClass.java:413)
	at java.io.ObjectStreamClass.lookup(ObjectStreamClass.java:310)
	at java.io.ObjectStreamClass.initNonProxy(ObjectStreamClass.java:547)
	at java.io.ObjectInputStream.readNonProxyDesc(ObjectInputStream.java:1582)
	at java.io.ObjectInputStream.readClassDesc(ObjectInputStream.java:1495)
	at java.io.ObjectInputStream.readNonProxyDesc(ObjectInputStream.java:1582)
	at java.io.ObjectInputStream.readClassDesc(ObjectInputStream.java:1495)
	at java.io.ObjectInputStream.readOrdinaryObject(ObjectInputStream.java:1731)
	at java.io.ObjectInputStream.readObject0(ObjectInputStream.java:1328)
	at java.io.ObjectInputStream.defaultReadFields(ObjectInputStream.java:1946)
	at java.io.ObjectInputStream.readSerialData(ObjectInputStream.java:1870)
	at java.io.ObjectInputStream.readOrdinaryObject(ObjectInputStream.java:1752)
	at java.io.ObjectInputStream.readObject0(ObjectInputStream.java:1328)
	at java.io.ObjectInputStream.defaultReadFields(ObjectInputStream.java:1946)
	at java.io.ObjectInputStream.readSerialData(ObjectInputStream.java:1870)
	at java.io.ObjectInputStream.readOrdinaryObject(ObjectInputStream.java:1752)
	at java.io.ObjectInputStream.readObject0(ObjectInputStream.java:1328)
	at java.io.ObjectInputStream.defaultReadFields(ObjectInputStream.java:1946)
	at java.io.ObjectInputStream.readSerialData(ObjectInputStream.java:1870)
	at java.io.ObjectInputStream.readOrdinaryObject(ObjectInputStream.java:1752)
	at java.io.ObjectInputStream.readObject0(ObjectInputStream.java:1328)
	at java.io.ObjectInputStream.readObject(ObjectInputStream.java:350)
	at hudson.remoting.UserRequest.deserialize(UserRequest.java:182)
	at hudson.remoting.UserRequest.perform(UserRequest.java:98)
	at hudson.remoting.UserRequest.perform(UserRequest.java:48)
	at hudson.remoting.Request$2.run(Request.java:287)
	at hudson.remoting.InterceptingExecutorService$1.call(InterceptingExecutorService.java:72)
	at java.util.concurrent.FutureTask$Sync.innerRun(FutureTask.java:303)
	at java.util.concurrent.FutureTask.run(FutureTask.java:138)
	at java.util.concurrent.ThreadPoolExecutor$Worker.runTask(ThreadPoolExecutor.java:886)
	at java.util.concurrent.ThreadPoolExecutor$Worker.run(ThreadPoolExecutor.java:908)
	at java.lang.Thread.run(Thread.java:662)
Retrying after 10 seconds
hudson.util.IOException2: remote file operation failed: <https://builds.apache.org/job/Karaf/ws/> at hudson.remoting.Channel@cb11cb2:ubuntu3
	at hudson.FilePath.act(FilePath.java:828)
	at hudson.FilePath.act(FilePath.java:814)
	at hudson.scm.SubversionSCM.checkout(SubversionSCM.java:743)
	at hudson.scm.SubversionSCM.checkout(SubversionSCM.java:685)
	at hudson.model.AbstractProject.checkout(AbstractProject.java:1212)
	at hudson.model.AbstractBuild$AbstractRunner.checkout(AbstractBuild.java:579)
	at hudson.model.AbstractBuild$AbstractRunner.run(AbstractBuild.java:468)
	at hudson.model.Run.run(Run.java:1410)
	at hudson.maven.MavenModuleSetBuild.run(MavenModuleSetBuild.java:481)
	at hudson.model.ResourceController.execute(ResourceController.java:88)
	at hudson.model.Executor.run(Executor.java:238)
Caused by: java.io.IOException: Remote call on ubuntu3 failed
	at hudson.remoting.Channel.call(Channel.java:690)
	at hudson.FilePath.act(FilePath.java:821)
	... 10 more
Caused by: java.lang.LinkageError: loader (instance of  hudson/remoting/RemoteClassLoader): attempted  duplicate class definition for name: "hudson/model/Descriptor"
	at java.lang.ClassLoader.defineClass1(Native Method)
	at java.lang.ClassLoader.defineClassCond(ClassLoader.java:631)
	at java.lang.ClassLoader.defineClass(ClassLoader.java:615)
	at java.lang.ClassLoader.defineClass(ClassLoader.java:465)
	at hudson.remoting.RemoteClassLoader.loadClassFile(RemoteClassLoader.java:152)
	at hudson.remoting.RemoteClassLoader.findClass(RemoteClassLoader.java:131)
	at java.lang.ClassLoader.loadClass(ClassLoader.java:306)
	at java.lang.ClassLoader.loadClass(ClassLoader.java:247)
	at java.lang.Class.getDeclaredFields0(Native Method)
	at java.lang.Class.privateGetDeclaredFields(Class.java:2291)
	at java.lang.Class.getDeclaredField(Class.java:1880)
	at java.io.ObjectStreamClass.getDeclaredSUID(ObjectStreamClass.java:1610)
	at java.io.ObjectStreamClass.access$700(ObjectStreamClass.java:52)
	at java.io.ObjectStreamClass$2.run(ObjectStreamClass.java:425)
	at java.security.AccessController.doPrivileged(Native Method)
	at java.io.ObjectStreamClass.<init>(ObjectStreamClass.java:413)
	at java.io.ObjectStreamClass.lookup(ObjectStreamClass.java:310)
	at java.io.ObjectStreamClass.initNonProxy(ObjectStreamClass.java:547)
	at java.io.ObjectInputStream.readNonProxyDesc(ObjectInputStream.java:1582)
	at java.io.ObjectInputStream.readClassDesc(ObjectInputStream.java:1495)
	at java.io.ObjectInputStream.readNonProxyDesc(ObjectInputStream.java:1582)
	at java.io.ObjectInputStream.readClassDesc(ObjectInputStream.java:1495)
	at java.io.ObjectInputStream.readOrdinaryObject(ObjectInputStream.java:1731)
	at java.io.ObjectInputStream.readObject0(ObjectInputStream.java:1328)
	at java.io.ObjectInputStream.defaultReadFields(ObjectInputStream.java:1946)
	at java.io.ObjectInputStream.readSerialData(ObjectInputStream.java:1870)
	at java.io.ObjectInputStream.readOrdinaryObject(ObjectInputStream.java:1752)
	at java.io.ObjectInputStream.readObject0(ObjectInputStream.java:1328)
	at java.io.ObjectInputStream.defaultReadFields(ObjectInputStream.java:1946)
	at java.io.ObjectInputStream.readSerialData(ObjectInputStream.java:1870)
	at java.io.ObjectInputStream.readOrdinaryObject(ObjectInputStream.java:1752)
	at java.io.ObjectInputStream.readObject0(ObjectInputStream.java:1328)
	at java.io.ObjectInputStream.defaultReadFields(ObjectInputStream.java:1946)
	at java.io.ObjectInputStream.readSerialData(ObjectInputStream.java:1870)
	at java.io.ObjectInputStream.readOrdinaryObject(ObjectInputStream.java:1752)
	at java.io.ObjectInputStream.readObject0(ObjectInputStream.java:1328)
	at java.io.ObjectInputStream.readObject(ObjectInputStream.java:350)
	at hudson.remoting.UserRequest.deserialize(UserRequest.java:182)
	at hudson.remoting.UserRequest.perform(UserRequest.java:98)
	at hudson.remoting.UserRequest.perform(UserRequest.java:48)
	at hudson.remoting.Request$2.run(Request.java:287)
	at hudson.remoting.InterceptingExecutorService$1.call(InterceptingExecutorService.java:72)
	at java.util.concurrent.FutureTask$Sync.innerRun(FutureTask.java:303)
	at java.util.concurrent.FutureTask.run(FutureTask.java:138)
	at java.util.concurrent.ThreadPoolExecutor$Worker.runTask(ThreadPoolExecutor.java:886)
	at java.util.concurrent.ThreadPoolExecutor$Worker.run(ThreadPoolExecutor.java:908)
	at java.lang.Thread.run(Thread.java:662)
Retrying after 10 seconds
hudson.util.IOException2: remote file operation failed: <https://builds.apache.org/job/Karaf/ws/> at hudson.remoting.Channel@cb11cb2:ubuntu3
	at hudson.FilePath.act(FilePath.java:828)
	at hudson.FilePath.act(FilePath.java:814)
	at hudson.scm.SubversionSCM.checkout(SubversionSCM.java:743)
	at hudson.scm.SubversionSCM.checkout(SubversionSCM.java:685)
	at hudson.model.AbstractProject.checkout(AbstractProject.java:1212)
	at hudson.model.AbstractBuild$AbstractRunner.checkout(AbstractBuild.java:579)
	at hudson.model.AbstractBuild$AbstractRunner.run(AbstractBuild.java:468)
	at hudson.model.Run.run(Run.java:1410)
	at hudson.maven.MavenModuleSetBuild.run(MavenModuleSetBuild.java:481)
	at hudson.model.ResourceController.execute(ResourceController.java:88)
	at hudson.model.Executor.run(Executor.java:238)
Caused by: java.io.IOException: Remote call on ubuntu3 failed
	at hudson.remoting.Channel.call(Channel.java:690)
	at hudson.FilePath.act(FilePath.java:821)
	... 10 more
Caused by: java.lang.LinkageError: loader (instance of  hudson/remoting/RemoteClassLoader): attempted  duplicate class definition for name: "hudson/model/Descriptor"
	at java.lang.ClassLoader.defineClass1(Native Method)
	at java.lang.ClassLoader.defineClassCond(ClassLoader.java:631)
	at java.lang.ClassLoader.defineClass(ClassLoader.java:615)
	at java.lang.ClassLoader.defineClass(ClassLoader.java:465)
	at hudson.remoting.RemoteClassLoader.loadClassFile(RemoteClassLoader.java:152)
	at hudson.remoting.RemoteClassLoader.findClass(RemoteClassLoader.java:131)
	at java.lang.ClassLoader.loadClass(ClassLoader.java:306)
	at java.lang.ClassLoader.loadClass(ClassLoader.java:247)
	at java.lang.Class.getDeclaredFields0(Native Method)
	at java.lang.Class.privateGetDeclaredFields(Class.java:2291)
	at java.lang.Class.getDeclaredField(Class.java:1880)
	at java.io.ObjectStreamClass.getDeclaredSUID(ObjectStreamClass.java:1610)
	at java.io.ObjectStreamClass.access$700(ObjectStreamClass.java:52)
	at java.io.ObjectStreamClass$2.run(ObjectStreamClass.java:425)
	at java.security.AccessController.doPrivileged(Native Method)
	at java.io.ObjectStreamClass.<init>(ObjectStreamClass.java:413)
	at java.io.ObjectStreamClass.lookup(ObjectStreamClass.java:310)
	at java.io.ObjectStreamClass.initNonProxy(ObjectStreamClass.java:547)
	at java.io.ObjectInputStream.readNonProxyDesc(ObjectInputStream.java:1582)
	at java.io.ObjectInputStream.readClassDesc(ObjectInputStream.java:1495)
	at java.io.ObjectInputStream.readNonProxyDesc(ObjectInputStream.java:1582)
	at java.io.ObjectInputStream.readClassDesc(ObjectInputStream.java:1495)
	at java.io.ObjectInputStream.readOrdinaryObject(ObjectInputStream.java:1731)
	at java.io.ObjectInputStream.readObject0(ObjectInputStream.java:1328)
	at java.io.ObjectInputStream.defaultReadFields(ObjectInputStream.java:1946)
	at java.io.ObjectInputStream.readSerialData(ObjectInputStream.java:1870)
	at java.io.ObjectInputStream.readOrdinaryObject(ObjectInputStream.java:1752)
	at java.io.ObjectInputStream.readObject0(ObjectInputStream.java:1328)
	at java.io.ObjectInputStream.defaultReadFields(ObjectInputStream.java:1946)
	at java.io.ObjectInputStream.readSerialData(ObjectInputStream.java:1870)
	at java.io.ObjectInputStream.readOrdinaryObject(ObjectInputStream.java:1752)
	at java.io.ObjectInputStream.readObject0(ObjectInputStream.java:1328)
	at java.io.ObjectInputStream.defaultReadFields(ObjectInputStream.java:1946)
	at java.io.ObjectInputStream.readSerialData(ObjectInputStream.java:1870)
	at java.io.ObjectInputStream.readOrdinaryObject(ObjectInputStream.java:1752)
	at java.io.ObjectInputStream.readObject0(ObjectInputStream.java:1328)
	at java.io.ObjectInputStream.readObject(ObjectInputStream.java:350)
	at hudson.remoting.UserRequest.deserialize(UserRequest.java:182)
	at hudson.remoting.UserRequest.perform(UserRequest.java:98)
	at hudson.remoting.UserRequest.perform(UserRequest.java:48)
	at hudson.remoting.Request$2.run(Request.java:287)
	at hudson.remoting.InterceptingExecutorService$1.call(InterceptingExecutorService.java:72)
	at java.util.concurrent.FutureTask$Sync.innerRun(FutureTask.java:303)
	at java.util.concurrent.FutureTask.run(FutureTask.java:138)
	at java.util.concurrent.ThreadPoolExecutor$Worker.runTask(ThreadPoolExecutor.java:886)
	at java.util.concurrent.ThreadPoolExecutor$Worker.run(ThreadPoolExecutor.java:908)
	at java.lang.Thread.run(Thread.java:662)

Jenkins build is still unstable: Karaf #1021

Posted by Apache Jenkins Server <je...@builds.apache.org>.
See <https://builds.apache.org/job/Karaf/changes>


Jenkins build is still unstable: Karaf #1020

Posted by Apache Jenkins Server <je...@builds.apache.org>.
See <https://builds.apache.org/job/Karaf/changes>


Jenkins build is still unstable: Karaf #1019

Posted by Apache Jenkins Server <je...@builds.apache.org>.
See <https://builds.apache.org/job/Karaf/changes>


Jenkins build is still unstable: Karaf #1018

Posted by Apache Jenkins Server <je...@builds.apache.org>.
See <https://builds.apache.org/job/Karaf/changes>


Jenkins build is still unstable: Karaf #1017

Posted by Apache Jenkins Server <je...@builds.apache.org>.
See <https://builds.apache.org/job/Karaf/changes>


Jenkins build is still unstable: Karaf #1016

Posted by Apache Jenkins Server <je...@builds.apache.org>.
See <https://builds.apache.org/job/Karaf/1016/>


Jenkins build is still unstable: Karaf #1015

Posted by Apache Jenkins Server <je...@builds.apache.org>.
See <https://builds.apache.org/job/Karaf/1015/>


Jenkins build is still unstable: Karaf #1014

Posted by Apache Jenkins Server <je...@builds.apache.org>.
See <https://builds.apache.org/job/Karaf/1014/>


Jenkins build is still unstable: Karaf #1013

Posted by Apache Jenkins Server <je...@builds.apache.org>.
See <https://builds.apache.org/job/Karaf/changes>


Jenkins build is still unstable: Karaf #1012

Posted by Apache Jenkins Server <je...@builds.apache.org>.
See <https://builds.apache.org/job/Karaf/changes>


Jenkins build is still unstable: Karaf #1011

Posted by Apache Jenkins Server <je...@builds.apache.org>.
See <https://builds.apache.org/job/Karaf/changes>


Jenkins build is still unstable: Karaf #1010

Posted by Apache Jenkins Server <je...@builds.apache.org>.
See <https://builds.apache.org/job/Karaf/changes>


Jenkins build is still unstable: Karaf #1009

Posted by Apache Jenkins Server <je...@builds.apache.org>.
See <https://builds.apache.org/job/Karaf/changes>


Jenkins build is unstable: Karaf #1008

Posted by Apache Jenkins Server <je...@builds.apache.org>.
See <https://builds.apache.org/job/Karaf/1008/changes>


Build failed in Jenkins: Karaf #1007

Posted by Apache Jenkins Server <je...@builds.apache.org>.
See <https://builds.apache.org/job/Karaf/1007/>

------------------------------------------
[...truncated 4386 lines...]
[INFO] 
[INFO] --- maven-site-plugin:3.0:attach-descriptor (attach-descriptor) @ bundle ---
[INFO] Installing <https://builds.apache.org/job/Karaf/ws/karaf/bundle/pom.xml> to <https://builds.apache.org/job/Karaf/ws/.repository/org/apache/karaf/bundle/bundle/3.0.0-SNAPSHOT/bundle-3.0.0-SNAPSHOT.pom>
[INFO] 
[INFO] --- maven-install-plugin:2.3.1:install (default-install) @ bundle ---
[JENKINS] Archiving <https://builds.apache.org/job/Karaf/ws/karaf/bundle/pom.xml> to /home/hudson/hudson/jobs/Karaf/modules/org.apache.karaf.bundle$bundle/builds/2012-03-20_04-23-45/archive/org.apache.karaf.bundle/bundle/3.0.0-SNAPSHOT/bundle-3.0.0-SNAPSHOT.pom
[INFO]                                                                         
[INFO] ------------------------------------------------------------------------
[INFO] Building Apache Karaf :: Bundle :: Core 3.0.0-SNAPSHOT
[INFO] ------------------------------------------------------------------------
[INFO] 
[INFO] --- maven-clean-plugin:2.4.1:clean (default-clean) @ org.apache.karaf.bundle.core ---
[INFO] 
[INFO] --- maven-enforcer-plugin:1.0.1:enforce (enforce-maven) @ org.apache.karaf.bundle.core ---
[INFO] 
[INFO] --- maven-bundle-plugin:2.3.7:cleanVersions (cleanVersions) @ org.apache.karaf.bundle.core ---
[INFO] 
[INFO] --- maven-remote-resources-plugin:1.2.1:process (default) @ org.apache.karaf.bundle.core ---
[INFO] [debug] execute contextualize
[INFO] Using 'UTF-8' encoding to copy filtered resources.
[INFO] Copying 2 resources
[INFO] Copying 1 resource
[INFO] Copying 3 resources

[INFO] --- maven-resources-plugin:2.5:resources (default-resources) @ org.apache.karaf.bundle.core ---
[INFO] [INFO] Compiling 4 source files to <https://builds.apache.org/job/Karaf/ws/karaf/bundle/core/target/classes>

[INFO] --- maven-compiler-plugin:2.3.2:compile (default-compile) @ org.apache.karaf.bundle.core ---
[INFO] -------------------------------------------------------------
[ERROR] COMPILATION ERROR : 
[INFO] -------------------------------------------------------------
[ERROR] <https://builds.apache.org/job/Karaf/ws/karaf/bundle/core/src/main/java/org/apache/karaf/bundle/core/BundleStateService.java>:[27,4] cannot find symbol
symbol  : class BundleState
location: interface org.apache.karaf.bundle.core.BundleStateService
[ERROR] <https://builds.apache.org/job/Karaf/ws/karaf/bundle/core/src/main/java/org/apache/karaf/bundle/core/internal/BlueprintListener.java>:[24,35] cannot find symbol
symbol  : class BundleState
location: package org.apache.karaf.bundle.core
[ERROR] <https://builds.apache.org/job/Karaf/ws/karaf/bundle/core/src/main/java/org/apache/karaf/bundle/core/internal/BlueprintListener.java>:[87,11] cannot find symbol
symbol  : class BundleState
location: class org.apache.karaf.bundle.core.internal.BlueprintListener
[ERROR] <https://builds.apache.org/job/Karaf/ws/karaf/bundle/core/src/main/java/org/apache/karaf/bundle/core/internal/BlueprintListener.java>:[108,12] cannot find symbol
symbol  : class BundleState
location: class org.apache.karaf.bundle.core.internal.BlueprintListener
[ERROR] <https://builds.apache.org/job/Karaf/ws/karaf/bundle/core/src/main/java/org/apache/karaf/bundle/core/internal/BlueprintListener.java>:[89,8] cannot find symbol
symbol  : class BundleState
location: class org.apache.karaf.bundle.core.internal.BlueprintListener
[ERROR] <https://builds.apache.org/job/Karaf/ws/karaf/bundle/core/src/main/java/org/apache/karaf/bundle/core/internal/BlueprintListener.java>:[90,54] cannot find symbol
symbol  : variable BundleState
location: class org.apache.karaf.bundle.core.internal.BlueprintListener
[ERROR] <https://builds.apache.org/job/Karaf/ws/karaf/bundle/core/src/main/java/org/apache/karaf/bundle/core/internal/BlueprintListener.java>:[95,12] cannot find symbol
symbol  : class BundleState
location: class org.apache.karaf.bundle.core.internal.BlueprintListener
[ERROR] <https://builds.apache.org/job/Karaf/ws/karaf/bundle/core/src/main/java/org/apache/karaf/bundle/core/internal/BlueprintListener.java>:[110,19] cannot find symbol
symbol  : variable BundleState
location: class org.apache.karaf.bundle.core.internal.BlueprintListener
[ERROR] <https://builds.apache.org/job/Karaf/ws/karaf/bundle/core/src/main/java/org/apache/karaf/bundle/core/internal/BlueprintListener.java>:[114,19] cannot find symbol
symbol  : variable BundleState
location: class org.apache.karaf.bundle.core.internal.BlueprintListener
[ERROR] <https://builds.apache.org/job/Karaf/ws/karaf/bundle/core/src/main/java/org/apache/karaf/bundle/core/internal/BlueprintListener.java>:[116,19] cannot find symbol
symbol  : variable BundleState
location: class org.apache.karaf.bundle.core.internal.BlueprintListener
[ERROR] <https://builds.apache.org/job/Karaf/ws/karaf/bundle/core/src/main/java/org/apache/karaf/bundle/core/internal/BlueprintListener.java>:[118,19] cannot find symbol
symbol  : variable BundleState
location: class org.apache.karaf.bundle.core.internal.BlueprintListener
[ERROR] <https://builds.apache.org/job/Karaf/ws/karaf/bundle/core/src/main/java/org/apache/karaf/bundle/core/internal/BlueprintListener.java>:[120,19] cannot find symbol
symbol  : variable BundleState
location: class org.apache.karaf.bundle.core.internal.BlueprintListener
[ERROR] <https://builds.apache.org/job/Karaf/ws/karaf/bundle/core/src/main/java/org/apache/karaf/bundle/core/internal/BlueprintListener.java>:[122,19] cannot find symbol
symbol  : variable BundleState
location: class org.apache.karaf.bundle.core.internal.BlueprintListener
[ERROR] <https://builds.apache.org/job/Karaf/ws/karaf/bundle/core/src/main/java/org/apache/karaf/bundle/core/internal/BlueprintListener.java>:[124,19] cannot find symbol
symbol  : variable BundleState
location: class org.apache.karaf.bundle.core.internal.BlueprintListener
[ERROR] <https://builds.apache.org/job/Karaf/ws/karaf/bundle/core/src/main/java/org/apache/karaf/bundle/core/internal/BlueprintListener.java>:[126,19] cannot find symbol
symbol  : variable BundleState
location: class org.apache.karaf.bundle.core.internal.BlueprintListener
[ERROR] <https://builds.apache.org/job/Karaf/ws/karaf/bundle/core/src/main/java/org/apache/karaf/bundle/core/internal/BlueprintListener.java>:[128,19] cannot find symbol
symbol  : variable BundleState
location: class org.apache.karaf.bundle.core.internal.BlueprintListener
[INFO] 16 errors 
[INFO] -------------------------------------------------------------
[JENKINS] Archiving <https://builds.apache.org/job/Karaf/ws/karaf/bundle/core/pom.xml> to /home/hudson/hudson/jobs/Karaf/modules/org.apache.karaf.bundle$org.apache.karaf.bundle.core/builds/2012-03-20_04-23-45/archive/org.apache.karaf.bundle/org.apache.karaf.bundle.core/3.0.0-SNAPSHOT/org.apache.karaf.bundle.core-3.0.0-SNAPSHOT.pom
[INFO] ------------------------------------------------------------------------
[INFO] Reactor Summary:
[INFO] 
[INFO] Apache Karaf ...................................... SUCCESS [25.894s]
[INFO] Apache Karaf :: Main .............................. SUCCESS [26.619s]
[INFO] Apache Karaf :: JAAS .............................. SUCCESS [0.685s]
[INFO] Apache Karaf :: JAAS :: Boot ...................... SUCCESS [3.027s]
[INFO] Apache Karaf :: JAAS :: Config .................... SUCCESS [7.827s]
[INFO] Apache Karaf :: JAAS :: Modules ................... SUCCESS [3.322s]
[INFO] Apache Karaf :: Shell ............................. SUCCESS [0.727s]
[INFO] Apache Karaf :: Shell :: Console .................. SUCCESS [5.238s]
[INFO] Apache Karaf :: Util .............................. SUCCESS [2.833s]
[INFO] Apache Karaf :: Region ............................ SUCCESS [0.769s]
[INFO] Apache Karaf :: Region :: Core .................... SUCCESS [1.909s]
[INFO] Apache Karaf :: Features .......................... SUCCESS [0.752s]
[INFO] Apache Karaf :: Features :: Core .................. SUCCESS [10.891s]
[INFO] Apache Karaf :: Features :: Command ............... SUCCESS [2.429s]
[INFO] Apache Karaf :: Features :: Management ............ SUCCESS [3.917s]
[INFO] Apache Karaf :: Features :: OBR Resolver .......... SUCCESS [2.882s]
[INFO] Apache Karaf :: KAR ............................... SUCCESS [0.763s]
[INFO] Apache Karaf :: KAR :: Core ....................... SUCCESS [1.948s]
[INFO] Apache Karaf :: KAR :: Command .................... SUCCESS [1.965s]
[INFO] Apache Karaf :: KAR :: Management ................. SUCCESS [1.955s]
[INFO] Apache Karaf :: Region :: Shell Commands .......... SUCCESS [2.257s]
[INFO] Apache Karaf :: Region :: Persistence ............. SUCCESS [2.523s]
[INFO] Apache Karaf :: Bundle ............................ SUCCESS [0.724s]
[INFO] Apache Karaf :: Bundle :: Core .................... FAILURE [1.450s]
[INFO] Apache Karaf :: Bundle :: Commands ................ SKIPPED
[INFO] Apache Karaf :: Bundle :: Management .............. SKIPPED
[INFO] Apache Karaf :: Bundle :: SpringStateService ...... SKIPPED
[INFO] Apache Karaf :: ConfigAdmin ....................... SKIPPED
[INFO] Apache Karaf :: ConfigAdmin :: Core ............... SKIPPED
[INFO] Apache Karaf :: ConfigAdmin :: Commands ........... SKIPPED
[INFO] Apache Karaf :: Config :: Management .............. SKIPPED
[INFO] Apache Karaf :: Instance .......................... SKIPPED
[INFO] Apache Karaf :: Instance :: Core .................. SKIPPED
[INFO] Apache Karaf :: Instance :: Command ............... SKIPPED
[INFO] Apache Karaf :: Instance :: Management ............ SKIPPED
[INFO] Apache Karaf :: Deployer .......................... SKIPPED
[INFO] Apache Karaf :: Deployer :: Spring ................ SKIPPED
[INFO] Apache Karaf :: Deployer :: Blueprint ............. SKIPPED
[INFO] Apache Karaf :: Deployer :: Features .............. SKIPPED
[INFO] Apache Karaf :: Deployer :: Karaf Archive (.kar) .. SKIPPED
[INFO] Apache Karaf :: Deployer :: Wrap Non OSGi Jar ..... SKIPPED
[INFO] Apache Karaf :: Shell :: Various Commands ......... SKIPPED
[INFO] Apache Karaf :: Shell :: Development Commands ..... SKIPPED
[INFO] Apache Karaf :: Shell :: Http Commands ............ SKIPPED
[INFO] Apache Karaf :: Shell :: Log Commands ............. SKIPPED
[INFO] Apache Karaf :: Shell :: OBR Commands ............. SKIPPED
[INFO] Apache Karaf :: Shell :: Services Commands ........ SKIPPED
[INFO] Apache Karaf :: Shell :: SSH ...................... SKIPPED
[INFO] Apache Karaf :: JAAS :: Jasypt Encryption ......... SKIPPED
[INFO] Apache Karaf :: Jaas :: Command ................... SKIPPED
[INFO] Apache Karaf :: Client ............................ SKIPPED
[INFO] Apache Karaf :: Management ........................ SKIPPED
[INFO] Apache Karaf :: Management ........................ SKIPPED
[INFO] Apache Karaf :: Management :: MBeans .............. SKIPPED
[INFO] Apache Karaf :: Management :: MBeans :: Services .. SKIPPED
[INFO] Apache Karaf :: Management :: MBeans :: Packages .. SKIPPED
[INFO] Apache Karaf :: Management :: MBeans :: Dev ....... SKIPPED
[INFO] Apache Karaf :: Management :: MBeans :: HTTP ...... SKIPPED
[INFO] Apache Karaf :: Management :: MBeans :: Log ....... SKIPPED
[INFO] Apache Karaf :: Management :: MBeans :: OBR ....... SKIPPED
[INFO] Apache Karaf :: System ............................ SKIPPED
[INFO] Apache Karaf :: System :: Core .................... SKIPPED
[INFO] Apache Karaf :: System :: Shell Commands .......... SKIPPED
[INFO] Apache Karaf :: System :: Management .............. SKIPPED
[INFO] Apache Karaf :: Web ............................... SKIPPED
[INFO] Apache Karaf :: Web :: Core ....................... SKIPPED
[INFO] Apache Karaf :: Web :: Commands ................... SKIPPED
[INFO] Apache Karaf :: Web :: Management ................. SKIPPED
[INFO] Apache Karaf :: Wrapper ........................... SKIPPED
[INFO] Apache Karaf :: Wrapper :: Core ................... SKIPPED
[INFO] Apache Karaf :: Wrapper :: Shell Commands ......... SKIPPED
[INFO] Apache Karaf :: Wrapper :: Management ............. SKIPPED
[INFO] Apache Karaf :: Web Console ....................... SKIPPED
[INFO] Apache Karaf :: Web Console :: Console ............ SKIPPED
[INFO] Apache Karaf :: Web Console :: Branding ........... SKIPPED
[INFO] Apache Karaf :: Web Console :: Features Plugin .... SKIPPED
[INFO] Apache Karaf :: Web Console :: Gogo Plugin ........ SKIPPED
[INFO] Apache Karaf :: Web Console :: HTTP Plugin ........ SKIPPED
[INFO] Apache Karaf :: Web Console :: Instance Plugin .... SKIPPED
[INFO] Apache Karaf :: Exception ......................... SKIPPED
[INFO] Apache Karaf :: Scheduler ......................... SKIPPED
[INFO] Apache Karaf :: Scheduler :: Core ................. SKIPPED
[INFO] Apache Karaf :: Declarative Services (DS) ......... SKIPPED
[INFO] Apache Karaf :: SCR :: Shell Commands ............. SKIPPED
[INFO] Apache Karaf :: SCR :: Management MBeans .......... SKIPPED
[INFO] Apache Karaf :: SCR :: Examples ................... SKIPPED
[INFO] Apache Karaf :: Tooling ........................... SKIPPED
[INFO] Apache Karaf :: Tooling :: Maven Karaf Plugin ..... SKIPPED
[INFO] Apache Karaf :: Tooling :: Exam Testing Framework . SKIPPED
[INFO] Apache Karaf :: Tooling :: Exam Test Framework Options  SKIPPED
[INFO] Apache Karaf :: Tooling :: Exam Test Framework Container  SKIPPED
[INFO] Apache Karaf :: Assemblies ........................ SKIPPED
[INFO] Apache Karaf :: Assemblies :: Features ............ SKIPPED
[INFO] Apache Karaf :: Assemblies :: Features :: Framework  SKIPPED
[INFO] Apache Karaf :: Diagnostic ........................ SKIPPED
[INFO] Apache Karaf :: Diagnostic :: Core ................ SKIPPED
[INFO] Apache Karaf :: Diagnostic :: Common .............. SKIPPED
[INFO] Apache Karaf :: Diagnostic :: Command ............. SKIPPED
[INFO] Apache Karaf :: Diagnostic :: Management .......... SKIPPED
[INFO] Apache Karaf :: Assemblies :: Features :: Standard  SKIPPED
[INFO] Apache Karaf :: Assemblies :: Features :: Spring .. SKIPPED
[INFO] Apache Karaf :: Assemblies :: Features :: Enterprise  SKIPPED
[INFO] Apache Karaf :: Assemblies :: Default Distribution  SKIPPED
[INFO] Apache Karaf :: Tooling :: Exam Test Framework Regression Tests  SKIPPED
[INFO] Apache Karaf :: Assemblies :: Minimal Distribution  SKIPPED
[INFO] Apache Karaf :: Integration Tests ................. SKIPPED
[INFO] Apache Karaf :: Integration Tests :: ITests ....... SKIPPED
[INFO] Apache Karaf :: Integration Tests :: Kit Tests .... SKIPPED
[INFO] Apache Karaf :: Archetypes ........................ SKIPPED
[INFO] Apache Karaf :: Archetypes :: Assembly Archetype .. SKIPPED
[INFO] Apache Karaf :: Archetypes :: Command Archetype ... SKIPPED
[INFO] Apache Karaf :: Archetypes :: Feature Archetype ... SKIPPED
[INFO] Apache Karaf :: Archetypes :: Kar Archetype ....... SKIPPED
[INFO] Apache Karaf :: Archetypes :: Bundle Archetype .... SKIPPED
[INFO] Apache Karaf :: Archetypes :: Blueprint Archetype . SKIPPED
[INFO] Apache Karaf :: Manual ............................ SKIPPED
[INFO] ------------------------------------------------------------------------
[INFO] BUILD FAILURE
[INFO] ------------------------------------------------------------------------
[INFO] Total time: 2:25.713s
[INFO] Finished at: Tue Mar 20 04:26:22 UTC 2012
[INFO] Final Memory: 120M/422M
[INFO] ------------------------------------------------------------------------
mavenExecutionResult exceptions not empty
message : Failed to execute goal org.apache.maven.plugins:maven-compiler-plugin:2.3.2:compile (default-compile) on project org.apache.karaf.bundle.core: Compilation failure
cause : Compilation failure
Stack trace : 
org.apache.maven.lifecycle.LifecycleExecutionException: Failed to execute goal org.apache.maven.plugins:maven-compiler-plugin:2.3.2:compile (default-compile) on project org.apache.karaf.bundle.core: Compilation failure
	at org.apache.maven.lifecycle.internal.MojoExecutor.execute(MojoExecutor.java:213)
	at org.apache.maven.lifecycle.internal.MojoExecutor.execute(MojoExecutor.java:153)
	at org.apache.maven.lifecycle.internal.MojoExecutor.execute(MojoExecutor.java:145)
	at org.apache.maven.lifecycle.internal.LifecycleModuleBuilder.buildProject(LifecycleModuleBuilder.java:84)
	at org.apache.maven.lifecycle.internal.LifecycleModuleBuilder.buildProject(LifecycleModuleBuilder.java:59)
	at org.apache.maven.lifecycle.internal.LifecycleStarter.singleThreadedBuild(LifecycleStarter.java:183)
	at org.apache.maven.lifecycle.internal.LifecycleStarter.execute(LifecycleStarter.java:161)
	at org.apache.maven.DefaultMaven.doExecute(DefaultMaven.java:319)
	at org.apache.maven.DefaultMaven.execute(DefaultMaven.java:156)
	at org.jvnet.hudson.maven3.launcher.Maven3Launcher.main(Maven3Launcher.java:79)
	at sun.reflect.NativeMethodAccessorImpl.invoke0(Native Method)
	at sun.reflect.NativeMethodAccessorImpl.invoke(NativeMethodAccessorImpl.java:39)
	at sun.reflect.DelegatingMethodAccessorImpl.invoke(DelegatingMethodAccessorImpl.java:25)
	at java.lang.reflect.Method.invoke(Method.java:597)
	at org.codehaus.plexus.classworlds.launcher.Launcher.launchStandard(Launcher.java:329)
	at org.codehaus.plexus.classworlds.launcher.Launcher.launch(Launcher.java:239)
	at org.jvnet.hudson.maven3.agent.Maven3Main.launch(Maven3Main.java:158)
	at hudson.maven.Maven3Builder.call(Maven3Builder.java:104)
	at hudson.maven.Maven3Builder.call(Maven3Builder.java:70)
	at hudson.remoting.UserRequest.perform(UserRequest.java:118)
	at hudson.remoting.UserRequest.perform(UserRequest.java:48)
	at hudson.remoting.Request$2.run(Request.java:287)
	at hudson.remoting.InterceptingExecutorService$1.call(InterceptingExecutorService.java:72)
	at java.util.concurrent.FutureTask$Sync.innerRun(FutureTask.java:303)
	at java.util.concurrent.FutureTask.run(FutureTask.java:138)
	at java.util.concurrent.ThreadPoolExecutor$Worker.runTask(ThreadPoolExecutor.java:886)
	at java.util.concurrent.ThreadPoolExecutor$Worker.run(ThreadPoolExecutor.java:908)
	at java.lang.Thread.run(Thread.java:662)
Caused by: org.apache.maven.plugin.CompilationFailureException: Compilation failure
	at org.apache.maven.plugin.AbstractCompilerMojo.execute(AbstractCompilerMojo.java:656)
	at org.apache.maven.plugin.CompilerMojo.execute(CompilerMojo.java:128)
	at org.apache.maven.plugin.DefaultBuildPluginManager.executeMojo(DefaultBuildPluginManager.java:101)
	at org.apache.maven.lifecycle.internal.MojoExecutor.execute(MojoExecutor.java:209)
	... 27 more
Sending e-mails to: commits@karaf.apache.org
channel stopped