You are viewing a plain text version of this content. The canonical link for it is here.
Posted to builds@beam.apache.org by Apache Jenkins Server <je...@builds.apache.org> on 2022/02/02 18:07:10 UTC
Build failed in Jenkins: beam_PreCommit_CommunityMetrics_Cron #4714
See <https://ci-beam.apache.org/job/beam_PreCommit_CommunityMetrics_Cron/4714/display/redirect?page=changes>
Changes:
[mmack] [BEAM-13563] Restructure Kinesis Source for Aws 2 internally to prepare
[noreply] [BEAM-4665] Allow joining a running dataflow pipeline without throwing
------------------------------------------
Started by timer
Running as SYSTEM
[EnvInject] - Loading node environment variables.
Building remotely on apache-beam-jenkins-10 (beam) in workspace <https://ci-beam.apache.org/job/beam_PreCommit_CommunityMetrics_Cron/ws/>
The recommended git tool is: NONE
No credentials specified
Wiping out workspace first.
Cloning the remote Git repository
Cloning repository https://github.com/apache/beam.git
> git init <https://ci-beam.apache.org/job/beam_PreCommit_CommunityMetrics_Cron/ws/src> # timeout=10
Fetching upstream changes from https://github.com/apache/beam.git
> git --version # timeout=10
> git --version # 'git version 2.25.1'
> git fetch --tags --force --progress -- https://github.com/apache/beam.git +refs/heads/*:refs/remotes/origin/* # timeout=10
> git config remote.origin.url https://github.com/apache/beam.git # timeout=10
> git config --add remote.origin.fetch +refs/heads/*:refs/remotes/origin/* # timeout=10
> git config remote.origin.url https://github.com/apache/beam.git # timeout=10
Fetching upstream changes from https://github.com/apache/beam.git
> git fetch --tags --force --progress -- https://github.com/apache/beam.git +refs/heads/*:refs/remotes/origin/* +refs/pull/${ghprbPullId}/*:refs/remotes/origin/pr/${ghprbPullId}/* # timeout=10
> git rev-parse origin/master^{commit} # timeout=10
Checking out Revision 716e3b1ddce527d6a10d054e55da55d80ebe8513 (origin/master)
> git config core.sparsecheckout # timeout=10
> git checkout -f 716e3b1ddce527d6a10d054e55da55d80ebe8513 # timeout=10
Commit message: "[BEAM-4665] Allow joining a running dataflow pipeline without throwing (#16689)"
> git rev-list --no-walk b9c491929f7889bb5341db418e97c115288737ba # timeout=10
No emails were triggered.
[EnvInject] - Executing scripts and injecting environment variables after the SCM step.
[EnvInject] - Injecting as environment variables the properties content
SPARK_LOCAL_IP=127.0.0.1
SETUPTOOLS_USE_DISTUTILS=stdlib
[EnvInject] - Variables injected successfully.
[Gradle] - Launching build.
[src] $ <https://ci-beam.apache.org/job/beam_PreCommit_CommunityMetrics_Cron/ws/src/gradlew> --continue --max-workers=12 -Dorg.gradle.jvmargs=-Xms2g -Dorg.gradle.jvmargs=-Xmx4g -Dorg.gradle.vfs.watch=false -Pdocker-pull-licenses :communityMetricsPreCommit
Starting a Gradle Daemon, 2 busy Daemons could not be reused, use --status for details
Configuration on demand is an incubating feature.
> Task :buildSrc:compileJava NO-SOURCE
> Task :buildSrc:compileGroovy FROM-CACHE
> Task :buildSrc:pluginDescriptors
> Task :buildSrc:processResources
> Task :buildSrc:classes
> Task :buildSrc:jar
> Task :buildSrc:assemble
> Task :buildSrc:spotlessGroovy FROM-CACHE
> Task :buildSrc:spotlessGroovyCheck UP-TO-DATE
> Task :buildSrc:spotlessGroovyGradle FROM-CACHE
> Task :buildSrc:spotlessGroovyGradleCheck UP-TO-DATE
> Task :buildSrc:spotlessCheck UP-TO-DATE
> Task :buildSrc:pluginUnderTestMetadata
> Task :buildSrc:compileTestJava NO-SOURCE
> Task :buildSrc:compileTestGroovy NO-SOURCE
> Task :buildSrc:processTestResources NO-SOURCE
> Task :buildSrc:testClasses UP-TO-DATE
> Task :buildSrc:test NO-SOURCE
> Task :buildSrc:validatePlugins FROM-CACHE
> Task :buildSrc:check UP-TO-DATE
> Task :buildSrc:build
> Task :beam-test-infra-metrics:createEmptyConfig
> Task :beam-test-infra-metrics:composeUp
postgresql uses an image, skipping
influxdb uses an image, skipping
Building influxdb-restore
Building grafana
Building syncgithub
Building syncjenkins
Building syncjira
Creating network "7f68c8270306616dc9f681dd43484432_beam-test-infra-metrics__default" with the default driver
Starting beamsyncjira ...
Starting beampostgresql ...
Starting influxdb ...
Starting beamsyncjenkins ...
Starting beamsyncgithub ...
Starting beamgrafana ...
Starting beampostgresql ... error
ERROR: for beampostgresql Cannot start service postgresql: network c30f652a45d8c9aa0d8b0c28244b518fc7b2039d946abb5f7ddc7dd24cf95aed not found
Starting beamsyncgithub ... error
ERROR: for beamsyncgithub Cannot start service syncgithub: network c30f652a45d8c9aa0d8b0c28244b518fc7b2039d946abb5f7ddc7dd24cf95aed not found
Starting influxdb ... error
ERROR: for influxdb Cannot start service influxdb: network c30f652a45d8c9aa0d8b0c28244b518fc7b2039d946abb5f7ddc7dd24cf95aed not found
Starting beamgrafana ... error
ERROR: for beamgrafana Cannot start service grafana: network c30f652a45d8c9aa0d8b0c28244b518fc7b2039d946abb5f7ddc7dd24cf95aed not found
Starting beamsyncjira ... error
ERROR: for beamsyncjira Cannot start service syncjira: network c30f652a45d8c9aa0d8b0c28244b518fc7b2039d946abb5f7ddc7dd24cf95aed not found
Starting beamsyncjenkins ... error
ERROR: for beamsyncjenkins Cannot start service syncjenkins: network c30f652a45d8c9aa0d8b0c28244b518fc7b2039d946abb5f7ddc7dd24cf95aed not found
ERROR: for postgresql Cannot start service postgresql: network c30f652a45d8c9aa0d8b0c28244b518fc7b2039d946abb5f7ddc7dd24cf95aed not found
ERROR: for syncgithub Cannot start service syncgithub: network c30f652a45d8c9aa0d8b0c28244b518fc7b2039d946abb5f7ddc7dd24cf95aed not found
ERROR: for influxdb Cannot start service influxdb: network c30f652a45d8c9aa0d8b0c28244b518fc7b2039d946abb5f7ddc7dd24cf95aed not found
ERROR: for grafana Cannot start service grafana: network c30f652a45d8c9aa0d8b0c28244b518fc7b2039d946abb5f7ddc7dd24cf95aed not found
ERROR: for syncjira Cannot start service syncjira: network c30f652a45d8c9aa0d8b0c28244b518fc7b2039d946abb5f7ddc7dd24cf95aed not found
ERROR: for syncjenkins Cannot start service syncjenkins: network c30f652a45d8c9aa0d8b0c28244b518fc7b2039d946abb5f7ddc7dd24cf95aed not found
Encountered errors while bringing up the project.
Removing restore-backup ...
Removing beamsyncjenkins ...
Removing beamsyncgithub ...
Removing beamgrafana ...
Removing influxdb ...
Removing beamsyncjira ...
Removing beampostgresql ...
Removing restore-backup ... done
Removing beamsyncgithub ... done
Removing beamsyncjira ... done
Removing beamsyncjenkins ... done
Removing beampostgresql ... done
Removing beamgrafana ... done
Removing influxdb ... done
Removing network 7f68c8270306616dc9f681dd43484432_beam-test-infra-metrics__default
Removing volume 7f68c8270306616dc9f681dd43484432_beam-test-infra-metrics__beam-postgresql-data
Removing volume 7f68c8270306616dc9f681dd43484432_beam-test-infra-metrics__beam-grafana-libdata
Removing volume 7f68c8270306616dc9f681dd43484432_beam-test-infra-metrics__beam-grafana-etcdata
Removing volume 7f68c8270306616dc9f681dd43484432_beam-test-infra-metrics__beam-grafana-logdata
Removing volume 7f68c8270306616dc9f681dd43484432_beam-test-infra-metrics__beam-influxdb-storage
> Task :beam-test-infra-metrics:composeUp FAILED
> Task :beam-test-infra-metrics:validateConfiguration
W0202 18:06:49.990916 1651527 helpers.go:549] --dry-run=true is deprecated (boolean value) and can be replaced with --dry-run=client.
persistentvolumeclaim/beam-grafana-etcdata created (dry run)
persistentvolumeclaim/beam-grafana-libdata created (dry run)
persistentvolumeclaim/beam-grafana-logdata created (dry run)
cronjob.batch/influxdb-autobackup created (dry run)
persistentvolumeclaim/influxdb-storage created (dry run)
configmap/influxdb-init-scripts created (dry run)
deployment.apps/influxdb created (dry run)
service/influxdb created (dry run)
service/influxdb-rpc created (dry run)
persistentvolumeclaim/beam-postgresql-data created (dry run)
deployment.apps/beamgrafana created (dry run)
FAILURE: Build failed with an exception.
* What went wrong:
Execution failed for task ':beam-test-infra-metrics:composeUp'.
> Exit-code 1 when calling docker-compose, stdout: N/A
* Try:
> Run with --stacktrace option to get the stack trace.
> Run with --info or --debug option to get more log output.
> Run with --scan to get full insights.
* Get more help at https://help.gradle.org
BUILD FAILED in 37s
13 actionable tasks: 7 executed, 4 from cache, 2 up-to-date
Publishing build scan...
https://gradle.com/s/dpq63jym4jidy
Build step 'Invoke Gradle script' changed build result to FAILURE
Build step 'Invoke Gradle script' marked build as failure
---------------------------------------------------------------------
To unsubscribe, e-mail: builds-unsubscribe@beam.apache.org
For additional commands, e-mail: builds-help@beam.apache.org
Jenkins build is back to normal : beam_PreCommit_CommunityMetrics_Cron #4715
Posted by Apache Jenkins Server <je...@builds.apache.org>.
See <https://ci-beam.apache.org/job/beam_PreCommit_CommunityMetrics_Cron/4715/display/redirect?page=changes>
---------------------------------------------------------------------
To unsubscribe, e-mail: builds-unsubscribe@beam.apache.org
For additional commands, e-mail: builds-help@beam.apache.org