You are viewing a plain text version of this content. The canonical link for it is here.
Posted to dev@zookeeper.apache.org by Apache Jenkins Server <je...@builds.apache.org> on 2013/10/12 12:28:21 UTC
ZooKeeper-trunk-WinVS2008_java - Build # 570 - Failure
See https://builds.apache.org/job/ZooKeeper-trunk-WinVS2008_java/570/
###################################################################################
########################## LAST 60 LINES OF THE CONSOLE ###########################
[...truncated 275327 lines...]
[junit] 2013-10-12 11:27:59,901 [myid:] - INFO [main:NIOServerCnxnFactory@683] - binding to port 0.0.0.0/0.0.0.0:11221
[junit] 2013-10-12 11:27:59,903 [myid:] - INFO [main:FileSnap@83] - Reading snapshot f:\hudson\hudson-slave\workspace\ZooKeeper-trunk-WinVS2008_java\trunk\build\test\tmp\test6060195938882647121.junit.dir\version-2\snapshot.b
[junit] 2013-10-12 11:28:00,001 [myid:] - INFO [SessionTracker:SessionTrackerImpl@134] - SessionTrackerImpl exited loop!
[junit] 2013-10-12 11:28:00,000 [myid:] - INFO [SessionTracker:SessionTrackerImpl@134] - SessionTrackerImpl exited loop!
[junit] 2013-10-12 11:27:59,996 [myid:] - INFO [NIOServerCxnFactory.AcceptThread:0.0.0.0/0.0.0.0:11221:NIOServerCnxnFactory$AcceptThread@296] - Accepted socket connection from /127.0.0.1:50576
[junit] 2013-10-12 11:27:59,996 [myid:] - INFO [main-SendThread(127.0.0.1:11221):ClientCnxn$SendThread@882] - Socket connection established to 127.0.0.1/127.0.0.1:11221, initiating session
[junit] 2013-10-12 11:28:00,003 [myid:] - INFO [main:FileTxnSnapLog@297] - Snapshotting: 0xb to f:\hudson\hudson-slave\workspace\ZooKeeper-trunk-WinVS2008_java\trunk\build\test\tmp\test6060195938882647121.junit.dir\version-2\snapshot.b
[junit] 2013-10-12 11:28:00,102 [myid:] - WARN [NIOWorkerThread-1:NIOServerCnxn@365] - Exception causing close of session 0x0: ZooKeeperServer not running
[junit] 2013-10-12 11:28:00,103 [myid:] - INFO [NIOWorkerThread-1:NIOServerCnxn@999] - Closed socket connection for client /127.0.0.1:50576 (no session established for client)
[junit] 2013-10-12 11:28:00,103 [myid:] - INFO [main-SendThread(127.0.0.1:11221):ClientCnxn$SendThread@1124] - Unable to read additional data from server sessionid 0x141ac354cfc0000, likely server has closed socket, closing socket connection and attempting reconnect
[junit] 2013-10-12 11:28:00,104 [myid:] - INFO [main:FourLetterWordMain@43] - connecting to 127.0.0.1 11221
[junit] 2013-10-12 11:28:00,204 [myid:] - INFO [NIOServerCxnFactory.AcceptThread:0.0.0.0/0.0.0.0:11221:NIOServerCnxnFactory$AcceptThread@296] - Accepted socket connection from /127.0.0.1:50581
[junit] 2013-10-12 11:28:00,205 [myid:] - INFO [NIOWorkerThread-2:NIOServerCnxn@828] - Processing stat command from /127.0.0.1:50581
[junit] 2013-10-12 11:28:00,205 [myid:] - INFO [NIOWorkerThread-2:NIOServerCnxn$StatCommand@677] - Stat command output
[junit] 2013-10-12 11:28:00,205 [myid:] - INFO [NIOWorkerThread-2:NIOServerCnxn@999] - Closed socket connection for client /127.0.0.1:50581 (no session established for client)
[junit] 2013-10-12 11:28:00,304 [myid:] - INFO [main:JMXEnv@133] - ensureOnly:[InMemoryDataTree, StandaloneServer_port]
[junit] 2013-10-12 11:28:00,305 [myid:] - INFO [main:JMXEnv@105] - expect:InMemoryDataTree
[junit] 2013-10-12 11:28:00,305 [myid:] - INFO [main:JMXEnv@108] - found:InMemoryDataTree org.apache.ZooKeeperService:name0=StandaloneServer_port-1,name1=InMemoryDataTree
[junit] 2013-10-12 11:28:00,305 [myid:] - INFO [main:JMXEnv@105] - expect:StandaloneServer_port
[junit] 2013-10-12 11:28:00,305 [myid:] - INFO [main:JMXEnv@108] - found:StandaloneServer_port org.apache.ZooKeeperService:name0=StandaloneServer_port-1
[junit] 2013-10-12 11:28:00,404 [myid:] - INFO [main:JUnit4ZKTestRunner$LoggedInvokeMethod@57] - FINISHED TEST METHOD testQuota
[junit] 2013-10-12 11:28:00,404 [myid:] - INFO [main:ClientBase@451] - tearDown starting
[junit] 2013-10-12 11:28:01,716 [myid:] - INFO [main-SendThread(127.0.0.1:11221):ClientCnxn$SendThread@1008] - Opening socket connection to server 127.0.0.1/127.0.0.1:11221. Will not attempt to authenticate using SASL (java.lang.SecurityException: Unable to locate a login configuration)
[junit] 2013-10-12 11:28:01,717 [myid:] - INFO [main-SendThread(127.0.0.1:11221):ClientCnxn$SendThread@882] - Socket connection established to 127.0.0.1/127.0.0.1:11221, initiating session
[junit] 2013-10-12 11:28:01,717 [myid:] - INFO [NIOServerCxnFactory.AcceptThread:0.0.0.0/0.0.0.0:11221:NIOServerCnxnFactory$AcceptThread@296] - Accepted socket connection from /127.0.0.1:50582
[junit] 2013-10-12 11:28:01,813 [myid:] - INFO [NIOWorkerThread-3:ZooKeeperServer@858] - Client attempting to renew session 0x141ac354cfc0000 at /127.0.0.1:50582
[junit] 2013-10-12 11:28:01,814 [myid:] - INFO [NIOWorkerThread-3:ZooKeeperServer@604] - Established session 0x141ac354cfc0000 with negotiated timeout 30000 for client /127.0.0.1:50582
[junit] 2013-10-12 11:28:01,815 [myid:] - INFO [main-SendThread(127.0.0.1:11221):ClientCnxn$SendThread@1261] - Session establishment complete on server 127.0.0.1/127.0.0.1:11221, sessionid = 0x141ac354cfc0000, negotiated timeout = 30000
[junit] 2013-10-12 11:28:01,917 [myid:] - INFO [ProcessThread(sid:0 cport:-1)::PrepRequestProcessor@678] - Processed session termination for sessionid: 0x141ac354cfc0000
[junit] 2013-10-12 11:28:01,918 [myid:] - INFO [SyncThread:0:FileTxnLog@200] - Creating new log file: log.c
[junit] 2013-10-12 11:28:01,941 [myid:] - INFO [main:ZooKeeper@777] - Session: 0x141ac354cfc0000 closed
[junit] 2013-10-12 11:28:01,941 [myid:] - INFO [main:ClientBase@421] - STOPPING server
[junit] 2013-10-12 11:28:01,941 [myid:] - INFO [main-EventThread:ClientCnxn$EventThread@513] - EventThread shut down
[junit] 2013-10-12 11:28:01,943 [myid:] - INFO [NIOServerCxnFactory.SelectorThread-0:NIOServerCnxnFactory$SelectorThread@420] - selector thread exitted run method
[junit] 2013-10-12 11:28:01,942 [myid:] - INFO [ConnnectionExpirer:NIOServerCnxnFactory$ConnectionExpirerThread@583] - ConnnectionExpirerThread interrupted
[junit] 2013-10-12 11:28:01,942 [myid:] - INFO [NIOServerCxnFactory.AcceptThread:0.0.0.0/0.0.0.0:11221:NIOServerCnxnFactory$AcceptThread@219] - accept thread exitted run method
[junit] 2013-10-12 11:28:01,942 [myid:] - INFO [NIOWorkerThread-2:NIOServerCnxn@999] - Closed socket connection for client /127.0.0.1:50582 which had sessionid 0x141ac354cfc0000
[junit] 2013-10-12 11:28:02,014 [myid:] - INFO [main:ZooKeeperServer@428] - shutting down
[junit] 2013-10-12 11:28:02,114 [myid:] - INFO [main:SessionTrackerImpl@183] - Shutting down
[junit] 2013-10-12 11:28:02,114 [myid:] - INFO [main:PrepRequestProcessor@972] - Shutting down
[junit] 2013-10-12 11:28:02,114 [myid:] - INFO [main:SyncRequestProcessor@190] - Shutting down
[junit] 2013-10-12 11:28:02,114 [myid:] - INFO [SyncThread:0:SyncRequestProcessor@168] - SyncRequestProcessor exited!
[junit] 2013-10-12 11:28:02,115 [myid:] - INFO [main:FinalRequestProcessor@442] - shutdown of request processor complete
[junit] 2013-10-12 11:28:02,115 [myid:] - INFO [ProcessThread(sid:0 cport:-1)::PrepRequestProcessor@156] - PrepRequestProcessor exited loop!
[junit] 2013-10-12 11:28:02,115 [myid:] - INFO [main:FourLetterWordMain@43] - connecting to 127.0.0.1 11221
[junit] 2013-10-12 11:28:03,001 [myid:] - INFO [SessionTracker:SessionTrackerImpl@134] - SessionTrackerImpl exited loop!
[junit] 2013-10-12 11:28:03,114 [myid:] - INFO [main:JMXEnv@133] - ensureOnly:[]
[junit] 2013-10-12 11:28:03,119 [myid:] - INFO [main:ZKTestCase$1@61] - SUCCEEDED testQuota
[junit] 2013-10-12 11:28:03,119 [myid:] - INFO [main:ZKTestCase$1@56] - FINISHED testQuota
[junit] Tests run: 1, Failures: 0, Errors: 0, Time elapsed: 7.511 sec
BUILD FAILED
f:\hudson\hudson-slave\workspace\ZooKeeper-trunk-WinVS2008_java\trunk\build.xml:1264: Tests failed!
Total time: 115 minutes 2 seconds
Build step 'Invoke Ant' marked build as failure
Recording test results
Email was triggered for: Failure
Sending email for trigger: Failure
###################################################################################
############################## FAILED TESTS (if any) ##############################
129 tests failed.
REGRESSION: org.apache.zookeeper.ZooKeeperTest.testDeleteRecursive
Error Message:
expected [0x141abccbc0a0001] expected:<1> but was:<0>
Stack Trace:
junit.framework.AssertionFailedError: expected [0x141abccbc0a0001] expected:<1> but was:<0>
at org.apache.zookeeper.test.JMXEnv.ensureAll(JMXEnv.java:115)
at org.apache.zookeeper.test.ClientBase.createClient(ClientBase.java:197)
at org.apache.zookeeper.test.ClientBase.createClient(ClientBase.java:171)
at org.apache.zookeeper.test.ClientBase.createClient(ClientBase.java:156)
at org.apache.zookeeper.test.ClientBase.createClient(ClientBase.java:149)
at org.apache.zookeeper.ZooKeeperTest.testDeleteRecursive(ZooKeeperTest.java:45)
at org.apache.zookeeper.JUnit4ZKTestRunner$LoggedInvokeMethod.evaluate(JUnit4ZKTestRunner.java:52)
REGRESSION: org.apache.zookeeper.server.InvalidSnapshotTest.testInvalidSnapshot
Error Message:
expected [0x141abcdf07c0000] expected:<1> but was:<0>
Stack Trace:
junit.framework.AssertionFailedError: expected [0x141abcdf07c0000] expected:<1> but was:<0>
at org.apache.zookeeper.test.JMXEnv.ensureAll(JMXEnv.java:115)
at org.apache.zookeeper.test.ClientBase.createClient(ClientBase.java:197)
at org.apache.zookeeper.test.ClientBase.createClient(ClientBase.java:171)
at org.apache.zookeeper.test.ClientBase.createClient(ClientBase.java:156)
at org.apache.zookeeper.test.ClientBase.createClient(ClientBase.java:149)
at org.apache.zookeeper.server.InvalidSnapshotTest.testInvalidSnapshot(InvalidSnapshotTest.java:53)
at org.apache.zookeeper.JUnit4ZKTestRunner$LoggedInvokeMethod.evaluate(JUnit4ZKTestRunner.java:52)
REGRESSION: org.apache.zookeeper.server.ZxidRolloverTest.testRolloverThenRestart
Error Message:
waiting for server up
Stack Trace:
java.lang.AssertionError: waiting for server up
at org.apache.zookeeper.test.QuorumUtil.startAll(QuorumUtil.java:151)
at org.apache.zookeeper.server.ZxidRolloverTest.startAll(ZxidRolloverTest.java:149)
at org.apache.zookeeper.server.ZxidRolloverTest.testRolloverThenRestart(ZxidRolloverTest.java:281)
REGRESSION: org.apache.zookeeper.server.quorum.QuorumPeerMainTest.testHighestZxidJoinLate
Error Message:
There should be a leader
Stack Trace:
junit.framework.AssertionFailedError: There should be a leader
at org.apache.zookeeper.server.quorum.QuorumPeerMainTest.testHighestZxidJoinLate(QuorumPeerMainTest.java:233)
at org.apache.zookeeper.JUnit4ZKTestRunner$LoggedInvokeMethod.evaluate(JUnit4ZKTestRunner.java:52)
REGRESSION: org.apache.zookeeper.server.quorum.ReconfigRecoveryTest.testNextConfigCompletion
Error Message:
waiting for server 0 being up
Stack Trace:
junit.framework.AssertionFailedError: waiting for server 0 being up
at org.apache.zookeeper.server.quorum.ReconfigRecoveryTest.testNextConfigCompletion(ReconfigRecoveryTest.java:72)
at org.apache.zookeeper.JUnit4ZKTestRunner$LoggedInvokeMethod.evaluate(JUnit4ZKTestRunner.java:52)
REGRESSION: org.apache.zookeeper.test.AsyncHammerTest.testHammer
Error Message:
waiting for server up
Stack Trace:
junit.framework.AssertionFailedError: waiting for server up
at org.apache.zookeeper.test.QuorumBase.startServers(QuorumBase.java:221)
at org.apache.zookeeper.test.QuorumBase.setUp(QuorumBase.java:118)
at org.apache.zookeeper.test.AsyncHammerTest.setUp(AsyncHammerTest.java:52)
at org.apache.zookeeper.test.AsyncHammerTest.testHammer(AsyncHammerTest.java:171)
at org.apache.zookeeper.JUnit4ZKTestRunner$LoggedInvokeMethod.evaluate(JUnit4ZKTestRunner.java:52)
REGRESSION: org.apache.zookeeper.test.AsyncHammerTest.testObserversHammer
Error Message:
waiting for server up
Stack Trace:
junit.framework.AssertionFailedError: waiting for server up
at org.apache.zookeeper.test.QuorumBase.startServers(QuorumBase.java:221)
at org.apache.zookeeper.test.QuorumBase.setUp(QuorumBase.java:118)
at org.apache.zookeeper.test.AsyncHammerTest.setUp(AsyncHammerTest.java:52)
at org.apache.zookeeper.test.AsyncHammerTest.testObserversHammer(AsyncHammerTest.java:203)
at org.apache.zookeeper.JUnit4ZKTestRunner$LoggedInvokeMethod.evaluate(JUnit4ZKTestRunner.java:52)
REGRESSION: org.apache.zookeeper.test.AsyncOpsTest.testAsyncCreate2
Error Message:
null
Stack Trace:
java.lang.NullPointerException
at org.apache.zookeeper.test.AsyncOpsTest.tearDown(AsyncOpsTest.java:57)
REGRESSION: org.apache.zookeeper.test.AsyncOpsTest.testAsyncCreateThree
Error Message:
null
Stack Trace:
java.lang.NullPointerException
at org.apache.zookeeper.test.AsyncOpsTest.tearDown(AsyncOpsTest.java:57)
REGRESSION: org.apache.zookeeper.test.AsyncOpsTest.testAsyncCreateFailure_NodeExists
Error Message:
null
Stack Trace:
java.lang.NullPointerException
at org.apache.zookeeper.test.AsyncOpsTest.tearDown(AsyncOpsTest.java:57)
REGRESSION: org.apache.zookeeper.test.AsyncOpsTest.testAsyncDelete
Error Message:
null
Stack Trace:
java.lang.NullPointerException
at org.apache.zookeeper.test.AsyncOpsTest.tearDown(AsyncOpsTest.java:57)
REGRESSION: org.apache.zookeeper.test.AsyncOpsTest.testAsyncDeleteFailure_NoNode
Error Message:
null
Stack Trace:
java.lang.NullPointerException
at org.apache.zookeeper.test.AsyncOpsTest.tearDown(AsyncOpsTest.java:57)
REGRESSION: org.apache.zookeeper.test.AsyncOpsTest.testAsyncSync
Error Message:
expected:<0> but was:<2>
Stack Trace:
junit.framework.AssertionFailedError: expected:<0> but was:<2>
at org.apache.zookeeper.test.JMXEnv.ensureOnly(JMXEnv.java:138)
at org.apache.zookeeper.test.ClientBase.stopServer(ClientBase.java:425)
at org.apache.zookeeper.test.ClientBase.tearDown(ClientBase.java:455)
at org.apache.zookeeper.test.AsyncOpsTest.tearDown(AsyncOpsTest.java:59)
REGRESSION: org.apache.zookeeper.test.AsyncOpsTest.testAsyncSetACL
Error Message:
expected:<0> but was:<2>
Stack Trace:
junit.framework.AssertionFailedError: expected:<0> but was:<2>
at org.apache.zookeeper.test.JMXEnv.ensureOnly(JMXEnv.java:138)
at org.apache.zookeeper.test.ClientBase.stopServer(ClientBase.java:425)
at org.apache.zookeeper.test.ClientBase.tearDown(ClientBase.java:455)
at org.apache.zookeeper.test.AsyncOpsTest.tearDown(AsyncOpsTest.java:59)
REGRESSION: org.apache.zookeeper.test.AsyncOpsTest.testAsyncSetACLFailure_NoNode
Error Message:
expected:<0> but was:<2>
Stack Trace:
junit.framework.AssertionFailedError: expected:<0> but was:<2>
at org.apache.zookeeper.test.JMXEnv.ensureOnly(JMXEnv.java:138)
at org.apache.zookeeper.test.ClientBase.stopServer(ClientBase.java:425)
at org.apache.zookeeper.test.ClientBase.tearDown(ClientBase.java:455)
at org.apache.zookeeper.test.AsyncOpsTest.tearDown(AsyncOpsTest.java:59)
REGRESSION: org.apache.zookeeper.test.AsyncOpsTest.testAsyncSetData
Error Message:
expected:<0> but was:<2>
Stack Trace:
junit.framework.AssertionFailedError: expected:<0> but was:<2>
at org.apache.zookeeper.test.JMXEnv.ensureOnly(JMXEnv.java:138)
at org.apache.zookeeper.test.ClientBase.stopServer(ClientBase.java:425)
at org.apache.zookeeper.test.ClientBase.tearDown(ClientBase.java:455)
at org.apache.zookeeper.test.AsyncOpsTest.tearDown(AsyncOpsTest.java:59)
REGRESSION: org.apache.zookeeper.test.AsyncOpsTest.testAsyncSetDataFailure_NoNode
Error Message:
expected:<0> but was:<2>
Stack Trace:
junit.framework.AssertionFailedError: expected:<0> but was:<2>
at org.apache.zookeeper.test.JMXEnv.ensureOnly(JMXEnv.java:138)
at org.apache.zookeeper.test.ClientBase.stopServer(ClientBase.java:425)
at org.apache.zookeeper.test.ClientBase.tearDown(ClientBase.java:455)
at org.apache.zookeeper.test.AsyncOpsTest.tearDown(AsyncOpsTest.java:59)
REGRESSION: org.apache.zookeeper.test.AsyncOpsTest.testAsyncExists
Error Message:
expected:<0> but was:<2>
Stack Trace:
junit.framework.AssertionFailedError: expected:<0> but was:<2>
at org.apache.zookeeper.test.JMXEnv.ensureOnly(JMXEnv.java:138)
at org.apache.zookeeper.test.ClientBase.stopServer(ClientBase.java:425)
at org.apache.zookeeper.test.ClientBase.tearDown(ClientBase.java:455)
at org.apache.zookeeper.test.AsyncOpsTest.tearDown(AsyncOpsTest.java:59)
REGRESSION: org.apache.zookeeper.test.AsyncOpsTest.testAsyncExistsFailure_NoNode
Error Message:
null
Stack Trace:
java.lang.NullPointerException
at org.apache.zookeeper.test.AsyncOpsTest.tearDown(AsyncOpsTest.java:57)
REGRESSION: org.apache.zookeeper.test.AsyncOpsTest.testAsyncGetACL
Error Message:
null
Stack Trace:
java.lang.NullPointerException
at org.apache.zookeeper.test.AsyncOpsTest.tearDown(AsyncOpsTest.java:57)
REGRESSION: org.apache.zookeeper.test.AsyncOpsTest.testAsyncGetChildrenEmpty
Error Message:
null
Stack Trace:
java.lang.NullPointerException
at org.apache.zookeeper.test.AsyncOpsTest.tearDown(AsyncOpsTest.java:57)
REGRESSION: org.apache.zookeeper.test.AsyncOpsTest.testAsyncGetChildrenSingle
Error Message:
null
Stack Trace:
java.lang.NullPointerException
at org.apache.zookeeper.test.AsyncOpsTest.tearDown(AsyncOpsTest.java:57)
REGRESSION: org.apache.zookeeper.test.AsyncOpsTest.testAsyncGetChildrenTwo
Error Message:
null
Stack Trace:
java.lang.NullPointerException
at org.apache.zookeeper.test.AsyncOpsTest.tearDown(AsyncOpsTest.java:57)
REGRESSION: org.apache.zookeeper.test.AsyncOpsTest.testAsyncGetChildrenFailure_NoNode
Error Message:
expected:<0> but was:<2>
Stack Trace:
junit.framework.AssertionFailedError: expected:<0> but was:<2>
at org.apache.zookeeper.test.JMXEnv.ensureOnly(JMXEnv.java:138)
at org.apache.zookeeper.test.ClientBase.stopServer(ClientBase.java:425)
at org.apache.zookeeper.test.ClientBase.tearDown(ClientBase.java:455)
at org.apache.zookeeper.test.AsyncOpsTest.tearDown(AsyncOpsTest.java:59)
REGRESSION: org.apache.zookeeper.test.AsyncOpsTest.testAsyncGetChildren2Empty
Error Message:
expected:<0> but was:<2>
Stack Trace:
junit.framework.AssertionFailedError: expected:<0> but was:<2>
at org.apache.zookeeper.test.JMXEnv.ensureOnly(JMXEnv.java:138)
at org.apache.zookeeper.test.ClientBase.stopServer(ClientBase.java:425)
at org.apache.zookeeper.test.ClientBase.tearDown(ClientBase.java:455)
at org.apache.zookeeper.test.AsyncOpsTest.tearDown(AsyncOpsTest.java:59)
REGRESSION: org.apache.zookeeper.test.AsyncOpsTest.testAsyncGetChildren2Single
Error Message:
expected:<0> but was:<2>
Stack Trace:
junit.framework.AssertionFailedError: expected:<0> but was:<2>
at org.apache.zookeeper.test.JMXEnv.ensureOnly(JMXEnv.java:138)
at org.apache.zookeeper.test.ClientBase.stopServer(ClientBase.java:425)
at org.apache.zookeeper.test.ClientBase.tearDown(ClientBase.java:455)
at org.apache.zookeeper.test.AsyncOpsTest.tearDown(AsyncOpsTest.java:59)
REGRESSION: org.apache.zookeeper.test.AsyncOpsTest.testAsyncGetChildren2Two
Error Message:
expected:<0> but was:<2>
Stack Trace:
junit.framework.AssertionFailedError: expected:<0> but was:<2>
at org.apache.zookeeper.test.JMXEnv.ensureOnly(JMXEnv.java:138)
at org.apache.zookeeper.test.ClientBase.stopServer(ClientBase.java:425)
at org.apache.zookeeper.test.ClientBase.tearDown(ClientBase.java:455)
at org.apache.zookeeper.test.AsyncOpsTest.tearDown(AsyncOpsTest.java:59)
REGRESSION: org.apache.zookeeper.test.AsyncOpsTest.testAsyncGetChildren2Failure_NoNode
Error Message:
expected:<0> but was:<2>
Stack Trace:
junit.framework.AssertionFailedError: expected:<0> but was:<2>
at org.apache.zookeeper.test.JMXEnv.ensureOnly(JMXEnv.java:138)
at org.apache.zookeeper.test.ClientBase.stopServer(ClientBase.java:425)
at org.apache.zookeeper.test.ClientBase.tearDown(ClientBase.java:455)
at org.apache.zookeeper.test.AsyncOpsTest.tearDown(AsyncOpsTest.java:59)
REGRESSION: org.apache.zookeeper.test.AsyncOpsTest.testAsyncGetData
Error Message:
expected:<0> but was:<2>
Stack Trace:
junit.framework.AssertionFailedError: expected:<0> but was:<2>
at org.apache.zookeeper.test.JMXEnv.ensureOnly(JMXEnv.java:138)
at org.apache.zookeeper.test.ClientBase.stopServer(ClientBase.java:425)
at org.apache.zookeeper.test.ClientBase.tearDown(ClientBase.java:455)
at org.apache.zookeeper.test.AsyncOpsTest.tearDown(AsyncOpsTest.java:59)
REGRESSION: org.apache.zookeeper.test.AsyncOpsTest.testAsyncGetDataFailure_NoNode
Error Message:
expected:<0> but was:<2>
Stack Trace:
junit.framework.AssertionFailedError: expected:<0> but was:<2>
at org.apache.zookeeper.test.JMXEnv.ensureOnly(JMXEnv.java:138)
at org.apache.zookeeper.test.ClientBase.stopServer(ClientBase.java:425)
at org.apache.zookeeper.test.ClientBase.tearDown(ClientBase.java:455)
at org.apache.zookeeper.test.AsyncOpsTest.tearDown(AsyncOpsTest.java:59)
REGRESSION: org.apache.zookeeper.test.AsyncTest.testAsync
Error Message:
waiting for server up
Stack Trace:
junit.framework.AssertionFailedError: waiting for server up
at org.apache.zookeeper.test.QuorumBase.startServers(QuorumBase.java:221)
at org.apache.zookeeper.test.QuorumBase.setUp(QuorumBase.java:118)
at org.apache.zookeeper.test.QuorumBase.setUp(QuorumBase.java:76)
at org.apache.zookeeper.test.AsyncTest.setUp(AsyncTest.java:57)
REGRESSION: org.apache.zookeeper.test.AuthTest.testBadAuthThenSendOtherCommands
Error Message:
expected [0x141abdbf4b90001] expected:<1> but was:<0>
Stack Trace:
junit.framework.AssertionFailedError: expected [0x141abdbf4b90001] expected:<1> but was:<0>
at org.apache.zookeeper.test.JMXEnv.ensureAll(JMXEnv.java:115)
at org.apache.zookeeper.test.ClientBase.createClient(ClientBase.java:197)
at org.apache.zookeeper.test.ClientBase.createClient(ClientBase.java:171)
at org.apache.zookeeper.test.AuthTest.createClient(AuthTest.java:50)
at org.apache.zookeeper.test.ClientBase.createClient(ClientBase.java:149)
at org.apache.zookeeper.test.AuthTest.testBadAuthThenSendOtherCommands(AuthTest.java:86)
at org.apache.zookeeper.JUnit4ZKTestRunner$LoggedInvokeMethod.evaluate(JUnit4ZKTestRunner.java:52)
REGRESSION: org.apache.zookeeper.test.ChrootClientTest.testClientwithoutWatcherObj
Error Message:
expected [0x141abe156470001] expected:<1> but was:<0>
Stack Trace:
junit.framework.AssertionFailedError: expected [0x141abe156470001] expected:<1> but was:<0>
at org.apache.zookeeper.test.JMXEnv.ensureAll(JMXEnv.java:115)
at org.apache.zookeeper.test.ClientBase.createClient(ClientBase.java:197)
at org.apache.zookeeper.test.ClientBase.createClient(ClientBase.java:171)
at org.apache.zookeeper.test.ClientBase.createClient(ClientBase.java:156)
at org.apache.zookeeper.test.ChrootClientTest.setUp(ChrootClientTest.java:41)
REGRESSION: org.apache.zookeeper.test.CreateTest.testCreateWithStat
Error Message:
null
Stack Trace:
java.lang.NullPointerException
at org.apache.zookeeper.test.CreateTest.tearDown(CreateTest.java:48)
REGRESSION: org.apache.zookeeper.test.DisconnectedWatcherTest.testChildWatcherAutoResetWithChroot
Error Message:
expected [0x141abe4ff8b0002] expected:<1> but was:<0>
Stack Trace:
junit.framework.AssertionFailedError: expected [0x141abe4ff8b0002] expected:<1> but was:<0>
at org.apache.zookeeper.test.JMXEnv.ensureAll(JMXEnv.java:115)
at org.apache.zookeeper.test.ClientBase.createClient(ClientBase.java:197)
at org.apache.zookeeper.test.ClientBase.createClient(ClientBase.java:171)
at org.apache.zookeeper.test.ClientBase.createClient(ClientBase.java:156)
at org.apache.zookeeper.test.ClientBase.createClient(ClientBase.java:149)
at org.apache.zookeeper.test.DisconnectedWatcherTest.testChildWatcherAutoResetWithChroot(DisconnectedWatcherTest.java:58)
at org.apache.zookeeper.JUnit4ZKTestRunner$LoggedInvokeMethod.evaluate(JUnit4ZKTestRunner.java:52)
REGRESSION: org.apache.zookeeper.test.DisconnectedWatcherTest.testDeepChildWatcherAutoResetWithChroot
Error Message:
expected [0x141abe539c40001] expected:<1> but was:<0>
Stack Trace:
junit.framework.AssertionFailedError: expected [0x141abe539c40001] expected:<1> but was:<0>
at org.apache.zookeeper.test.JMXEnv.ensureAll(JMXEnv.java:115)
at org.apache.zookeeper.test.ClientBase.createClient(ClientBase.java:197)
at org.apache.zookeeper.test.ClientBase.createClient(ClientBase.java:171)
at org.apache.zookeeper.test.ClientBase.createClient(ClientBase.java:156)
at org.apache.zookeeper.test.ClientBase.createClient(ClientBase.java:149)
at org.apache.zookeeper.test.DisconnectedWatcherTest.testDeepChildWatcherAutoResetWithChroot(DisconnectedWatcherTest.java:137)
at org.apache.zookeeper.JUnit4ZKTestRunner$LoggedInvokeMethod.evaluate(JUnit4ZKTestRunner.java:52)
REGRESSION: org.apache.zookeeper.test.FLEBackwardElectionRoundTest.testBackwardElectionRound
Error Message:
State is not leading. Current state:LOOKING
Stack Trace:
junit.framework.AssertionFailedError: State is not leading. Current state:LOOKING
at org.apache.zookeeper.test.FLEBackwardElectionRoundTest.testBackwardElectionRound(FLEBackwardElectionRoundTest.java:137)
at org.apache.zookeeper.JUnit4ZKTestRunner$LoggedInvokeMethod.evaluate(JUnit4ZKTestRunner.java:52)
REGRESSION: org.apache.zookeeper.test.FourLetterWordsTest.validateConsOutput
Error Message:
expected [0x141abf1ef9a0001] expected:<1> but was:<0>
Stack Trace:
junit.framework.AssertionFailedError: expected [0x141abf1ef9a0001] expected:<1> but was:<0>
at org.apache.zookeeper.test.JMXEnv.ensureAll(JMXEnv.java:115)
at org.apache.zookeeper.test.ClientBase.createClient(ClientBase.java:197)
at org.apache.zookeeper.test.ClientBase.createClient(ClientBase.java:171)
at org.apache.zookeeper.test.ClientBase.createClient(ClientBase.java:156)
at org.apache.zookeeper.test.ClientBase.createClient(ClientBase.java:149)
at org.apache.zookeeper.test.FourLetterWordsTest.validateConsOutput(FourLetterWordsTest.java:158)
at org.apache.zookeeper.JUnit4ZKTestRunner$LoggedInvokeMethod.evaluate(JUnit4ZKTestRunner.java:52)
REGRESSION: org.apache.zookeeper.test.LocalSessionRequestTest.testLocalSessionsOnFollower
Error Message:
waiting for server down
Stack Trace:
junit.framework.AssertionFailedError: waiting for server down
at org.apache.zookeeper.test.QuorumBase.tearDown(QuorumBase.java:360)
at org.apache.zookeeper.test.LocalSessionRequestTest.tearDown(LocalSessionRequestTest.java:60)
REGRESSION: org.apache.zookeeper.test.MultiTransactionTest.testUpdateConflict[0]
Error Message:
expected [0x141abf667bd0000] expected:<1> but was:<0>
Stack Trace:
junit.framework.AssertionFailedError: expected [0x141abf667bd0000] expected:<1> but was:<0>
at org.apache.zookeeper.test.JMXEnv.ensureAll(JMXEnv.java:115)
at org.apache.zookeeper.test.ClientBase.createClient(ClientBase.java:197)
at org.apache.zookeeper.test.ClientBase.createClient(ClientBase.java:171)
at org.apache.zookeeper.test.ClientBase.createClient(ClientBase.java:156)
at org.apache.zookeeper.test.ClientBase.createClient(ClientBase.java:149)
at org.apache.zookeeper.test.MultiTransactionTest.setUp(MultiTransactionTest.java:78)
REGRESSION: org.apache.zookeeper.test.MultiTransactionTest.testOpResultEquals[0]
Error Message:
expected [0x141abf67b010000] expected:<1> but was:<0>
Stack Trace:
junit.framework.AssertionFailedError: expected [0x141abf67b010000] expected:<1> but was:<0>
at org.apache.zookeeper.test.JMXEnv.ensureAll(JMXEnv.java:115)
at org.apache.zookeeper.test.ClientBase.createClient(ClientBase.java:197)
at org.apache.zookeeper.test.ClientBase.createClient(ClientBase.java:171)
at org.apache.zookeeper.test.ClientBase.createClient(ClientBase.java:156)
at org.apache.zookeeper.test.ClientBase.createClient(ClientBase.java:149)
at org.apache.zookeeper.test.MultiTransactionTest.setUp(MultiTransactionTest.java:78)
REGRESSION: org.apache.zookeeper.test.MultiTransactionTest.testTransactionBuilder[0]
Error Message:
expected [0x141abf68c4c0001] expected:<1> but was:<0>
Stack Trace:
junit.framework.AssertionFailedError: expected [0x141abf68c4c0001] expected:<1> but was:<0>
at org.apache.zookeeper.test.JMXEnv.ensureAll(JMXEnv.java:115)
at org.apache.zookeeper.test.ClientBase.createClient(ClientBase.java:197)
at org.apache.zookeeper.test.ClientBase.createClient(ClientBase.java:171)
at org.apache.zookeeper.test.ClientBase.createClient(ClientBase.java:156)
at org.apache.zookeeper.test.ClientBase.createClient(ClientBase.java:149)
at org.apache.zookeeper.test.MultiTransactionTest.setUp(MultiTransactionTest.java:78)
REGRESSION: org.apache.zookeeper.test.AsyncHammerTest.testObserversHammer
Error Message:
waiting for server up
Stack Trace:
junit.framework.AssertionFailedError: waiting for server up
at org.apache.zookeeper.test.QuorumBase.startServers(QuorumBase.java:221)
at org.apache.zookeeper.test.QuorumBase.setUp(QuorumBase.java:118)
at org.apache.zookeeper.test.AsyncHammerTest.setUp(AsyncHammerTest.java:52)
at org.apache.zookeeper.test.AsyncHammerTest.testObserversHammer(AsyncHammerTest.java:203)
at org.apache.zookeeper.JUnit4ZKTestRunner$LoggedInvokeMethod.evaluate(JUnit4ZKTestRunner.java:52)
REGRESSION: org.apache.zookeeper.test.AsyncOpsTest.testAsyncCreate2
Error Message:
null
Stack Trace:
java.lang.NullPointerException
at org.apache.zookeeper.test.AsyncOpsTest.tearDown(AsyncOpsTest.java:57)
REGRESSION: org.apache.zookeeper.test.AsyncOpsTest.testAsyncCreateThree
Error Message:
null
Stack Trace:
java.lang.NullPointerException
at org.apache.zookeeper.test.AsyncOpsTest.tearDown(AsyncOpsTest.java:57)
REGRESSION: org.apache.zookeeper.test.AsyncOpsTest.testAsyncCreateFailure_NodeExists
Error Message:
null
Stack Trace:
java.lang.NullPointerException
at org.apache.zookeeper.test.AsyncOpsTest.tearDown(AsyncOpsTest.java:57)
REGRESSION: org.apache.zookeeper.test.AsyncOpsTest.testAsyncDelete
Error Message:
null
Stack Trace:
java.lang.NullPointerException
at org.apache.zookeeper.test.AsyncOpsTest.tearDown(AsyncOpsTest.java:57)
REGRESSION: org.apache.zookeeper.test.AsyncOpsTest.testAsyncDeleteFailure_NoNode
Error Message:
null
Stack Trace:
java.lang.NullPointerException
at org.apache.zookeeper.test.AsyncOpsTest.tearDown(AsyncOpsTest.java:57)
REGRESSION: org.apache.zookeeper.test.AsyncOpsTest.testAsyncSync
Error Message:
expected:<0> but was:<2>
Stack Trace:
junit.framework.AssertionFailedError: expected:<0> but was:<2>
at org.apache.zookeeper.test.JMXEnv.ensureOnly(JMXEnv.java:138)
at org.apache.zookeeper.test.ClientBase.stopServer(ClientBase.java:425)
at org.apache.zookeeper.test.ClientBase.tearDown(ClientBase.java:455)
at org.apache.zookeeper.test.AsyncOpsTest.tearDown(AsyncOpsTest.java:59)
REGRESSION: org.apache.zookeeper.test.AsyncOpsTest.testAsyncSetACL
Error Message:
expected:<0> but was:<2>
Stack Trace:
junit.framework.AssertionFailedError: expected:<0> but was:<2>
at org.apache.zookeeper.test.JMXEnv.ensureOnly(JMXEnv.java:138)
at org.apache.zookeeper.test.ClientBase.stopServer(ClientBase.java:425)
at org.apache.zookeeper.test.ClientBase.tearDown(ClientBase.java:455)
at org.apache.zookeeper.test.AsyncOpsTest.tearDown(AsyncOpsTest.java:59)
REGRESSION: org.apache.zookeeper.test.AsyncOpsTest.testAsyncSetACLFailure_NoNode
Error Message:
expected:<0> but was:<2>
Stack Trace:
junit.framework.AssertionFailedError: expected:<0> but was:<2>
at org.apache.zookeeper.test.JMXEnv.ensureOnly(JMXEnv.java:138)
at org.apache.zookeeper.test.ClientBase.stopServer(ClientBase.java:425)
at org.apache.zookeeper.test.ClientBase.tearDown(ClientBase.java:455)
at org.apache.zookeeper.test.AsyncOpsTest.tearDown(AsyncOpsTest.java:59)
REGRESSION: org.apache.zookeeper.test.AsyncOpsTest.testAsyncSetData
Error Message:
expected:<0> but was:<2>
Stack Trace:
junit.framework.AssertionFailedError: expected:<0> but was:<2>
at org.apache.zookeeper.test.JMXEnv.ensureOnly(JMXEnv.java:138)
at org.apache.zookeeper.test.ClientBase.stopServer(ClientBase.java:425)
at org.apache.zookeeper.test.ClientBase.tearDown(ClientBase.java:455)
at org.apache.zookeeper.test.AsyncOpsTest.tearDown(AsyncOpsTest.java:59)
REGRESSION: org.apache.zookeeper.test.AsyncOpsTest.testAsyncSetDataFailure_NoNode
Error Message:
expected:<0> but was:<2>
Stack Trace:
junit.framework.AssertionFailedError: expected:<0> but was:<2>
at org.apache.zookeeper.test.JMXEnv.ensureOnly(JMXEnv.java:138)
at org.apache.zookeeper.test.ClientBase.stopServer(ClientBase.java:425)
at org.apache.zookeeper.test.ClientBase.tearDown(ClientBase.java:455)
at org.apache.zookeeper.test.AsyncOpsTest.tearDown(AsyncOpsTest.java:59)
REGRESSION: org.apache.zookeeper.test.AsyncOpsTest.testAsyncExists
Error Message:
expected:<0> but was:<2>
Stack Trace:
junit.framework.AssertionFailedError: expected:<0> but was:<2>
at org.apache.zookeeper.test.JMXEnv.ensureOnly(JMXEnv.java:138)
at org.apache.zookeeper.test.ClientBase.stopServer(ClientBase.java:425)
at org.apache.zookeeper.test.ClientBase.tearDown(ClientBase.java:455)
at org.apache.zookeeper.test.AsyncOpsTest.tearDown(AsyncOpsTest.java:59)
REGRESSION: org.apache.zookeeper.test.AsyncOpsTest.testAsyncExistsFailure_NoNode
Error Message:
expected:<0> but was:<2>
Stack Trace:
junit.framework.AssertionFailedError: expected:<0> but was:<2>
at org.apache.zookeeper.test.JMXEnv.ensureOnly(JMXEnv.java:138)
at org.apache.zookeeper.test.ClientBase.stopServer(ClientBase.java:425)
at org.apache.zookeeper.test.ClientBase.tearDown(ClientBase.java:455)
at org.apache.zookeeper.test.AsyncOpsTest.tearDown(AsyncOpsTest.java:59)
REGRESSION: org.apache.zookeeper.test.AsyncOpsTest.testAsyncGetACL
Error Message:
expected:<0> but was:<2>
Stack Trace:
junit.framework.AssertionFailedError: expected:<0> but was:<2>
at org.apache.zookeeper.test.JMXEnv.ensureOnly(JMXEnv.java:138)
at org.apache.zookeeper.test.ClientBase.stopServer(ClientBase.java:425)
at org.apache.zookeeper.test.ClientBase.tearDown(ClientBase.java:455)
at org.apache.zookeeper.test.AsyncOpsTest.tearDown(AsyncOpsTest.java:59)
REGRESSION: org.apache.zookeeper.test.AsyncOpsTest.testAsyncGetChildrenEmpty
Error Message:
expected:<0> but was:<2>
Stack Trace:
junit.framework.AssertionFailedError: expected:<0> but was:<2>
at org.apache.zookeeper.test.JMXEnv.ensureOnly(JMXEnv.java:138)
at org.apache.zookeeper.test.ClientBase.stopServer(ClientBase.java:425)
at org.apache.zookeeper.test.ClientBase.tearDown(ClientBase.java:455)
at org.apache.zookeeper.test.AsyncOpsTest.tearDown(AsyncOpsTest.java:59)
REGRESSION: org.apache.zookeeper.test.AsyncOpsTest.testAsyncGetChildrenSingle
Error Message:
expected:<0> but was:<2>
Stack Trace:
junit.framework.AssertionFailedError: expected:<0> but was:<2>
at org.apache.zookeeper.test.JMXEnv.ensureOnly(JMXEnv.java:138)
at org.apache.zookeeper.test.ClientBase.stopServer(ClientBase.java:425)
at org.apache.zookeeper.test.ClientBase.tearDown(ClientBase.java:455)
at org.apache.zookeeper.test.AsyncOpsTest.tearDown(AsyncOpsTest.java:59)
REGRESSION: org.apache.zookeeper.test.AsyncOpsTest.testAsyncGetChildrenTwo
Error Message:
expected:<0> but was:<2>
Stack Trace:
junit.framework.AssertionFailedError: expected:<0> but was:<2>
at org.apache.zookeeper.test.JMXEnv.ensureOnly(JMXEnv.java:138)
at org.apache.zookeeper.test.ClientBase.stopServer(ClientBase.java:425)
at org.apache.zookeeper.test.ClientBase.tearDown(ClientBase.java:455)
at org.apache.zookeeper.test.AsyncOpsTest.tearDown(AsyncOpsTest.java:59)
REGRESSION: org.apache.zookeeper.test.AsyncOpsTest.testAsyncGetChildrenFailure_NoNode
Error Message:
expected:<0> but was:<2>
Stack Trace:
junit.framework.AssertionFailedError: expected:<0> but was:<2>
at org.apache.zookeeper.test.JMXEnv.ensureOnly(JMXEnv.java:138)
at org.apache.zookeeper.test.ClientBase.stopServer(ClientBase.java:425)
at org.apache.zookeeper.test.ClientBase.tearDown(ClientBase.java:455)
at org.apache.zookeeper.test.AsyncOpsTest.tearDown(AsyncOpsTest.java:59)
REGRESSION: org.apache.zookeeper.test.AsyncOpsTest.testAsyncGetChildren2Empty
Error Message:
expected:<0> but was:<2>
Stack Trace:
junit.framework.AssertionFailedError: expected:<0> but was:<2>
at org.apache.zookeeper.test.JMXEnv.ensureOnly(JMXEnv.java:138)
at org.apache.zookeeper.test.ClientBase.stopServer(ClientBase.java:425)
at org.apache.zookeeper.test.ClientBase.tearDown(ClientBase.java:455)
at org.apache.zookeeper.test.AsyncOpsTest.tearDown(AsyncOpsTest.java:59)
REGRESSION: org.apache.zookeeper.test.AsyncOpsTest.testAsyncGetChildren2Single
Error Message:
expected:<0> but was:<2>
Stack Trace:
junit.framework.AssertionFailedError: expected:<0> but was:<2>
at org.apache.zookeeper.test.JMXEnv.ensureOnly(JMXEnv.java:138)
at org.apache.zookeeper.test.ClientBase.stopServer(ClientBase.java:425)
at org.apache.zookeeper.test.ClientBase.tearDown(ClientBase.java:455)
at org.apache.zookeeper.test.AsyncOpsTest.tearDown(AsyncOpsTest.java:59)
REGRESSION: org.apache.zookeeper.test.AsyncOpsTest.testAsyncGetChildren2Two
Error Message:
expected:<0> but was:<2>
Stack Trace:
junit.framework.AssertionFailedError: expected:<0> but was:<2>
at org.apache.zookeeper.test.JMXEnv.ensureOnly(JMXEnv.java:138)
at org.apache.zookeeper.test.ClientBase.stopServer(ClientBase.java:425)
at org.apache.zookeeper.test.ClientBase.tearDown(ClientBase.java:455)
at org.apache.zookeeper.test.AsyncOpsTest.tearDown(AsyncOpsTest.java:59)
REGRESSION: org.apache.zookeeper.test.AsyncOpsTest.testAsyncGetChildren2Failure_NoNode
Error Message:
expected:<0> but was:<2>
Stack Trace:
junit.framework.AssertionFailedError: expected:<0> but was:<2>
at org.apache.zookeeper.test.JMXEnv.ensureOnly(JMXEnv.java:138)
at org.apache.zookeeper.test.ClientBase.stopServer(ClientBase.java:425)
at org.apache.zookeeper.test.ClientBase.tearDown(ClientBase.java:455)
at org.apache.zookeeper.test.AsyncOpsTest.tearDown(AsyncOpsTest.java:59)
REGRESSION: org.apache.zookeeper.test.AsyncOpsTest.testAsyncGetData
Error Message:
expected:<0> but was:<2>
Stack Trace:
junit.framework.AssertionFailedError: expected:<0> but was:<2>
at org.apache.zookeeper.test.JMXEnv.ensureOnly(JMXEnv.java:138)
at org.apache.zookeeper.test.ClientBase.stopServer(ClientBase.java:425)
at org.apache.zookeeper.test.ClientBase.tearDown(ClientBase.java:455)
at org.apache.zookeeper.test.AsyncOpsTest.tearDown(AsyncOpsTest.java:59)
REGRESSION: org.apache.zookeeper.test.AsyncOpsTest.testAsyncGetDataFailure_NoNode
Error Message:
expected:<0> but was:<2>
Stack Trace:
junit.framework.AssertionFailedError: expected:<0> but was:<2>
at org.apache.zookeeper.test.JMXEnv.ensureOnly(JMXEnv.java:138)
at org.apache.zookeeper.test.ClientBase.stopServer(ClientBase.java:425)
at org.apache.zookeeper.test.ClientBase.tearDown(ClientBase.java:455)
at org.apache.zookeeper.test.AsyncOpsTest.tearDown(AsyncOpsTest.java:59)
REGRESSION: org.apache.zookeeper.test.ChrootClientTest.testPing
Error Message:
expected:<0> but was:<2>
Stack Trace:
junit.framework.AssertionFailedError: expected:<0> but was:<2>
at org.apache.zookeeper.test.JMXEnv.ensureOnly(JMXEnv.java:138)
at org.apache.zookeeper.test.ClientBase.stopServer(ClientBase.java:425)
at org.apache.zookeeper.test.ClientBase.tearDown(ClientBase.java:455)
REGRESSION: org.apache.zookeeper.test.ChrootClientTest.testClientwithoutWatcherObj
Error Message:
expected:<0> but was:<2>
Stack Trace:
junit.framework.AssertionFailedError: expected:<0> but was:<2>
at org.apache.zookeeper.test.JMXEnv.ensureOnly(JMXEnv.java:138)
at org.apache.zookeeper.test.ClientBase.stopServer(ClientBase.java:425)
at org.apache.zookeeper.test.ClientBase.tearDown(ClientBase.java:455)
REGRESSION: org.apache.zookeeper.test.ChrootClientTest.testClientWithWatcherObj
Error Message:
expected:<0> but was:<2>
Stack Trace:
junit.framework.AssertionFailedError: expected:<0> but was:<2>
at org.apache.zookeeper.test.JMXEnv.ensureOnly(JMXEnv.java:138)
at org.apache.zookeeper.test.ClientBase.stopServer(ClientBase.java:425)
at org.apache.zookeeper.test.ClientBase.tearDown(ClientBase.java:455)
REGRESSION: org.apache.zookeeper.test.ChrootClientTest.testTestability
Error Message:
expected:<0> but was:<2>
Stack Trace:
junit.framework.AssertionFailedError: expected:<0> but was:<2>
at org.apache.zookeeper.test.JMXEnv.ensureOnly(JMXEnv.java:138)
at org.apache.zookeeper.test.ClientBase.stopServer(ClientBase.java:425)
at org.apache.zookeeper.test.ClientBase.tearDown(ClientBase.java:455)
REGRESSION: org.apache.zookeeper.test.ChrootClientTest.testACLs
Error Message:
expected:<0> but was:<2>
Stack Trace:
junit.framework.AssertionFailedError: expected:<0> but was:<2>
at org.apache.zookeeper.test.JMXEnv.ensureOnly(JMXEnv.java:138)
at org.apache.zookeeper.test.ClientBase.stopServer(ClientBase.java:425)
at org.apache.zookeeper.test.ClientBase.tearDown(ClientBase.java:455)
REGRESSION: org.apache.zookeeper.test.ChrootClientTest.testMutipleWatcherObjs
Error Message:
expected:<0> but was:<2>
Stack Trace:
junit.framework.AssertionFailedError: expected:<0> but was:<2>
at org.apache.zookeeper.test.JMXEnv.ensureOnly(JMXEnv.java:138)
at org.apache.zookeeper.test.ClientBase.stopServer(ClientBase.java:425)
at org.apache.zookeeper.test.ClientBase.tearDown(ClientBase.java:455)
REGRESSION: org.apache.zookeeper.test.ChrootClientTest.testSequentialNodeNames
Error Message:
expected:<0> but was:<2>
Stack Trace:
junit.framework.AssertionFailedError: expected:<0> but was:<2>
at org.apache.zookeeper.test.JMXEnv.ensureOnly(JMXEnv.java:138)
at org.apache.zookeeper.test.ClientBase.stopServer(ClientBase.java:425)
at org.apache.zookeeper.test.ClientBase.tearDown(ClientBase.java:455)
REGRESSION: org.apache.zookeeper.test.ChrootClientTest.testSequentialNodeData
Error Message:
expected:<0> but was:<2>
Stack Trace:
junit.framework.AssertionFailedError: expected:<0> but was:<2>
at org.apache.zookeeper.test.JMXEnv.ensureOnly(JMXEnv.java:138)
at org.apache.zookeeper.test.ClientBase.stopServer(ClientBase.java:425)
at org.apache.zookeeper.test.ClientBase.tearDown(ClientBase.java:455)
REGRESSION: org.apache.zookeeper.test.ChrootClientTest.testLargeNodeData
Error Message:
expected:<0> but was:<2>
Stack Trace:
junit.framework.AssertionFailedError: expected:<0> but was:<2>
at org.apache.zookeeper.test.JMXEnv.ensureOnly(JMXEnv.java:138)
at org.apache.zookeeper.test.ClientBase.stopServer(ClientBase.java:425)
at org.apache.zookeeper.test.ClientBase.tearDown(ClientBase.java:455)
REGRESSION: org.apache.zookeeper.test.ChrootClientTest.testPathValidation
Error Message:
expected:<0> but was:<2>
Stack Trace:
junit.framework.AssertionFailedError: expected:<0> but was:<2>
at org.apache.zookeeper.test.JMXEnv.ensureOnly(JMXEnv.java:138)
at org.apache.zookeeper.test.ClientBase.stopServer(ClientBase.java:425)
at org.apache.zookeeper.test.ClientBase.tearDown(ClientBase.java:455)
REGRESSION: org.apache.zookeeper.test.ChrootClientTest.testDeleteWithChildren
Error Message:
expected:<0> but was:<2>
Stack Trace:
junit.framework.AssertionFailedError: expected:<0> but was:<2>
at org.apache.zookeeper.test.JMXEnv.ensureOnly(JMXEnv.java:138)
at org.apache.zookeeper.test.ClientBase.stopServer(ClientBase.java:425)
at org.apache.zookeeper.test.ClientBase.tearDown(ClientBase.java:455)
REGRESSION: org.apache.zookeeper.test.ChrootClientTest.testClientCleanup
Error Message:
expected:<0> but was:<2>
Stack Trace:
junit.framework.AssertionFailedError: expected:<0> but was:<2>
at org.apache.zookeeper.test.JMXEnv.ensureOnly(JMXEnv.java:138)
at org.apache.zookeeper.test.ClientBase.stopServer(ClientBase.java:425)
at org.apache.zookeeper.test.ClientBase.tearDown(ClientBase.java:455)
REGRESSION: org.apache.zookeeper.test.ChrootClientTest.testNonExistingOpCode
Error Message:
expected:<0> but was:<2>
Stack Trace:
junit.framework.AssertionFailedError: expected:<0> but was:<2>
at org.apache.zookeeper.test.JMXEnv.ensureOnly(JMXEnv.java:138)
at org.apache.zookeeper.test.ClientBase.stopServer(ClientBase.java:425)
at org.apache.zookeeper.test.ClientBase.tearDown(ClientBase.java:455)
REGRESSION: org.apache.zookeeper.test.ClientTest.testPing
Error Message:
expected:<0> but was:<2>
Stack Trace:
junit.framework.AssertionFailedError: expected:<0> but was:<2>
at org.apache.zookeeper.test.JMXEnv.ensureOnly(JMXEnv.java:138)
at org.apache.zookeeper.test.ClientBase.stopServer(ClientBase.java:425)
at org.apache.zookeeper.test.ClientBase.tearDown(ClientBase.java:455)
REGRESSION: org.apache.zookeeper.test.ClientTest.testClientwithoutWatcherObj
Error Message:
expected:<0> but was:<2>
Stack Trace:
junit.framework.AssertionFailedError: expected:<0> but was:<2>
at org.apache.zookeeper.test.JMXEnv.ensureOnly(JMXEnv.java:138)
at org.apache.zookeeper.test.ClientBase.stopServer(ClientBase.java:425)
at org.apache.zookeeper.test.ClientBase.tearDown(ClientBase.java:455)
REGRESSION: org.apache.zookeeper.test.ClientTest.testClientWithWatcherObj
Error Message:
expected:<0> but was:<2>
Stack Trace:
junit.framework.AssertionFailedError: expected:<0> but was:<2>
at org.apache.zookeeper.test.JMXEnv.ensureOnly(JMXEnv.java:138)
at org.apache.zookeeper.test.ClientBase.stopServer(ClientBase.java:425)
at org.apache.zookeeper.test.ClientBase.tearDown(ClientBase.java:455)
REGRESSION: org.apache.zookeeper.test.ClientTest.testTestability
Error Message:
expected:<0> but was:<2>
Stack Trace:
junit.framework.AssertionFailedError: expected:<0> but was:<2>
at org.apache.zookeeper.test.JMXEnv.ensureOnly(JMXEnv.java:138)
at org.apache.zookeeper.test.ClientBase.stopServer(ClientBase.java:425)
at org.apache.zookeeper.test.ClientBase.tearDown(ClientBase.java:455)
REGRESSION: org.apache.zookeeper.test.ClientTest.testACLs
Error Message:
expected:<0> but was:<2>
Stack Trace:
junit.framework.AssertionFailedError: expected:<0> but was:<2>
at org.apache.zookeeper.test.JMXEnv.ensureOnly(JMXEnv.java:138)
at org.apache.zookeeper.test.ClientBase.stopServer(ClientBase.java:425)
at org.apache.zookeeper.test.ClientBase.tearDown(ClientBase.java:455)
REGRESSION: org.apache.zookeeper.test.ClientTest.testMutipleWatcherObjs
Error Message:
expected:<0> but was:<2>
Stack Trace:
junit.framework.AssertionFailedError: expected:<0> but was:<2>
at org.apache.zookeeper.test.JMXEnv.ensureOnly(JMXEnv.java:138)
at org.apache.zookeeper.test.ClientBase.stopServer(ClientBase.java:425)
at org.apache.zookeeper.test.ClientBase.tearDown(ClientBase.java:455)
REGRESSION: org.apache.zookeeper.test.ClientTest.testSequentialNodeNames
Error Message:
expected:<0> but was:<2>
Stack Trace:
junit.framework.AssertionFailedError: expected:<0> but was:<2>
at org.apache.zookeeper.test.JMXEnv.ensureOnly(JMXEnv.java:138)
at org.apache.zookeeper.test.ClientBase.stopServer(ClientBase.java:425)
at org.apache.zookeeper.test.ClientBase.tearDown(ClientBase.java:455)
REGRESSION: org.apache.zookeeper.test.ClientTest.testSequentialNodeData
Error Message:
expected:<0> but was:<2>
Stack Trace:
junit.framework.AssertionFailedError: expected:<0> but was:<2>
at org.apache.zookeeper.test.JMXEnv.ensureOnly(JMXEnv.java:138)
at org.apache.zookeeper.test.ClientBase.stopServer(ClientBase.java:425)
at org.apache.zookeeper.test.ClientBase.tearDown(ClientBase.java:455)
REGRESSION: org.apache.zookeeper.test.ClientTest.testLargeNodeData
Error Message:
expected:<0> but was:<2>
Stack Trace:
junit.framework.AssertionFailedError: expected:<0> but was:<2>
at org.apache.zookeeper.test.JMXEnv.ensureOnly(JMXEnv.java:138)
at org.apache.zookeeper.test.ClientBase.stopServer(ClientBase.java:425)
at org.apache.zookeeper.test.ClientBase.tearDown(ClientBase.java:455)
REGRESSION: org.apache.zookeeper.test.ClientTest.testPathValidation
Error Message:
expected:<0> but was:<2>
Stack Trace:
junit.framework.AssertionFailedError: expected:<0> but was:<2>
at org.apache.zookeeper.test.JMXEnv.ensureOnly(JMXEnv.java:138)
at org.apache.zookeeper.test.ClientBase.stopServer(ClientBase.java:425)
at org.apache.zookeeper.test.ClientBase.tearDown(ClientBase.java:455)
REGRESSION: org.apache.zookeeper.test.ClientTest.testDeleteWithChildren
Error Message:
expected:<0> but was:<2>
Stack Trace:
junit.framework.AssertionFailedError: expected:<0> but was:<2>
at org.apache.zookeeper.test.JMXEnv.ensureOnly(JMXEnv.java:138)
at org.apache.zookeeper.test.ClientBase.stopServer(ClientBase.java:425)
at org.apache.zookeeper.test.ClientBase.tearDown(ClientBase.java:455)
REGRESSION: org.apache.zookeeper.test.ClientTest.testClientCleanup
Error Message:
expected:<0> but was:<2>
Stack Trace:
junit.framework.AssertionFailedError: expected:<0> but was:<2>
at org.apache.zookeeper.test.JMXEnv.ensureOnly(JMXEnv.java:138)
at org.apache.zookeeper.test.ClientBase.stopServer(ClientBase.java:425)
at org.apache.zookeeper.test.ClientBase.tearDown(ClientBase.java:455)
REGRESSION: org.apache.zookeeper.test.ClientTest.testNonExistingOpCode
Error Message:
expected:<0> but was:<2>
Stack Trace:
junit.framework.AssertionFailedError: expected:<0> but was:<2>
at org.apache.zookeeper.test.JMXEnv.ensureOnly(JMXEnv.java:138)
at org.apache.zookeeper.test.ClientBase.stopServer(ClientBase.java:425)
at org.apache.zookeeper.test.ClientBase.tearDown(ClientBase.java:455)
REGRESSION: org.apache.zookeeper.test.FourLetterWordsTest.testFourLetterWords
Error Message:
expected:<0> but was:<2>
Stack Trace:
junit.framework.AssertionFailedError: expected:<0> but was:<2>
at org.apache.zookeeper.test.JMXEnv.ensureOnly(JMXEnv.java:138)
at org.apache.zookeeper.test.ClientBase.stopServer(ClientBase.java:425)
at org.apache.zookeeper.test.ClientBase.tearDown(ClientBase.java:455)
REGRESSION: org.apache.zookeeper.test.FourLetterWordsTest.validateStatOutput
Error Message:
expected:<0> but was:<2>
Stack Trace:
junit.framework.AssertionFailedError: expected:<0> but was:<2>
at org.apache.zookeeper.test.JMXEnv.ensureOnly(JMXEnv.java:138)
at org.apache.zookeeper.test.ClientBase.stopServer(ClientBase.java:425)
at org.apache.zookeeper.test.ClientBase.tearDown(ClientBase.java:455)
REGRESSION: org.apache.zookeeper.test.FourLetterWordsTest.validateConsOutput
Error Message:
expected:<0> but was:<2>
Stack Trace:
junit.framework.AssertionFailedError: expected:<0> but was:<2>
at org.apache.zookeeper.test.JMXEnv.ensureOnly(JMXEnv.java:138)
at org.apache.zookeeper.test.ClientBase.stopServer(ClientBase.java:425)
at org.apache.zookeeper.test.ClientBase.tearDown(ClientBase.java:455)
REGRESSION: org.apache.zookeeper.test.NullDataTest.testNullData
Error Message:
expected:<0> but was:<2>
Stack Trace:
junit.framework.AssertionFailedError: expected:<0> but was:<2>
at org.apache.zookeeper.test.JMXEnv.ensureOnly(JMXEnv.java:138)
at org.apache.zookeeper.test.ClientBase.stopServer(ClientBase.java:425)
at org.apache.zookeeper.test.ClientBase.tearDown(ClientBase.java:455)
at org.apache.zookeeper.test.NullDataTest.tearDown(NullDataTest.java:49)
REGRESSION: org.apache.zookeeper.test.WatcherTest.testWatcherCorrectness
Error Message:
expected:<0> but was:<2>
Stack Trace:
junit.framework.AssertionFailedError: expected:<0> but was:<2>
at org.apache.zookeeper.test.JMXEnv.ensureOnly(JMXEnv.java:138)
at org.apache.zookeeper.test.ClientBase.stopServer(ClientBase.java:425)
at org.apache.zookeeper.test.ClientBase.tearDown(ClientBase.java:455)
REGRESSION: org.apache.zookeeper.test.WatcherTest.testWatcherCount
Error Message:
expected:<0> but was:<2>
Stack Trace:
junit.framework.AssertionFailedError: expected:<0> but was:<2>
at org.apache.zookeeper.test.JMXEnv.ensureOnly(JMXEnv.java:138)
at org.apache.zookeeper.test.ClientBase.stopServer(ClientBase.java:425)
at org.apache.zookeeper.test.ClientBase.tearDown(ClientBase.java:455)
REGRESSION: org.apache.zookeeper.test.WatcherTest.testWatchAutoResetWithPending
Error Message:
expected:<0> but was:<2>
Stack Trace:
junit.framework.AssertionFailedError: expected:<0> but was:<2>
at org.apache.zookeeper.test.JMXEnv.ensureOnly(JMXEnv.java:138)
at org.apache.zookeeper.test.ClientBase.stopServer(ClientBase.java:425)
at org.apache.zookeeper.test.WatcherTest.testWatchAutoResetWithPending(WatcherTest.java:200)
at org.apache.zookeeper.JUnit4ZKTestRunner$LoggedInvokeMethod.evaluate(JUnit4ZKTestRunner.java:52)
REGRESSION: org.apache.zookeeper.test.WatcherTest.testWatcherAutoResetWithGlobal
Error Message:
expected:<0> but was:<2>
Stack Trace:
junit.framework.AssertionFailedError: expected:<0> but was:<2>
at org.apache.zookeeper.test.JMXEnv.ensureOnly(JMXEnv.java:138)
at org.apache.zookeeper.test.ClientBase.stopServer(ClientBase.java:425)
at org.apache.zookeeper.test.WatcherTest.testWatcherAutoReset(WatcherTest.java:277)
at org.apache.zookeeper.test.WatcherTest.testWatcherAutoResetWithGlobal(WatcherTest.java:232)
at org.apache.zookeeper.JUnit4ZKTestRunner$LoggedInvokeMethod.evaluate(JUnit4ZKTestRunner.java:52)
REGRESSION: org.apache.zookeeper.test.WatcherTest.testWatcherAutoResetWithLocal
Error Message:
expected:<0> but was:<2>
Stack Trace:
junit.framework.AssertionFailedError: expected:<0> but was:<2>
at org.apache.zookeeper.test.JMXEnv.ensureOnly(JMXEnv.java:138)
at org.apache.zookeeper.test.ClientBase.stopServer(ClientBase.java:425)
at org.apache.zookeeper.test.WatcherTest.testWatcherAutoReset(WatcherTest.java:277)
at org.apache.zookeeper.test.WatcherTest.testWatcherAutoResetWithLocal(WatcherTest.java:241)
at org.apache.zookeeper.JUnit4ZKTestRunner$LoggedInvokeMethod.evaluate(JUnit4ZKTestRunner.java:52)
REGRESSION: org.apache.zookeeper.test.WatcherTest.testWatcherAutoResetDisabledWithGlobal
Error Message:
expected:<0> but was:<2>
Stack Trace:
junit.framework.AssertionFailedError: expected:<0> but was:<2>
at org.apache.zookeeper.test.JMXEnv.ensureOnly(JMXEnv.java:138)
at org.apache.zookeeper.test.ClientBase.stopServer(ClientBase.java:425)
at org.apache.zookeeper.test.WatcherTest.testWatcherAutoReset(WatcherTest.java:277)
at org.apache.zookeeper.test.WatcherTest.testWatcherAutoResetWithGlobal(WatcherTest.java:232)
at org.apache.zookeeper.test.WatcherTest.testWatcherAutoResetDisabledWithGlobal(WatcherTest.java:248)
at org.apache.zookeeper.JUnit4ZKTestRunner$LoggedInvokeMethod.evaluate(JUnit4ZKTestRunner.java:52)
REGRESSION: org.apache.zookeeper.test.WatcherTest.testWatcherAutoResetDisabledWithLocal
Error Message:
expected:<0> but was:<2>
Stack Trace:
junit.framework.AssertionFailedError: expected:<0> but was:<2>
at org.apache.zookeeper.test.JMXEnv.ensureOnly(JMXEnv.java:138)
at org.apache.zookeeper.test.ClientBase.stopServer(ClientBase.java:425)
at org.apache.zookeeper.test.WatcherTest.testWatcherAutoReset(WatcherTest.java:277)
at org.apache.zookeeper.test.WatcherTest.testWatcherAutoResetWithLocal(WatcherTest.java:241)
at org.apache.zookeeper.test.WatcherTest.testWatcherAutoResetDisabledWithLocal(WatcherTest.java:254)
at org.apache.zookeeper.JUnit4ZKTestRunner$LoggedInvokeMethod.evaluate(JUnit4ZKTestRunner.java:52)
REGRESSION: org.apache.zookeeper.test.ObserverLETest.testLEWithObserver
Error Message:
waiting for server up
Stack Trace:
junit.framework.AssertionFailedError: waiting for server up
at org.apache.zookeeper.test.QuorumBase.startServers(QuorumBase.java:221)
at org.apache.zookeeper.test.QuorumBase.setUp(QuorumBase.java:118)
at org.apache.zookeeper.test.ObserverLETest.establishThreeParticipantOneObserverEnsemble(ObserverLETest.java:37)
REGRESSION: org.apache.zookeeper.test.ObserverTest.testObserver
Error Message:
waiting for server 1 being up
Stack Trace:
junit.framework.AssertionFailedError: waiting for server 1 being up
at org.apache.zookeeper.test.ObserverTest.testObserver(ObserverTest.java:88)
at org.apache.zookeeper.JUnit4ZKTestRunner$LoggedInvokeMethod.evaluate(JUnit4ZKTestRunner.java:52)
REGRESSION: org.apache.zookeeper.test.QuorumTest.testLeaderShutdown
Error Message:
waiting for server up
Stack Trace:
junit.framework.AssertionFailedError: waiting for server up
at org.apache.zookeeper.test.QuorumBase.startServers(QuorumBase.java:221)
at org.apache.zookeeper.test.QuorumBase.setUp(QuorumBase.java:118)
at org.apache.zookeeper.test.QuorumBase.setUp(QuorumBase.java:76)
at org.apache.zookeeper.test.QuorumTest.setUp(QuorumTest.java:59)
REGRESSION: org.apache.zookeeper.test.QuorumZxidSyncTest.testBehindLeader
Error Message:
Servers didn't come up
Stack Trace:
junit.framework.AssertionFailedError: Servers didn't come up
at org.apache.zookeeper.test.QuorumZxidSyncTest.testBehindLeader(QuorumZxidSyncTest.java:87)
at org.apache.zookeeper.JUnit4ZKTestRunner$LoggedInvokeMethod.evaluate(JUnit4ZKTestRunner.java:52)
REGRESSION: org.apache.zookeeper.test.QuorumZxidSyncTest.testLateLogs
Error Message:
waiting for server up
Stack Trace:
junit.framework.AssertionFailedError: waiting for server up
at org.apache.zookeeper.test.QuorumBase.startServers(QuorumBase.java:221)
at org.apache.zookeeper.test.QuorumBase.startServers(QuorumBase.java:130)
at org.apache.zookeeper.test.QuorumZxidSyncTest.testLateLogs(QuorumZxidSyncTest.java:135)
at org.apache.zookeeper.JUnit4ZKTestRunner$LoggedInvokeMethod.evaluate(JUnit4ZKTestRunner.java:52)
REGRESSION: org.apache.zookeeper.test.ReconfigTest.testRemoveAddTwo
Error Message:
waiting for server up
Stack Trace:
junit.framework.AssertionFailedError: waiting for server up
at org.apache.zookeeper.test.QuorumUtil.startAll(QuorumUtil.java:151)
at org.apache.zookeeper.test.ReconfigTest.testRemoveAddTwo(ReconfigTest.java:279)
at org.apache.zookeeper.JUnit4ZKTestRunner$LoggedInvokeMethod.evaluate(JUnit4ZKTestRunner.java:52)
REGRESSION: org.apache.zookeeper.test.ReconfigTest.testRoleChange
Error Message:
waiting for server up
Stack Trace:
junit.framework.AssertionFailedError: waiting for server up
at org.apache.zookeeper.test.QuorumBase.startServers(QuorumBase.java:221)
at org.apache.zookeeper.test.QuorumBase.setUp(QuorumBase.java:118)
at org.apache.zookeeper.test.QuorumBase.setUp(QuorumBase.java:76)
at org.apache.zookeeper.test.ReconfigTest.setUp(ReconfigTest.java:56)
REGRESSION: org.apache.zookeeper.test.WatcherTest.testWatcherAutoResetDisabledWithLocal
Error Message:
expected:<0> but was:<1>
Stack Trace:
junit.framework.AssertionFailedError: expected:<0> but was:<1>
at org.apache.zookeeper.test.JMXEnv.ensureOnly(JMXEnv.java:138)
at org.apache.zookeeper.test.ClientBase.startServer(ClientBase.java:417)
at org.apache.zookeeper.test.WatcherTest.testWatcherAutoReset(WatcherTest.java:280)
at org.apache.zookeeper.test.WatcherTest.testWatcherAutoResetWithLocal(WatcherTest.java:241)
at org.apache.zookeeper.test.WatcherTest.testWatcherAutoResetDisabledWithLocal(WatcherTest.java:254)
at org.apache.zookeeper.JUnit4ZKTestRunner$LoggedInvokeMethod.evaluate(JUnit4ZKTestRunner.java:52)
FAILED: org.apache.zookeeper.test.FLERestartTest.testLERestart
Error Message:
Threads didn't join
Stack Trace:
junit.framework.AssertionFailedError: Threads didn't join
at org.apache.zookeeper.test.FLERestartTest.testLERestart(FLERestartTest.java:180)
at org.apache.zookeeper.JUnit4ZKTestRunner$LoggedInvokeMethod.evaluate(JUnit4ZKTestRunner.java:52)
FAILED: org.apache.zookeeper.test.LocalSessionsOnlyTest.testLocalSessionsOnFollower
Error Message:
expected [0x141abf68c4c0000] expected:<1> but was:<0>
Stack Trace:
junit.framework.AssertionFailedError: expected [0x141abf68c4c0000] expected:<1> but was:<0>
at org.apache.zookeeper.test.JMXEnv.ensureAll(JMXEnv.java:115)
at org.apache.zookeeper.test.ClientBase.createClient(ClientBase.java:197)
at org.apache.zookeeper.test.LocalSessionsOnlyTest.testLocalSessions(LocalSessionsOnlyTest.java:117)
at org.apache.zookeeper.test.LocalSessionsOnlyTest.testLocalSessionsOnFollower(LocalSessionsOnlyTest.java:67)
at org.apache.zookeeper.JUnit4ZKTestRunner$LoggedInvokeMethod.evaluate(JUnit4ZKTestRunner.java:52)
FAILED: org.apache.zookeeper.test.AsyncHammerTest.testHammer
Error Message:
waiting for server up
Stack Trace:
junit.framework.AssertionFailedError: waiting for server up
at org.apache.zookeeper.test.QuorumBase.startServers(QuorumBase.java:221)
at org.apache.zookeeper.test.QuorumBase.startServers(QuorumBase.java:130)
at org.apache.zookeeper.test.AsyncHammerTest.restart(AsyncHammerTest.java:61)
at org.apache.zookeeper.test.AsyncHammerTest.testHammer(AsyncHammerTest.java:193)
at org.apache.zookeeper.JUnit4ZKTestRunner$LoggedInvokeMethod.evaluate(JUnit4ZKTestRunner.java:52)
FAILED: org.apache.zookeeper.test.ObserverQuorumHammerTest.testHammerBasic
Error Message:
waiting for server up
Stack Trace:
junit.framework.AssertionFailedError: waiting for server up
at org.apache.zookeeper.test.QuorumBase.startServers(QuorumBase.java:221)
at org.apache.zookeeper.test.QuorumBase.setUp(QuorumBase.java:118)
at org.apache.zookeeper.test.ObserverQuorumHammerTest.setUp(ObserverQuorumHammerTest.java:30)
FAILED: org.apache.zookeeper.test.PurgeTxnTest.testPurge
Error Message:
KeeperErrorCode = ConnectionLoss for /invalidsnap-28
Stack Trace:
org.apache.zookeeper.KeeperException$ConnectionLossException: KeeperErrorCode = ConnectionLoss for /invalidsnap-28
at org.apache.zookeeper.KeeperException.create(KeeperException.java:99)
at org.apache.zookeeper.KeeperException.create(KeeperException.java:51)
at org.apache.zookeeper.ZooKeeper.create(ZooKeeper.java:876)
at org.apache.zookeeper.test.PurgeTxnTest.testPurge(PurgeTxnTest.java:61)
at org.apache.zookeeper.JUnit4ZKTestRunner$LoggedInvokeMethod.evaluate(JUnit4ZKTestRunner.java:52)
FAILED: org.apache.zookeeper.test.FLENewEpochTest.testLENewEpoch
Error Message:
First leader election failed
Stack Trace:
junit.framework.AssertionFailedError: First leader election failed
at org.apache.zookeeper.test.FLENewEpochTest.testLENewEpoch(FLENewEpochTest.java:175)
at org.apache.zookeeper.JUnit4ZKTestRunner$LoggedInvokeMethod.evaluate(JUnit4ZKTestRunner.java:52)
FAILED: org.apache.zookeeper.test.ReconfigTest.testBulkReconfig
Error Message:
waiting for server up
Stack Trace:
junit.framework.AssertionFailedError: waiting for server up
at org.apache.zookeeper.test.QuorumUtil.startAll(QuorumUtil.java:151)
at org.apache.zookeeper.test.ReconfigTest.testBulkReconfig(ReconfigTest.java:378)
at org.apache.zookeeper.JUnit4ZKTestRunner$LoggedInvokeMethod.evaluate(JUnit4ZKTestRunner.java:52)
FAILED: org.apache.zookeeper.test.ReconfigTest.testQuorumSystemChange
Error Message:
waiting for server up
Stack Trace:
junit.framework.AssertionFailedError: waiting for server up
at org.apache.zookeeper.test.QuorumUtil.startAll(QuorumUtil.java:151)
at org.apache.zookeeper.test.ReconfigTest.testQuorumSystemChange(ReconfigTest.java:633)
at org.apache.zookeeper.JUnit4ZKTestRunner$LoggedInvokeMethod.evaluate(JUnit4ZKTestRunner.java:52)
FAILED: org.apache.zookeeper.test.QuorumTest.testNoLogBeforeLeaderEstablishment
Error Message:
Not following
Stack Trace:
junit.framework.AssertionFailedError: Not following
at org.apache.zookeeper.test.QuorumTest.testNoLogBeforeLeaderEstablishment(QuorumTest.java:408)
at org.apache.zookeeper.JUnit4ZKTestRunner$LoggedInvokeMethod.evaluate(JUnit4ZKTestRunner.java:52)
FAILED: org.apache.zookeeper.test.ServerCnxnTest.testServerCnxnExpiry
Error Message:
Software caused connection abort: recv failed
Stack Trace:
java.net.SocketException: Software caused connection abort: recv failed
at java.net.SocketInputStream.socketRead0(Native Method)
at java.net.SocketInputStream.read(SocketInputStream.java:129)
at sun.nio.cs.StreamDecoder.readBytes(StreamDecoder.java:264)
at sun.nio.cs.StreamDecoder.implRead(StreamDecoder.java:306)
at sun.nio.cs.StreamDecoder.read(StreamDecoder.java:158)
at java.io.InputStreamReader.read(InputStreamReader.java:167)
at java.io.BufferedReader.fill(BufferedReader.java:136)
at java.io.BufferedReader.readLine(BufferedReader.java:299)
at java.io.BufferedReader.readLine(BufferedReader.java:362)
at org.apache.zookeeper.test.ServerCnxnTest.send4LetterWord(ServerCnxnTest.java:105)
at org.apache.zookeeper.test.ServerCnxnTest.sendRequest(ServerCnxnTest.java:77)
at org.apache.zookeeper.test.ServerCnxnTest.testServerCnxnExpiry(ServerCnxnTest.java:64)
at org.apache.zookeeper.JUnit4ZKTestRunner$LoggedInvokeMethod.evaluate(JUnit4ZKTestRunner.java:52)
FAILED: org.apache.zookeeper.test.TruncateTest.testTruncate
Error Message:
delete f:\hudson\hudson-slave\workspace\ZooKeeper-trunk-WinVS2008_java\trunk\build\test\tmp\test2709561522048509202.junit.dir\version-2\log.100000001
Stack Trace:
junit.framework.AssertionFailedError: delete f:\hudson\hudson-slave\workspace\ZooKeeper-trunk-WinVS2008_java\trunk\build\test\tmp\test2709561522048509202.junit.dir\version-2\log.100000001
at org.apache.zookeeper.test.ClientBase.recursiveDelete(ClientBase.java:493)
at org.apache.zookeeper.test.ClientBase.recursiveDelete(ClientBase.java:493)
at org.apache.zookeeper.test.TruncateTest.tearDown(TruncateTest.java:68)
FAILED: org.apache.zookeeper.test.FLEZeroWeightTest.testZeroWeightQuorum
Error Message:
Threads didn't join
Stack Trace:
junit.framework.AssertionFailedError: Threads didn't join
at org.apache.zookeeper.test.FLEZeroWeightTest.testZeroWeightQuorum(FLEZeroWeightTest.java:169)
at org.apache.zookeeper.JUnit4ZKTestRunner$LoggedInvokeMethod.evaluate(JUnit4ZKTestRunner.java:52)
FAILED: org.apache.zookeeper.test.LETest.testLE
Error Message:
Threads didn't join
Stack Trace:
junit.framework.AssertionFailedError: Threads didn't join
at org.apache.zookeeper.test.LETest.testLE(LETest.java:123)
at org.apache.zookeeper.JUnit4ZKTestRunner$LoggedInvokeMethod.evaluate(JUnit4ZKTestRunner.java:52)
FAILED: org.apache.zookeeper.test.BufferSizeTest.testStartupFailureSnapshot
Error Message:
delete f:\hudson\hudson-slave\workspace\ZooKeeper-trunk-WinVS2008_java\trunk\build\test\data\buffersize\snapshot\version-2\log.1
Stack Trace:
junit.framework.AssertionFailedError: delete f:\hudson\hudson-slave\workspace\ZooKeeper-trunk-WinVS2008_java\trunk\build\test\data\buffersize\snapshot\version-2\log.1
at org.apache.zookeeper.test.ClientBase.recursiveDelete(ClientBase.java:493)
at org.apache.zookeeper.test.ClientBase.recursiveDelete(ClientBase.java:493)
at org.apache.zookeeper.test.ClientBase.tearDown(ClientBase.java:458)
FAILED: org.apache.zookeeper.test.BufferSizeTest.testStartupFailureSet
Error Message:
delete f:\hudson\hudson-slave\workspace\ZooKeeper-trunk-WinVS2008_java\trunk\build\test\data\buffersize\set\version-2\log.1
Stack Trace:
junit.framework.AssertionFailedError: delete f:\hudson\hudson-slave\workspace\ZooKeeper-trunk-WinVS2008_java\trunk\build\test\data\buffersize\set\version-2\log.1
at org.apache.zookeeper.test.ClientBase.recursiveDelete(ClientBase.java:493)
at org.apache.zookeeper.test.ClientBase.recursiveDelete(ClientBase.java:493)
at org.apache.zookeeper.test.ClientBase.tearDown(ClientBase.java:458)
FAILED: org.apache.zookeeper.test.BufferSizeTest.testStartupFailureCreate
Error Message:
delete f:\hudson\hudson-slave\workspace\ZooKeeper-trunk-WinVS2008_java\trunk\build\test\data\buffersize\create\version-2\log.1
Stack Trace:
junit.framework.AssertionFailedError: delete f:\hudson\hudson-slave\workspace\ZooKeeper-trunk-WinVS2008_java\trunk\build\test\data\buffersize\create\version-2\log.1
at org.apache.zookeeper.test.ClientBase.recursiveDelete(ClientBase.java:493)
at org.apache.zookeeper.test.ClientBase.recursiveDelete(ClientBase.java:493)
at org.apache.zookeeper.test.ClientBase.tearDown(ClientBase.java:458)
FAILED: org.apache.zookeeper.test.ClientPortBindTest.testBindByAddress
Error Message:
Address family not supported by protocol family: bind
Stack Trace:
java.net.SocketException: Address family not supported by protocol family: bind
at sun.nio.ch.Net.bind(Native Method)
at sun.nio.ch.ServerSocketChannelImpl.bind(ServerSocketChannelImpl.java:126)
at sun.nio.ch.ServerSocketAdaptor.bind(ServerSocketAdaptor.java:59)
at sun.nio.ch.ServerSocketAdaptor.bind(ServerSocketAdaptor.java:52)
at org.apache.zookeeper.server.NIOServerCnxnFactory.configure(NIOServerCnxnFactory.java:684)
at org.apache.zookeeper.server.ServerCnxnFactory.createFactory(ServerCnxnFactory.java:127)
at org.apache.zookeeper.test.ClientPortBindTest.testBindByAddress(ClientPortBindTest.java:84)
at org.apache.zookeeper.JUnit4ZKTestRunner$LoggedInvokeMethod.evaluate(JUnit4ZKTestRunner.java:52)
FAILED: org.apache.zookeeper.server.util.DynamicConfigBCTest.dynamicConfigBackwardCompatibilityTest
Error Message:
null
Stack Trace:
junit.framework.AssertionFailedError
at org.apache.zookeeper.server.util.DynamicConfigBCTest.dynamicConfigBackwardCompatibilityTest(DynamicConfigBCTest.java:141)