You are viewing a plain text version of this content. The canonical link for it is here.
Posted to builds@beam.apache.org by Apache Jenkins Server <je...@builds.apache.org> on 2019/07/25 17:51:49 UTC
Build failed in Jenkins: beam_PostCommit_XVR_Flink #9
See <https://builds.apache.org/job/beam_PostCommit_XVR_Flink/9/display/redirect?page=changes>
Changes:
[aryan.naraghi] Add progress reporting to the BigQuery source
[ehudm] [BEAM-7814] Wait for BQ query results in tests
[36090911+boyuanzz] Revert "[BEAM-7785] synchronize watermark update with bundle processing"
------------------------------------------
Started by GitHub push by chamikaramj
[EnvInject] - Loading node environment variables.
Building remotely on apache-beam-jenkins-13 (beam) in workspace <https://builds.apache.org/job/beam_PostCommit_XVR_Flink/ws/>
No credentials specified
Cloning the remote Git repository
Cloning repository https://github.com/apache/beam.git
> git init <https://builds.apache.org/job/beam_PostCommit_XVR_Flink/ws/src> # timeout=10
Fetching upstream changes from https://github.com/apache/beam.git
> git --version # timeout=10
> git fetch --tags --progress https://github.com/apache/beam.git +refs/heads/*:refs/remotes/origin/*
> git config remote.origin.url https://github.com/apache/beam.git # timeout=10
> git config --add remote.origin.fetch +refs/heads/*:refs/remotes/origin/* # timeout=10
> git config remote.origin.url https://github.com/apache/beam.git # timeout=10
Fetching upstream changes from https://github.com/apache/beam.git
> git fetch --tags --progress https://github.com/apache/beam.git +refs/heads/*:refs/remotes/origin/* +refs/pull/${ghprbPullId}/*:refs/remotes/origin/pr/${ghprbPullId}/*
> git rev-parse origin/master^{commit} # timeout=10
Checking out Revision 4eb76100135a5c4c6f0a6c0878ea1847df11f75d (origin/master)
> git config core.sparsecheckout # timeout=10
> git checkout -f 4eb76100135a5c4c6f0a6c0878ea1847df11f75d
Commit message: "Merge pull request #9079: [BEAM-7495] Add progress reporting to the BigQuery source"
> git rev-list --no-walk ea024fc347f16ca9da125b4b647af701af7a342a # timeout=10
Cleaning workspace
> git rev-parse --verify HEAD # timeout=10
Resetting working tree
> git reset --hard # timeout=10
> git clean -fdx # timeout=10
No emails were triggered.
[EnvInject] - Executing scripts and injecting environment variables after the SCM step.
[EnvInject] - Injecting as environment variables the properties content
SPARK_LOCAL_IP=127.0.0.1
[EnvInject] - Variables injected successfully.
[Gradle] - Launching build.
[src] $ <https://builds.apache.org/job/beam_PostCommit_XVR_Flink/ws/src/gradlew> --continue --max-workers=12 -Dorg.gradle.jvmargs=-Xms2g -Dorg.gradle.jvmargs=-Xmx4g :beam-runners-flink_2.11-job-server:validatesCrossLanguageRunner
############################### WARNING ####################################
## ##
## Deprecation Warning: Gradle command altered. ##
## ##
## You are still using deprecated project namings. Instead of using e.g. ##
## ##
## :beam-sdks-java-core ##
## ##
## you should now use ##
## ##
## :sdks:java:core ##
## ##
## no to reference projects and their tasks. See project-mappings file. ##
## ##
## This compatibility layer will be removed soon. ##
## ##
############################### WARNING ####################################
Changed command to
gradlew --continue --max-workers=12 -Dorg.gradle.jvmargs=-Xms2g -Dorg.gradle.jvmargs=-Xmx4g :runners:flink:1.5:job-server:validatesCrossLanguageRunner
Starting a Gradle Daemon, 1 busy Daemon could not be reused, use --status for details
> Task :buildSrc:compileJava NO-SOURCE
> Task :buildSrc:compileGroovy FROM-CACHE
> Task :buildSrc:pluginDescriptors
> Task :buildSrc:processResources
> Task :buildSrc:classes
> Task :buildSrc:jar
> Task :buildSrc:assemble
> Task :buildSrc:spotlessGroovy
> Task :buildSrc:spotlessGroovyCheck
> Task :buildSrc:spotlessGroovyGradle
> Task :buildSrc:spotlessGroovyGradleCheck
> Task :buildSrc:spotlessCheck
> Task :buildSrc:pluginUnderTestMetadata
> Task :buildSrc:compileTestJava NO-SOURCE
> Task :buildSrc:compileTestGroovy NO-SOURCE
> Task :buildSrc:processTestResources NO-SOURCE
> Task :buildSrc:testClasses UP-TO-DATE
> Task :buildSrc:test NO-SOURCE
> Task :buildSrc:validateTaskProperties FROM-CACHE
> Task :buildSrc:check
> Task :buildSrc:build
Configuration on demand is an incubating feature.
FAILURE: Build failed with an exception.
* What went wrong:
Task 'validatesCrossLanguageRunner' not found in project ':runners:flink:1.5:job-server'.
* Try:
Run gradlew_orig tasks to get a list of available tasks. Run with --stacktrace option to get the stack trace. Run with --info or --debug option to get more log output. Run with --scan to get full insights.
* Get more help at https://help.gradle.org
Deprecated Gradle features were used in this build, making it incompatible with Gradle 6.0.
Use '--warning-mode all' to show the individual deprecation warnings.
See https://docs.gradle.org/5.2.1/userguide/command_line_interface.html#sec:command_line_warnings
BUILD FAILED in 11s
Publishing build scan...
https://gradle.com/s/jvsi376d5g74g
Build step 'Invoke Gradle script' changed build result to FAILURE
Build step 'Invoke Gradle script' marked build as failure
---------------------------------------------------------------------
To unsubscribe, e-mail: builds-unsubscribe@beam.apache.org
For additional commands, e-mail: builds-help@beam.apache.org
Jenkins build is back to normal : beam_PostCommit_XVR_Flink #12
Posted by Apache Jenkins Server <je...@builds.apache.org>.
See <https://builds.apache.org/job/beam_PostCommit_XVR_Flink/12/display/redirect?page=changes>
---------------------------------------------------------------------
To unsubscribe, e-mail: builds-unsubscribe@beam.apache.org
For additional commands, e-mail: builds-help@beam.apache.org
Build failed in Jenkins: beam_PostCommit_XVR_Flink #11
Posted by Apache Jenkins Server <je...@builds.apache.org>.
See <https://builds.apache.org/job/beam_PostCommit_XVR_Flink/11/display/redirect?page=changes>
Changes:
[ryan] [BEAM-4181] Add readFiles transform to TfRecordIO.
------------------------------------------
Started by GitHub push by pabloem
[EnvInject] - Loading node environment variables.
Building remotely on apache-beam-jenkins-7 (beam) in workspace <https://builds.apache.org/job/beam_PostCommit_XVR_Flink/ws/>
No credentials specified
> git rev-parse --is-inside-work-tree # timeout=10
Fetching changes from the remote Git repository
> git config remote.origin.url https://github.com/apache/beam.git # timeout=10
Fetching upstream changes from https://github.com/apache/beam.git
> git --version # timeout=10
> git fetch --tags --progress https://github.com/apache/beam.git +refs/heads/*:refs/remotes/origin/* +refs/pull/${ghprbPullId}/*:refs/remotes/origin/pr/${ghprbPullId}/*
> git rev-parse origin/master^{commit} # timeout=10
Checking out Revision c7911043510a266078a3dc8faef7a1dbe1f598c5 (origin/master)
> git config core.sparsecheckout # timeout=10
> git checkout -f c7911043510a266078a3dc8faef7a1dbe1f598c5
Commit message: "Merge pull request #9088 from RyanSkraba/BEAM-4181-tfrecord-readfiles"
> git rev-list --no-walk 4eb76100135a5c4c6f0a6c0878ea1847df11f75d # timeout=10
Cleaning workspace
> git rev-parse --verify HEAD # timeout=10
Resetting working tree
> git reset --hard # timeout=10
> git clean -fdx # timeout=10
No emails were triggered.
[EnvInject] - Executing scripts and injecting environment variables after the SCM step.
[EnvInject] - Injecting as environment variables the properties content
SPARK_LOCAL_IP=127.0.0.1
[EnvInject] - Variables injected successfully.
[Gradle] - Launching build.
[src] $ <https://builds.apache.org/job/beam_PostCommit_XVR_Flink/ws/src/gradlew> --continue --max-workers=12 -Dorg.gradle.jvmargs=-Xms2g -Dorg.gradle.jvmargs=-Xmx4g :beam-runners-flink_2.11-job-server:validatesCrossLanguageRunner
############################### WARNING ####################################
## ##
## Deprecation Warning: Gradle command altered. ##
## ##
## You are still using deprecated project namings. Instead of using e.g. ##
## ##
## :beam-sdks-java-core ##
## ##
## you should now use ##
## ##
## :sdks:java:core ##
## ##
## no to reference projects and their tasks. See project-mappings file. ##
## ##
## This compatibility layer will be removed soon. ##
## ##
############################### WARNING ####################################
Changed command to
gradlew --continue --max-workers=12 -Dorg.gradle.jvmargs=-Xms2g -Dorg.gradle.jvmargs=-Xmx4g :runners:flink:1.5:job-server:validatesCrossLanguageRunner
Starting a Gradle Daemon, 1 busy Daemon could not be reused, use --status for details
> Task :buildSrc:compileJava NO-SOURCE
> Task :buildSrc:compileGroovy FROM-CACHE
> Task :buildSrc:pluginDescriptors
> Task :buildSrc:processResources
> Task :buildSrc:classes
> Task :buildSrc:jar
> Task :buildSrc:assemble
> Task :buildSrc:spotlessGroovy
> Task :buildSrc:spotlessGroovyCheck
> Task :buildSrc:spotlessGroovyGradle
> Task :buildSrc:spotlessGroovyGradleCheck
> Task :buildSrc:spotlessCheck
> Task :buildSrc:pluginUnderTestMetadata
> Task :buildSrc:compileTestJava NO-SOURCE
> Task :buildSrc:compileTestGroovy NO-SOURCE
> Task :buildSrc:processTestResources NO-SOURCE
> Task :buildSrc:testClasses UP-TO-DATE
> Task :buildSrc:test NO-SOURCE
> Task :buildSrc:validateTaskProperties FROM-CACHE
> Task :buildSrc:check
> Task :buildSrc:build
Configuration on demand is an incubating feature.
FAILURE: Build failed with an exception.
* What went wrong:
Task 'validatesCrossLanguageRunner' not found in project ':runners:flink:1.5:job-server'.
* Try:
Run gradlew_orig tasks to get a list of available tasks. Run with --stacktrace option to get the stack trace. Run with --info or --debug option to get more log output. Run with --scan to get full insights.
* Get more help at https://help.gradle.org
Deprecated Gradle features were used in this build, making it incompatible with Gradle 6.0.
Use '--warning-mode all' to show the individual deprecation warnings.
See https://docs.gradle.org/5.2.1/userguide/command_line_interface.html#sec:command_line_warnings
BUILD FAILED in 14s
Publishing build scan...
https://gradle.com/s/otrw7j7uqkve2
Build step 'Invoke Gradle script' changed build result to FAILURE
Build step 'Invoke Gradle script' marked build as failure
---------------------------------------------------------------------
To unsubscribe, e-mail: builds-unsubscribe@beam.apache.org
For additional commands, e-mail: builds-help@beam.apache.org
Build failed in Jenkins: beam_PostCommit_XVR_Flink #10
Posted by Apache Jenkins Server <je...@builds.apache.org>.
See <https://builds.apache.org/job/beam_PostCommit_XVR_Flink/10/display/redirect>
------------------------------------------
Started by timer
[EnvInject] - Loading node environment variables.
Building remotely on apache-beam-jenkins-12 (beam) in workspace <https://builds.apache.org/job/beam_PostCommit_XVR_Flink/ws/>
No credentials specified
Cloning the remote Git repository
Cloning repository https://github.com/apache/beam.git
> git init <https://builds.apache.org/job/beam_PostCommit_XVR_Flink/ws/src> # timeout=10
Fetching upstream changes from https://github.com/apache/beam.git
> git --version # timeout=10
> git fetch --tags --progress https://github.com/apache/beam.git +refs/heads/*:refs/remotes/origin/*
> git config remote.origin.url https://github.com/apache/beam.git # timeout=10
> git config --add remote.origin.fetch +refs/heads/*:refs/remotes/origin/* # timeout=10
> git config remote.origin.url https://github.com/apache/beam.git # timeout=10
Fetching upstream changes from https://github.com/apache/beam.git
> git fetch --tags --progress https://github.com/apache/beam.git +refs/heads/*:refs/remotes/origin/* +refs/pull/${ghprbPullId}/*:refs/remotes/origin/pr/${ghprbPullId}/*
> git rev-parse origin/master^{commit} # timeout=10
Checking out Revision 4eb76100135a5c4c6f0a6c0878ea1847df11f75d (origin/master)
> git config core.sparsecheckout # timeout=10
> git checkout -f 4eb76100135a5c4c6f0a6c0878ea1847df11f75d
Commit message: "Merge pull request #9079: [BEAM-7495] Add progress reporting to the BigQuery source"
> git rev-list --no-walk 4eb76100135a5c4c6f0a6c0878ea1847df11f75d # timeout=10
Cleaning workspace
> git rev-parse --verify HEAD # timeout=10
Resetting working tree
> git reset --hard # timeout=10
> git clean -fdx # timeout=10
No emails were triggered.
[EnvInject] - Executing scripts and injecting environment variables after the SCM step.
[EnvInject] - Injecting as environment variables the properties content
SPARK_LOCAL_IP=127.0.0.1
[EnvInject] - Variables injected successfully.
[Gradle] - Launching build.
[src] $ <https://builds.apache.org/job/beam_PostCommit_XVR_Flink/ws/src/gradlew> --continue --max-workers=12 -Dorg.gradle.jvmargs=-Xms2g -Dorg.gradle.jvmargs=-Xmx4g :beam-runners-flink_2.11-job-server:validatesCrossLanguageRunner
############################### WARNING ####################################
## ##
## Deprecation Warning: Gradle command altered. ##
## ##
## You are still using deprecated project namings. Instead of using e.g. ##
## ##
## :beam-sdks-java-core ##
## ##
## you should now use ##
## ##
## :sdks:java:core ##
## ##
## no to reference projects and their tasks. See project-mappings file. ##
## ##
## This compatibility layer will be removed soon. ##
## ##
############################### WARNING ####################################
Changed command to
gradlew --continue --max-workers=12 -Dorg.gradle.jvmargs=-Xms2g -Dorg.gradle.jvmargs=-Xmx4g :runners:flink:1.5:job-server:validatesCrossLanguageRunner
Starting a Gradle Daemon, 2 busy Daemons could not be reused, use --status for details
> Task :buildSrc:compileJava NO-SOURCE
> Task :buildSrc:compileGroovy FROM-CACHE
> Task :buildSrc:pluginDescriptors
> Task :buildSrc:processResources
> Task :buildSrc:classes
> Task :buildSrc:jar
> Task :buildSrc:assemble
> Task :buildSrc:spotlessGroovy
> Task :buildSrc:spotlessGroovyCheck
> Task :buildSrc:spotlessGroovyGradle
> Task :buildSrc:spotlessGroovyGradleCheck
> Task :buildSrc:spotlessCheck
> Task :buildSrc:pluginUnderTestMetadata
> Task :buildSrc:compileTestJava NO-SOURCE
> Task :buildSrc:compileTestGroovy NO-SOURCE
> Task :buildSrc:processTestResources NO-SOURCE
> Task :buildSrc:testClasses UP-TO-DATE
> Task :buildSrc:test NO-SOURCE
> Task :buildSrc:validateTaskProperties FROM-CACHE
> Task :buildSrc:check
> Task :buildSrc:build
Configuration on demand is an incubating feature.
FAILURE: Build failed with an exception.
* What went wrong:
Task 'validatesCrossLanguageRunner' not found in project ':runners:flink:1.5:job-server'.
* Try:
Run gradlew_orig tasks to get a list of available tasks. Run with --stacktrace option to get the stack trace. Run with --info or --debug option to get more log output. Run with --scan to get full insights.
* Get more help at https://help.gradle.org
Deprecated Gradle features were used in this build, making it incompatible with Gradle 6.0.
Use '--warning-mode all' to show the individual deprecation warnings.
See https://docs.gradle.org/5.2.1/userguide/command_line_interface.html#sec:command_line_warnings
BUILD FAILED in 12s
Publishing build scan...
https://gradle.com/s/kekwrwzxlmkm2
Build step 'Invoke Gradle script' changed build result to FAILURE
Build step 'Invoke Gradle script' marked build as failure
---------------------------------------------------------------------
To unsubscribe, e-mail: builds-unsubscribe@beam.apache.org
For additional commands, e-mail: builds-help@beam.apache.org