You are viewing a plain text version of this content. The canonical link for it is here.
Posted to dev@lucene.apache.org by Policeman Jenkins Server <je...@thetaphi.de> on 2017/01/14 10:52:15 UTC

[JENKINS] Lucene-Solr-master-Windows (64bit/jdk1.8.0_112) - Build # 6357 - Still Unstable!

Build: https://jenkins.thetaphi.de/job/Lucene-Solr-master-Windows/6357/
Java: 64bit/jdk1.8.0_112 -XX:-UseCompressedOops -XX:+UseG1GC

1 tests failed.
FAILED:  junit.framework.TestSuite.org.apache.lucene.index.TestFixBrokenOffsets

Error Message:
Could not remove the following files (in the order of attempts):    C:\Users\jenkins\workspace\Lucene-Solr-master-Windows\lucene\build\backward-codecs\test\J0\temp\lucene.index.TestFixBrokenOffsets_9CD5EB4D29F099D3-001\brokenoffsets-001\_0.cfs: java.nio.file.AccessDeniedException: C:\Users\jenkins\workspace\Lucene-Solr-master-Windows\lucene\build\backward-codecs\test\J0\temp\lucene.index.TestFixBrokenOffsets_9CD5EB4D29F099D3-001\brokenoffsets-001\_0.cfs    C:\Users\jenkins\workspace\Lucene-Solr-master-Windows\lucene\build\backward-codecs\test\J0\temp\lucene.index.TestFixBrokenOffsets_9CD5EB4D29F099D3-001\brokenoffsets-001\_1.cfs: java.nio.file.AccessDeniedException: C:\Users\jenkins\workspace\Lucene-Solr-master-Windows\lucene\build\backward-codecs\test\J0\temp\lucene.index.TestFixBrokenOffsets_9CD5EB4D29F099D3-001\brokenoffsets-001\_1.cfs    C:\Users\jenkins\workspace\Lucene-Solr-master-Windows\lucene\build\backward-codecs\test\J0\temp\lucene.index.TestFixBrokenOffsets_9CD5EB4D29F099D3-001\brokenoffsets-001: java.nio.file.DirectoryNotEmptyException: C:\Users\jenkins\workspace\Lucene-Solr-master-Windows\lucene\build\backward-codecs\test\J0\temp\lucene.index.TestFixBrokenOffsets_9CD5EB4D29F099D3-001\brokenoffsets-001    C:\Users\jenkins\workspace\Lucene-Solr-master-Windows\lucene\build\backward-codecs\test\J0\temp\lucene.index.TestFixBrokenOffsets_9CD5EB4D29F099D3-001: java.nio.file.DirectoryNotEmptyException: C:\Users\jenkins\workspace\Lucene-Solr-master-Windows\lucene\build\backward-codecs\test\J0\temp\lucene.index.TestFixBrokenOffsets_9CD5EB4D29F099D3-001 

Stack Trace:
java.io.IOException: Could not remove the following files (in the order of attempts):
   C:\Users\jenkins\workspace\Lucene-Solr-master-Windows\lucene\build\backward-codecs\test\J0\temp\lucene.index.TestFixBrokenOffsets_9CD5EB4D29F099D3-001\brokenoffsets-001\_0.cfs: java.nio.file.AccessDeniedException: C:\Users\jenkins\workspace\Lucene-Solr-master-Windows\lucene\build\backward-codecs\test\J0\temp\lucene.index.TestFixBrokenOffsets_9CD5EB4D29F099D3-001\brokenoffsets-001\_0.cfs
   C:\Users\jenkins\workspace\Lucene-Solr-master-Windows\lucene\build\backward-codecs\test\J0\temp\lucene.index.TestFixBrokenOffsets_9CD5EB4D29F099D3-001\brokenoffsets-001\_1.cfs: java.nio.file.AccessDeniedException: C:\Users\jenkins\workspace\Lucene-Solr-master-Windows\lucene\build\backward-codecs\test\J0\temp\lucene.index.TestFixBrokenOffsets_9CD5EB4D29F099D3-001\brokenoffsets-001\_1.cfs
   C:\Users\jenkins\workspace\Lucene-Solr-master-Windows\lucene\build\backward-codecs\test\J0\temp\lucene.index.TestFixBrokenOffsets_9CD5EB4D29F099D3-001\brokenoffsets-001: java.nio.file.DirectoryNotEmptyException: C:\Users\jenkins\workspace\Lucene-Solr-master-Windows\lucene\build\backward-codecs\test\J0\temp\lucene.index.TestFixBrokenOffsets_9CD5EB4D29F099D3-001\brokenoffsets-001
   C:\Users\jenkins\workspace\Lucene-Solr-master-Windows\lucene\build\backward-codecs\test\J0\temp\lucene.index.TestFixBrokenOffsets_9CD5EB4D29F099D3-001: java.nio.file.DirectoryNotEmptyException: C:\Users\jenkins\workspace\Lucene-Solr-master-Windows\lucene\build\backward-codecs\test\J0\temp\lucene.index.TestFixBrokenOffsets_9CD5EB4D29F099D3-001

	at __randomizedtesting.SeedInfo.seed([9CD5EB4D29F099D3]:0)
	at org.apache.lucene.util.IOUtils.rm(IOUtils.java:323)
	at org.apache.lucene.util.TestRuleTemporaryFilesCleanup.afterAlways(TestRuleTemporaryFilesCleanup.java:216)
	at com.carrotsearch.randomizedtesting.rules.TestRuleAdapter$1.afterAlways(TestRuleAdapter.java:31)
	at com.carrotsearch.randomizedtesting.rules.StatementAdapter.evaluate(StatementAdapter.java:43)
	at com.carrotsearch.randomizedtesting.rules.StatementAdapter.evaluate(StatementAdapter.java:36)
	at org.apache.lucene.util.TestRuleAssertionsRequired$1.evaluate(TestRuleAssertionsRequired.java:53)
	at org.apache.lucene.util.TestRuleMarkFailure$1.evaluate(TestRuleMarkFailure.java:47)
	at org.apache.lucene.util.TestRuleIgnoreAfterMaxFailures$1.evaluate(TestRuleIgnoreAfterMaxFailures.java:64)
	at org.apache.lucene.util.TestRuleIgnoreTestSuites$1.evaluate(TestRuleIgnoreTestSuites.java:54)
	at com.carrotsearch.randomizedtesting.rules.StatementAdapter.evaluate(StatementAdapter.java:36)
	at com.carrotsearch.randomizedtesting.ThreadLeakControl$StatementRunner.run(ThreadLeakControl.java:367)
	at java.lang.Thread.run(Thread.java:745)




Build Log:
[...truncated 4461 lines...]
   [junit4] Suite: org.apache.lucene.index.TestFixBrokenOffsets
   [junit4]   2> NOTE: test params are: codec=Asserting(Lucene70): {foo=FST50}, docValues:{}, maxPointsInLeafNode=792, maxMBSortInHeap=7.28285296598617, sim=RandomSimilarity(queryNorm=false): {}, locale=es-BO, timezone=Etc/GMT+1
   [junit4]   2> NOTE: Windows 10 10.0 amd64/Oracle Corporation 1.8.0_112 (64-bit)/cpus=3,threads=1,free=54398936,total=121634816
   [junit4]   2> NOTE: All tests run in this JVM: [TestBackwardsCompatibility, TestNumericRangeQuery32, TestLegacyFieldReuse, TestLucene50SegmentInfoFormat, TestFixBrokenOffsets]
   [junit4]   2> NOTE: reproduce with: ant test  -Dtestcase=TestFixBrokenOffsets -Dtests.seed=9CD5EB4D29F099D3 -Dtests.slow=true -Dtests.locale=es-BO -Dtests.timezone=Etc/GMT+1 -Dtests.asserts=true -Dtests.file.encoding=Cp1252
   [junit4] ERROR   0.00s J0 | TestFixBrokenOffsets (suite) <<<
   [junit4]    > Throwable #1: java.io.IOException: Could not remove the following files (in the order of attempts):
   [junit4]    >    C:\Users\jenkins\workspace\Lucene-Solr-master-Windows\lucene\build\backward-codecs\test\J0\temp\lucene.index.TestFixBrokenOffsets_9CD5EB4D29F099D3-001\brokenoffsets-001\_0.cfs: java.nio.file.AccessDeniedException: C:\Users\jenkins\workspace\Lucene-Solr-master-Windows\lucene\build\backward-codecs\test\J0\temp\lucene.index.TestFixBrokenOffsets_9CD5EB4D29F099D3-001\brokenoffsets-001\_0.cfs
   [junit4]    >    C:\Users\jenkins\workspace\Lucene-Solr-master-Windows\lucene\build\backward-codecs\test\J0\temp\lucene.index.TestFixBrokenOffsets_9CD5EB4D29F099D3-001\brokenoffsets-001\_1.cfs: java.nio.file.AccessDeniedException: C:\Users\jenkins\workspace\Lucene-Solr-master-Windows\lucene\build\backward-codecs\test\J0\temp\lucene.index.TestFixBrokenOffsets_9CD5EB4D29F099D3-001\brokenoffsets-001\_1.cfs
   [junit4]    >    C:\Users\jenkins\workspace\Lucene-Solr-master-Windows\lucene\build\backward-codecs\test\J0\temp\lucene.index.TestFixBrokenOffsets_9CD5EB4D29F099D3-001\brokenoffsets-001: java.nio.file.DirectoryNotEmptyException: C:\Users\jenkins\workspace\Lucene-Solr-master-Windows\lucene\build\backward-codecs\test\J0\temp\lucene.index.TestFixBrokenOffsets_9CD5EB4D29F099D3-001\brokenoffsets-001
   [junit4]    >    C:\Users\jenkins\workspace\Lucene-Solr-master-Windows\lucene\build\backward-codecs\test\J0\temp\lucene.index.TestFixBrokenOffsets_9CD5EB4D29F099D3-001: java.nio.file.DirectoryNotEmptyException: C:\Users\jenkins\workspace\Lucene-Solr-master-Windows\lucene\build\backward-codecs\test\J0\temp\lucene.index.TestFixBrokenOffsets_9CD5EB4D29F099D3-001
   [junit4]    > 	at __randomizedtesting.SeedInfo.seed([9CD5EB4D29F099D3]:0)
   [junit4]    > 	at org.apache.lucene.util.IOUtils.rm(IOUtils.java:323)
   [junit4]    > 	at java.lang.Thread.run(Thread.java:745)
   [junit4] Completed [9/14 (1!)] on J0 in 0.16s, 1 test, 1 error <<< FAILURES!

[...truncated 70924 lines...]


Re: [JENKINS] Lucene-Solr-master-Windows (64bit/jdk1.8.0_112) - Build # 6357 - Still Unstable!

Posted by Michael McCandless <lu...@mikemccandless.com>.
Hmm I'll dig ... new test.

Mike McCandless

http://blog.mikemccandless.com


On Sat, Jan 14, 2017 at 5:52 AM, Policeman Jenkins Server
<je...@thetaphi.de> wrote:
> Build: https://jenkins.thetaphi.de/job/Lucene-Solr-master-Windows/6357/
> Java: 64bit/jdk1.8.0_112 -XX:-UseCompressedOops -XX:+UseG1GC
>
> 1 tests failed.
> FAILED:  junit.framework.TestSuite.org.apache.lucene.index.TestFixBrokenOffsets
>
> Error Message:
> Could not remove the following files (in the order of attempts):    C:\Users\jenkins\workspace\Lucene-Solr-master-Windows\lucene\build\backward-codecs\test\J0\temp\lucene.index.TestFixBrokenOffsets_9CD5EB4D29F099D3-001\brokenoffsets-001\_0.cfs: java.nio.file.AccessDeniedException: C:\Users\jenkins\workspace\Lucene-Solr-master-Windows\lucene\build\backward-codecs\test\J0\temp\lucene.index.TestFixBrokenOffsets_9CD5EB4D29F099D3-001\brokenoffsets-001\_0.cfs    C:\Users\jenkins\workspace\Lucene-Solr-master-Windows\lucene\build\backward-codecs\test\J0\temp\lucene.index.TestFixBrokenOffsets_9CD5EB4D29F099D3-001\brokenoffsets-001\_1.cfs: java.nio.file.AccessDeniedException: C:\Users\jenkins\workspace\Lucene-Solr-master-Windows\lucene\build\backward-codecs\test\J0\temp\lucene.index.TestFixBrokenOffsets_9CD5EB4D29F099D3-001\brokenoffsets-001\_1.cfs    C:\Users\jenkins\workspace\Lucene-Solr-master-Windows\lucene\build\backward-codecs\test\J0\temp\lucene.index.TestFixBrokenOffsets_9CD5EB4D29F099D3-001\brokenoffsets-001: java.nio.file.DirectoryNotEmptyException: C:\Users\jenkins\workspace\Lucene-Solr-master-Windows\lucene\build\backward-codecs\test\J0\temp\lucene.index.TestFixBrokenOffsets_9CD5EB4D29F099D3-001\brokenoffsets-001    C:\Users\jenkins\workspace\Lucene-Solr-master-Windows\lucene\build\backward-codecs\test\J0\temp\lucene.index.TestFixBrokenOffsets_9CD5EB4D29F099D3-001: java.nio.file.DirectoryNotEmptyException: C:\Users\jenkins\workspace\Lucene-Solr-master-Windows\lucene\build\backward-codecs\test\J0\temp\lucene.index.TestFixBrokenOffsets_9CD5EB4D29F099D3-001
>
> Stack Trace:
> java.io.IOException: Could not remove the following files (in the order of attempts):
>    C:\Users\jenkins\workspace\Lucene-Solr-master-Windows\lucene\build\backward-codecs\test\J0\temp\lucene.index.TestFixBrokenOffsets_9CD5EB4D29F099D3-001\brokenoffsets-001\_0.cfs: java.nio.file.AccessDeniedException: C:\Users\jenkins\workspace\Lucene-Solr-master-Windows\lucene\build\backward-codecs\test\J0\temp\lucene.index.TestFixBrokenOffsets_9CD5EB4D29F099D3-001\brokenoffsets-001\_0.cfs
>    C:\Users\jenkins\workspace\Lucene-Solr-master-Windows\lucene\build\backward-codecs\test\J0\temp\lucene.index.TestFixBrokenOffsets_9CD5EB4D29F099D3-001\brokenoffsets-001\_1.cfs: java.nio.file.AccessDeniedException: C:\Users\jenkins\workspace\Lucene-Solr-master-Windows\lucene\build\backward-codecs\test\J0\temp\lucene.index.TestFixBrokenOffsets_9CD5EB4D29F099D3-001\brokenoffsets-001\_1.cfs
>    C:\Users\jenkins\workspace\Lucene-Solr-master-Windows\lucene\build\backward-codecs\test\J0\temp\lucene.index.TestFixBrokenOffsets_9CD5EB4D29F099D3-001\brokenoffsets-001: java.nio.file.DirectoryNotEmptyException: C:\Users\jenkins\workspace\Lucene-Solr-master-Windows\lucene\build\backward-codecs\test\J0\temp\lucene.index.TestFixBrokenOffsets_9CD5EB4D29F099D3-001\brokenoffsets-001
>    C:\Users\jenkins\workspace\Lucene-Solr-master-Windows\lucene\build\backward-codecs\test\J0\temp\lucene.index.TestFixBrokenOffsets_9CD5EB4D29F099D3-001: java.nio.file.DirectoryNotEmptyException: C:\Users\jenkins\workspace\Lucene-Solr-master-Windows\lucene\build\backward-codecs\test\J0\temp\lucene.index.TestFixBrokenOffsets_9CD5EB4D29F099D3-001
>
>         at __randomizedtesting.SeedInfo.seed([9CD5EB4D29F099D3]:0)
>         at org.apache.lucene.util.IOUtils.rm(IOUtils.java:323)
>         at org.apache.lucene.util.TestRuleTemporaryFilesCleanup.afterAlways(TestRuleTemporaryFilesCleanup.java:216)
>         at com.carrotsearch.randomizedtesting.rules.TestRuleAdapter$1.afterAlways(TestRuleAdapter.java:31)
>         at com.carrotsearch.randomizedtesting.rules.StatementAdapter.evaluate(StatementAdapter.java:43)
>         at com.carrotsearch.randomizedtesting.rules.StatementAdapter.evaluate(StatementAdapter.java:36)
>         at org.apache.lucene.util.TestRuleAssertionsRequired$1.evaluate(TestRuleAssertionsRequired.java:53)
>         at org.apache.lucene.util.TestRuleMarkFailure$1.evaluate(TestRuleMarkFailure.java:47)
>         at org.apache.lucene.util.TestRuleIgnoreAfterMaxFailures$1.evaluate(TestRuleIgnoreAfterMaxFailures.java:64)
>         at org.apache.lucene.util.TestRuleIgnoreTestSuites$1.evaluate(TestRuleIgnoreTestSuites.java:54)
>         at com.carrotsearch.randomizedtesting.rules.StatementAdapter.evaluate(StatementAdapter.java:36)
>         at com.carrotsearch.randomizedtesting.ThreadLeakControl$StatementRunner.run(ThreadLeakControl.java:367)
>         at java.lang.Thread.run(Thread.java:745)
>
>
>
>
> Build Log:
> [...truncated 4461 lines...]
>    [junit4] Suite: org.apache.lucene.index.TestFixBrokenOffsets
>    [junit4]   2> NOTE: test params are: codec=Asserting(Lucene70): {foo=FST50}, docValues:{}, maxPointsInLeafNode=792, maxMBSortInHeap=7.28285296598617, sim=RandomSimilarity(queryNorm=false): {}, locale=es-BO, timezone=Etc/GMT+1
>    [junit4]   2> NOTE: Windows 10 10.0 amd64/Oracle Corporation 1.8.0_112 (64-bit)/cpus=3,threads=1,free=54398936,total=121634816
>    [junit4]   2> NOTE: All tests run in this JVM: [TestBackwardsCompatibility, TestNumericRangeQuery32, TestLegacyFieldReuse, TestLucene50SegmentInfoFormat, TestFixBrokenOffsets]
>    [junit4]   2> NOTE: reproduce with: ant test  -Dtestcase=TestFixBrokenOffsets -Dtests.seed=9CD5EB4D29F099D3 -Dtests.slow=true -Dtests.locale=es-BO -Dtests.timezone=Etc/GMT+1 -Dtests.asserts=true -Dtests.file.encoding=Cp1252
>    [junit4] ERROR   0.00s J0 | TestFixBrokenOffsets (suite) <<<
>    [junit4]    > Throwable #1: java.io.IOException: Could not remove the following files (in the order of attempts):
>    [junit4]    >    C:\Users\jenkins\workspace\Lucene-Solr-master-Windows\lucene\build\backward-codecs\test\J0\temp\lucene.index.TestFixBrokenOffsets_9CD5EB4D29F099D3-001\brokenoffsets-001\_0.cfs: java.nio.file.AccessDeniedException: C:\Users\jenkins\workspace\Lucene-Solr-master-Windows\lucene\build\backward-codecs\test\J0\temp\lucene.index.TestFixBrokenOffsets_9CD5EB4D29F099D3-001\brokenoffsets-001\_0.cfs
>    [junit4]    >    C:\Users\jenkins\workspace\Lucene-Solr-master-Windows\lucene\build\backward-codecs\test\J0\temp\lucene.index.TestFixBrokenOffsets_9CD5EB4D29F099D3-001\brokenoffsets-001\_1.cfs: java.nio.file.AccessDeniedException: C:\Users\jenkins\workspace\Lucene-Solr-master-Windows\lucene\build\backward-codecs\test\J0\temp\lucene.index.TestFixBrokenOffsets_9CD5EB4D29F099D3-001\brokenoffsets-001\_1.cfs
>    [junit4]    >    C:\Users\jenkins\workspace\Lucene-Solr-master-Windows\lucene\build\backward-codecs\test\J0\temp\lucene.index.TestFixBrokenOffsets_9CD5EB4D29F099D3-001\brokenoffsets-001: java.nio.file.DirectoryNotEmptyException: C:\Users\jenkins\workspace\Lucene-Solr-master-Windows\lucene\build\backward-codecs\test\J0\temp\lucene.index.TestFixBrokenOffsets_9CD5EB4D29F099D3-001\brokenoffsets-001
>    [junit4]    >    C:\Users\jenkins\workspace\Lucene-Solr-master-Windows\lucene\build\backward-codecs\test\J0\temp\lucene.index.TestFixBrokenOffsets_9CD5EB4D29F099D3-001: java.nio.file.DirectoryNotEmptyException: C:\Users\jenkins\workspace\Lucene-Solr-master-Windows\lucene\build\backward-codecs\test\J0\temp\lucene.index.TestFixBrokenOffsets_9CD5EB4D29F099D3-001
>    [junit4]    >        at __randomizedtesting.SeedInfo.seed([9CD5EB4D29F099D3]:0)
>    [junit4]    >        at org.apache.lucene.util.IOUtils.rm(IOUtils.java:323)
>    [junit4]    >        at java.lang.Thread.run(Thread.java:745)
>    [junit4] Completed [9/14 (1!)] on J0 in 0.16s, 1 test, 1 error <<< FAILURES!
>
> [...truncated 70924 lines...]

---------------------------------------------------------------------
To unsubscribe, e-mail: dev-unsubscribe@lucene.apache.org
For additional commands, e-mail: dev-help@lucene.apache.org