You are viewing a plain text version of this content. The canonical link for it is here.
Posted to notifications@maven.apache.org by Apache Jenkins Server <je...@builds.apache.org> on 2019/03/16 09:53:08 UTC
Build failed in Jenkins: Maven TLP » maven-surefire » deployment #3
See https://builds.apache.org/job/maven-box/job/maven-surefire/job/deployment/3/
No changes.
1 tests failed.
FAILED: org.apache.maven.surefire.its.JUnitPlatformEnginesIT.platform[1.4.0-SNAPSHOT]
Error Message:
Expected: <[\[DEBUG\] test\(compact\) classpath: test-classes classes junit-jupiter-engine-5\.4\.0-SNAPSHOT\.jar apiguardian-api-1\.0\.0\.jar junit-platform-engine-1\.4\.0-SNAPSHOT\.jar junit-platform-commons-1\.4\.0-SNAPSHOT\.jar opentest4j-1\.1\.1\.jar junit-jupiter-api-5\.4\.0-SNAPSHOT\.jar]>
but: was <[[DEBUG] test(compact) classpath: test-classes classes junit-jupiter-engine-5.4.0-SNAPSHOT.jar apiguardian-api-1.0.0.jar junit-platform-engine-1.4.0-SNAPSHOT.jar opentest4j-1.1.1.jar junit-platform-commons-1.4.0-SNAPSHOT.jar junit-jupiter-api-5.4.0-SNAPSHOT.jar]>
Stack Trace:
java.lang.AssertionError:
Expected: <[\[DEBUG\] test\(compact\) classpath: test-classes classes junit-jupiter-engine-5\.4\.0-SNAPSHOT\.jar apiguardian-api-1\.0\.0\.jar junit-platform-engine-1\.4\.0-SNAPSHOT\.jar junit-platform-commons-1\.4\.0-SNAPSHOT\.jar opentest4j-1\.1\.1\.jar junit-jupiter-api-5\.4\.0-SNAPSHOT\.jar]>
but: was <[[DEBUG] test(compact) classpath: test-classes classes junit-jupiter-engine-5.4.0-SNAPSHOT.jar apiguardian-api-1.0.0.jar junit-platform-engine-1.4.0-SNAPSHOT.jar opentest4j-1.1.1.jar junit-platform-commons-1.4.0-SNAPSHOT.jar junit-jupiter-api-5.4.0-SNAPSHOT.jar]>
at org.apache.maven.surefire.its.JUnitPlatformEnginesIT.platform(JUnitPlatformEnginesIT.java:111)
Build log:
[...truncated 43435 lines...]
[2019-03-16T09:40:33.779Z] at org.apache.maven.lifecycle.internal.LifecycleStarter.execute (LifecycleStarter.java:128)
[2019-03-16T09:40:33.779Z] at org.apache.maven.DefaultMaven.doExecute (DefaultMaven.java:305)
[2019-03-16T09:40:33.779Z] at org.apache.maven.DefaultMaven.doExecute (DefaultMaven.java:192)
[2019-03-16T09:40:33.779Z] at org.apache.maven.DefaultMaven.execute (DefaultMaven.java:105)
[2019-03-16T09:40:33.779Z] at org.apache.maven.cli.MavenCli.execute (MavenCli.java:956)
[2019-03-16T09:40:33.779Z] at org.apache.maven.cli.MavenCli.doMain (MavenCli.java:288)
[2019-03-16T09:40:33.779Z] at org.apache.maven.cli.MavenCli.main (MavenCli.java:192)
[2019-03-16T09:40:33.779Z] at sun.reflect.NativeMethodAccessorImpl.invoke0 (Native Method)
[2019-03-16T09:40:33.779Z] at sun.reflect.NativeMethodAccessorImpl.invoke (NativeMethodAccessorImpl.java:62)
[2019-03-16T09:40:33.779Z] at sun.reflect.DelegatingMethodAccessorImpl.invoke (DelegatingMethodAccessorImpl.java:43)
[2019-03-16T09:40:33.779Z] at java.lang.reflect.Method.invoke (Method.java:498)
[2019-03-16T09:40:33.779Z] at org.codehaus.plexus.classworlds.launcher.Launcher.launchEnhanced (Launcher.java:289)
[2019-03-16T09:40:33.779Z] at org.codehaus.plexus.classworlds.launcher.Launcher.launch (Launcher.java:229)
[2019-03-16T09:40:33.779Z] at org.codehaus.plexus.classworlds.launcher.Launcher.mainWithExitCode (Launcher.java:415)
[2019-03-16T09:40:33.779Z] at org.codehaus.plexus.classworlds.launcher.Launcher.main (Launcher.java:356)
[2019-03-16T09:40:33.779Z] Caused by: org.apache.maven.plugin.MojoFailureException: There are test failures.
[2019-03-16T09:40:33.779Z]
[2019-03-16T09:40:33.779Z] Please refer to C:\Users\jenkins\AppData\Local\Temp\2\jenkins-maven-box-maven-surefire-deployment-3\surefire-its\target\failsafe-reports for the individual test results.
[2019-03-16T09:40:33.779Z] Please refer to dump files (if any exist) [date].dump, [date]-jvmRun[N].dump and [date].dumpstream.
[2019-03-16T09:40:33.779Z] at org.apache.maven.plugin.surefire.SurefireHelper.throwException (SurefireHelper.java:271)
[2019-03-16T09:40:33.779Z] at org.apache.maven.plugin.surefire.SurefireHelper.reportExecution (SurefireHelper.java:159)
[2019-03-16T09:40:33.779Z] at org.apache.maven.plugin.failsafe.VerifyMojo.execute (VerifyMojo.java:192)
[2019-03-16T09:40:33.779Z] at org.apache.maven.plugin.DefaultBuildPluginManager.executeMojo (DefaultBuildPluginManager.java:137)
[2019-03-16T09:40:33.779Z] at org.apache.maven.lifecycle.internal.MojoExecutor.execute (MojoExecutor.java:210)
[2019-03-16T09:40:33.779Z] at org.apache.maven.lifecycle.internal.MojoExecutor.execute (MojoExecutor.java:156)
[2019-03-16T09:40:33.779Z] at org.apache.maven.lifecycle.internal.MojoExecutor.execute (MojoExecutor.java:148)
[2019-03-16T09:40:33.779Z] at org.apache.maven.lifecycle.internal.LifecycleModuleBuilder.buildProject (LifecycleModuleBuilder.java:117)
[2019-03-16T09:40:33.779Z] at org.apache.maven.lifecycle.internal.LifecycleModuleBuilder.buildProject (LifecycleModuleBuilder.java:81)
[2019-03-16T09:40:33.779Z] at org.apache.maven.lifecycle.internal.builder.singlethreaded.SingleThreadedBuilder.build (SingleThreadedBuilder.java:56)
[2019-03-16T09:40:33.779Z] at org.apache.maven.lifecycle.internal.LifecycleStarter.execute (LifecycleStarter.java:128)
[2019-03-16T09:40:33.779Z] at org.apache.maven.DefaultMaven.doExecute (DefaultMaven.java:305)
[2019-03-16T09:40:33.779Z] at org.apache.maven.DefaultMaven.doExecute (DefaultMaven.java:192)
[2019-03-16T09:40:33.779Z] at org.apache.maven.DefaultMaven.execute (DefaultMaven.java:105)
[2019-03-16T09:40:33.779Z] at org.apache.maven.cli.MavenCli.execute (MavenCli.java:956)
[2019-03-16T09:40:33.779Z] at org.apache.maven.cli.MavenCli.doMain (MavenCli.java:288)
[2019-03-16T09:40:33.780Z] at org.apache.maven.cli.MavenCli.main (MavenCli.java:192)
[2019-03-16T09:40:33.780Z] at sun.reflect.NativeMethodAccessorImpl.invoke0 (Native Method)
[2019-03-16T09:40:33.780Z] at sun.reflect.NativeMethodAccessorImpl.invoke (NativeMethodAccessorImpl.java:62)
[2019-03-16T09:40:33.780Z] at sun.reflect.DelegatingMethodAccessorImpl.invoke (DelegatingMethodAccessorImpl.java:43)
[2019-03-16T09:40:33.780Z] at java.lang.reflect.Method.invoke (Method.java:498)
[2019-03-16T09:40:33.780Z] at org.codehaus.plexus.classworlds.launcher.Launcher.launchEnhanced (Launcher.java:289)
[2019-03-16T09:40:33.780Z] at org.codehaus.plexus.classworlds.launcher.Launcher.launch (Launcher.java:229)
[2019-03-16T09:40:33.780Z] at org.codehaus.plexus.classworlds.launcher.Launcher.mainWithExitCode (Launcher.java:415)
[2019-03-16T09:40:33.780Z] at org.codehaus.plexus.classworlds.launcher.Launcher.main (Launcher.java:356)
[2019-03-16T09:40:33.780Z] [ERROR]
[2019-03-16T09:40:33.780Z] [ERROR] Re-run Maven using the -X switch to enable full debug logging.
[2019-03-16T09:40:33.780Z] [ERROR]
[2019-03-16T09:40:33.780Z] [ERROR] For more information about the errors and possible solutions, please read the following articles:
[2019-03-16T09:40:33.780Z] [ERROR] [Help 1] http://cwiki.apache.org/confluence/display/MAVEN/MojoFailureException
[2019-03-16T09:40:33.780Z] [ERROR]
[2019-03-16T09:40:33.780Z] [ERROR] After correcting the problems, you can resume the build with the command
[2019-03-16T09:40:33.780Z] [ERROR] mvn <goals> -rf :surefire-its
[Pipeline] }
[Pipeline] // withEnv
[Pipeline] }
[Pipeline] // stage
[Pipeline] fileExists
[Pipeline] zip
[2019-03-16T09:40:33.989Z] Writing zip file of C:\Users\jenkins\AppData\Local\Temp\2\jenkins-maven-box-maven-surefire-deployment-3\maven-failsafe-plugin\target\it to C:\Users\jenkins\AppData\Local\Temp\2\jenkins-maven-box-maven-surefire-deployment-3\maven-failsafe-plugin--windows-jdk8-maven3.6.x.zip
[2019-03-16T09:40:34.080Z] Zipped 79 entries.
[2019-03-16T09:40:34.081Z] Archiving C:\Users\jenkins\AppData\Local\Temp\2\jenkins-maven-box-maven-surefire-deployment-3\maven-failsafe-plugin--windows-jdk8-maven3.6.x.zip
[2019-03-16T09:40:34.081Z] [Fast Archiver] No prior successful build to compare, so performing full copy of artifacts
[Pipeline] fileExists
[Pipeline] zip
[2019-03-16T09:40:34.199Z] Writing zip file of C:\Users\jenkins\AppData\Local\Temp\2\jenkins-maven-box-maven-surefire-deployment-3\surefire-its\target to C:\Users\jenkins\AppData\Local\Temp\2\jenkins-maven-box-maven-surefire-deployment-3\surefire-its--windows-jdk8-maven3.6.x.zip
[2019-03-16T09:40:43.950Z] Zipped 15949 entries.
[2019-03-16T09:40:43.950Z] Archiving C:\Users\jenkins\AppData\Local\Temp\2\jenkins-maven-box-maven-surefire-deployment-3\surefire-its--windows-jdk8-maven3.6.x.zip
[2019-03-16T09:40:43.951Z] [Fast Archiver] No prior successful build to compare, so performing full copy of artifacts
[Pipeline] archiveArtifacts
[2019-03-16T09:40:45.196Z] Archiving artifacts
[2019-03-16T09:40:45.223Z] [Fast Archiver] No prior successful build to compare, so performing full copy of artifacts
[Pipeline] cleanWs
[2019-03-16T09:40:46.680Z] [WS-CLEANUP] Deleting project workspace...
[2019-03-16T09:40:46.680Z] [WS-CLEANUP] Deferred wipeout is used...
[2019-03-16T09:40:46.816Z] [WS-CLEANUP] done
[Pipeline] }
[Pipeline] // ws
[Pipeline] }
[Pipeline] // timestamps
[Pipeline] }
[Pipeline] // node
[Pipeline] }
[2019-03-16T09:41:14.136Z] [INFO] Tests run: 2, Failures: 0, Errors: 0, Skipped: 0, Time elapsed: 42.262 s - in org.apache.maven.surefire.its.jiras.Surefire570MultipleReportDirectoriesIT
[2019-03-16T09:41:14.136Z] [INFO] Running org.apache.maven.surefire.its.jiras.Surefire613TestCountInParallelIT
[2019-03-16T09:41:17.693Z] [INFO] Tests run: 1, Failures: 0, Errors: 0, Skipped: 0, Time elapsed: 8.871 s - in org.apache.maven.surefire.its.jiras.Surefire613TestCountInParallelIT
[2019-03-16T09:41:17.694Z] [INFO] Running org.apache.maven.surefire.its.jiras.Surefire621TestCountingJunit3InParallelIT
[2019-03-16T09:42:05.247Z] [INFO] Tests run: 5, Failures: 0, Errors: 0, Skipped: 0, Time elapsed: 44.04 s - in org.apache.maven.surefire.its.jiras.Surefire621TestCountingJunit3InParallelIT
[2019-03-16T09:42:05.247Z] [INFO] Running org.apache.maven.surefire.its.jiras.Surefire628ConsoleOutputBeforeAndAfterClassIT
[2019-03-16T09:42:09.831Z] [INFO] Tests run: 1, Failures: 0, Errors: 0, Skipped: 0, Time elapsed: 8.063 s - in org.apache.maven.surefire.its.jiras.Surefire628ConsoleOutputBeforeAndAfterClassIT
[2019-03-16T09:42:09.831Z] [INFO] Running org.apache.maven.surefire.its.jiras.Surefire634UnsettableSystemPropertiesWarningIT
[2019-03-16T09:42:18.443Z] [INFO] Tests run: 1, Failures: 0, Errors: 0, Skipped: 0, Time elapsed: 8.035 s - in org.apache.maven.surefire.its.jiras.Surefire634UnsettableSystemPropertiesWarningIT
[2019-03-16T09:42:18.443Z] [INFO] Running org.apache.maven.surefire.its.jiras.Surefire649EmptyStringSystemPropertiesIT
[2019-03-16T09:42:31.223Z] [INFO] Tests run: 2, Failures: 0, Errors: 0, Skipped: 0, Time elapsed: 12.576 s - in org.apache.maven.surefire.its.jiras.Surefire649EmptyStringSystemPropertiesIT
[2019-03-16T09:42:31.223Z] [INFO] Running org.apache.maven.surefire.its.jiras.Surefire673MockitoIT
[2019-03-16T09:42:39.805Z] [INFO] Tests run: 1, Failures: 0, Errors: 0, Skipped: 0, Time elapsed: 9.565 s - in org.apache.maven.surefire.its.jiras.Surefire673MockitoIT
[2019-03-16T09:42:39.805Z] [INFO] Running org.apache.maven.surefire.its.jiras.Surefire674BuildFailingWhenErrorsIT
[2019-03-16T09:42:48.465Z] [INFO] Tests run: 1, Failures: 0, Errors: 0, Skipped: 0, Time elapsed: 7.955 s - in org.apache.maven.surefire.its.jiras.Surefire674BuildFailingWhenErrorsIT
[2019-03-16T09:42:48.465Z] [INFO] Running org.apache.maven.surefire.its.jiras.Surefire674BuildFailingWhenFailsafeErrorsIT
[2019-03-16T09:43:01.331Z] [INFO] Tests run: 1, Failures: 0, Errors: 0, Skipped: 0, Time elapsed: 13.341 s - in org.apache.maven.surefire.its.jiras.Surefire674BuildFailingWhenFailsafeErrorsIT
[2019-03-16T09:43:01.331Z] [INFO] Running org.apache.maven.surefire.its.jiras.Surefire685CommaSeparatedIncludesIT
[2019-03-16T09:43:09.939Z] [INFO] Tests run: 1, Failures: 0, Errors: 0, Skipped: 0, Time elapsed: 7.714 s - in org.apache.maven.surefire.its.jiras.Surefire685CommaSeparatedIncludesIT
[2019-03-16T09:43:09.939Z] [INFO] Running org.apache.maven.surefire.its.jiras.Surefire697NiceSummaryIT
[2019-03-16T09:43:16.933Z] [INFO] Tests run: 1, Failures: 0, Errors: 0, Skipped: 0, Time elapsed: 7.766 s - in org.apache.maven.surefire.its.jiras.Surefire697NiceSummaryIT
[2019-03-16T09:43:16.933Z] [INFO] Running org.apache.maven.surefire.its.jiras.Surefire705ParallelForkTimeoutIT
[2019-03-16T09:43:27.496Z] [INFO] Tests run: 1, Failures: 0, Errors: 0, Skipped: 0, Time elapsed: 10.16 s - in org.apache.maven.surefire.its.jiras.Surefire705ParallelForkTimeoutIT
[2019-03-16T09:43:27.496Z] [INFO] Running org.apache.maven.surefire.its.jiras.Surefire733AllOverrridesCapturedIT
[2019-03-16T09:43:34.758Z] [INFO] Tests run: 1, Failures: 0, Errors: 0, Skipped: 0, Time elapsed: 7.891 s - in org.apache.maven.surefire.its.jiras.Surefire733AllOverrridesCapturedIT
[2019-03-16T09:43:34.758Z] [INFO] Running org.apache.maven.surefire.its.jiras.Surefire735ForkFailWithRedirectConsoleOutputIT
[2019-03-16T09:43:50.308Z] [INFO] Tests run: 2, Failures: 0, Errors: 0, Skipped: 0, Time elapsed: 14.121 s - in org.apache.maven.surefire.its.jiras.Surefire735ForkFailWithRedirectConsoleOutputIT
[2019-03-16T09:43:50.308Z] [INFO] Running org.apache.maven.surefire.its.jiras.Surefire740TruncatedCommaIT
[2019-03-16T09:43:56.162Z] [INFO] Tests run: 1, Failures: 0, Errors: 0, Skipped: 0, Time elapsed: 6.947 s - in org.apache.maven.surefire.its.jiras.Surefire740TruncatedCommaIT
[2019-03-16T09:43:56.162Z] [INFO] Running org.apache.maven.surefire.its.jiras.Surefire747MethodParallelWithSuiteCountIT
[2019-03-16T09:44:24.202Z] [INFO] Tests run: 2, Failures: 0, Errors: 0, Skipped: 0, Time elapsed: 26.542 s - in org.apache.maven.surefire.its.jiras.Surefire747MethodParallelWithSuiteCountIT
[2019-03-16T09:44:24.202Z] [INFO] Running org.apache.maven.surefire.its.jiras.Surefire772BothReportsIT
[2019-03-16T09:44:39.650Z] [INFO] Tests run: 3, Failures: 0, Errors: 0, Skipped: 0, Time elapsed: 15.714 s - in org.apache.maven.surefire.its.jiras.Surefire772BothReportsIT
[2019-03-16T09:44:39.650Z] [INFO] Running org.apache.maven.surefire.its.jiras.Surefire772NoFailsafeReportsIT
[2019-03-16T09:44:58.388Z] [INFO] Tests run: 4, Failures: 0, Errors: 0, Skipped: 0, Time elapsed: 19.999 s - in org.apache.maven.surefire.its.jiras.Surefire772NoFailsafeReportsIT
[2019-03-16T09:44:58.388Z] [INFO] Running org.apache.maven.surefire.its.jiras.Surefire772NoSurefireReportsIT
[2019-03-16T09:45:21.120Z] [INFO] Tests run: 4, Failures: 0, Errors: 0, Skipped: 0, Time elapsed: 19.963 s - in org.apache.maven.surefire.its.jiras.Surefire772NoSurefireReportsIT
[2019-03-16T09:45:21.120Z] [INFO] Running org.apache.maven.surefire.its.jiras.Surefire772SpecifiedReportsIT
[2019-03-16T09:45:33.947Z] [INFO] Tests run: 3, Failures: 0, Errors: 0, Skipped: 0, Time elapsed: 15.233 s - in org.apache.maven.surefire.its.jiras.Surefire772SpecifiedReportsIT
[2019-03-16T09:45:33.947Z] [INFO] Running org.apache.maven.surefire.its.jiras.Surefire801ForkModeNoneClassLoaderIT
[2019-03-16T09:45:41.043Z] [INFO] Tests run: 1, Failures: 0, Errors: 0, Skipped: 0, Time elapsed: 6.599 s - in org.apache.maven.surefire.its.jiras.Surefire801ForkModeNoneClassLoaderIT
[2019-03-16T09:45:41.043Z] [INFO] Running org.apache.maven.surefire.its.jiras.Surefire803MultiFailsafeExecsIT
[2019-03-16T09:46:13.989Z] [INFO] Tests run: 2, Failures: 0, Errors: 0, Skipped: 0, Time elapsed: 29.879 s - in org.apache.maven.surefire.its.jiras.Surefire803MultiFailsafeExecsIT
[2019-03-16T09:46:13.989Z] [INFO] Running org.apache.maven.surefire.its.jiras.Surefire806SpecifiedTestControlsIT
[2019-03-16T09:46:17.560Z] [WARNING] Tests run: 3, Failures: 0, Errors: 0, Skipped: 2, Time elapsed: 7.87 s - in org.apache.maven.surefire.its.jiras.Surefire806SpecifiedTestControlsIT
[2019-03-16T09:46:17.560Z] [INFO] Running org.apache.maven.surefire.its.jiras.Surefire809GroupExpressionsIT
[2019-03-16T09:47:05.230Z] [INFO] Tests run: 6, Failures: 0, Errors: 0, Skipped: 0, Time elapsed: 46.207 s - in org.apache.maven.surefire.its.jiras.Surefire809GroupExpressionsIT
[2019-03-16T09:47:05.230Z] [INFO] Running org.apache.maven.surefire.its.jiras.Surefire812Log4JClassLoaderIT
[2019-03-16T09:47:13.882Z] [INFO] Tests run: 1, Failures: 0, Errors: 0, Skipped: 0, Time elapsed: 9.063 s - in org.apache.maven.surefire.its.jiras.Surefire812Log4JClassLoaderIT
[2019-03-16T09:47:13.882Z] [INFO] Running org.apache.maven.surefire.its.jiras.Surefire817SystemExitIT
[2019-03-16T09:47:20.906Z] [INFO] Tests run: 1, Failures: 0, Errors: 0, Skipped: 0, Time elapsed: 7.959 s - in org.apache.maven.surefire.its.jiras.Surefire817SystemExitIT
[2019-03-16T09:47:20.906Z] [INFO] Running org.apache.maven.surefire.its.jiras.Surefire818NpeIgnoresTestsIT
[2019-03-16T09:47:31.416Z] [INFO] Tests run: 1, Failures: 0, Errors: 0, Skipped: 0, Time elapsed: 9.378 s - in org.apache.maven.surefire.its.jiras.Surefire818NpeIgnoresTestsIT
[2019-03-16T09:47:31.416Z] [INFO] Running org.apache.maven.surefire.its.jiras.Surefire828EmptyGroupExprIT
[2019-03-16T09:48:04.352Z] [INFO] Tests run: 4, Failures: 0, Errors: 0, Skipped: 0, Time elapsed: 33.003 s - in org.apache.maven.surefire.its.jiras.Surefire828EmptyGroupExprIT
[2019-03-16T09:48:04.352Z] [INFO] Running org.apache.maven.surefire.its.jiras.Surefire832ProviderSelectionIT
[2019-03-16T09:48:11.663Z] [INFO] Tests run: 1, Failures: 0, Errors: 0, Skipped: 0, Time elapsed: 7.841 s - in org.apache.maven.surefire.its.jiras.Surefire832ProviderSelectionIT
[2019-03-16T09:48:11.663Z] [INFO] Running org.apache.maven.surefire.its.jiras.Surefire839TestWithoutCategoriesIT
[2019-03-16T09:48:30.515Z] [INFO] Tests run: 2, Failures: 0, Errors: 0, Skipped: 0, Time elapsed: 16.24 s - in org.apache.maven.surefire.its.jiras.Surefire839TestWithoutCategoriesIT
[2019-03-16T09:48:30.515Z] [INFO] Running org.apache.maven.surefire.its.jiras.Surefire847AdditionalFailureIT
[2019-03-16T09:48:39.095Z] [INFO] Tests run: 1, Failures: 0, Errors: 0, Skipped: 0, Time elapsed: 10.472 s - in org.apache.maven.surefire.its.jiras.Surefire847AdditionalFailureIT
[2019-03-16T09:48:39.096Z] [INFO] Running org.apache.maven.surefire.its.jiras.Surefire855AllowFailsafeUseArtifactFileIT
[2019-03-16T09:50:01.564Z] [INFO] Tests run: 4, Failures: 0, Errors: 0, Skipped: 0, Time elapsed: 73.112 s - in org.apache.maven.surefire.its.jiras.Surefire855AllowFailsafeUseArtifactFileIT
[2019-03-16T09:50:01.564Z] [INFO] Running org.apache.maven.surefire.its.jiras.Surefire901MIssingResultfileWhenNoTestsIT
[2019-03-16T09:50:01.564Z] [INFO] Tests run: 1, Failures: 0, Errors: 0, Skipped: 0, Time elapsed: 6.611 s - in org.apache.maven.surefire.its.jiras.Surefire901MIssingResultfileWhenNoTestsIT
[2019-03-16T09:50:01.564Z] [INFO] Running org.apache.maven.surefire.its.jiras.Surefire907PerThreadWithoutThreadCountIT
[2019-03-16T09:50:03.675Z] [INFO] Tests run: 1, Failures: 0, Errors: 0, Skipped: 0, Time elapsed: 5.534 s - in org.apache.maven.surefire.its.jiras.Surefire907PerThreadWithoutThreadCountIT
[2019-03-16T09:50:03.675Z] [INFO] Running org.apache.maven.surefire.its.jiras.Surefire920TestFailureIgnoreWithTimeoutIT
[2019-03-16T09:50:22.487Z] [INFO] Tests run: 2, Failures: 0, Errors: 0, Skipped: 0, Time elapsed: 17.087 s - in org.apache.maven.surefire.its.jiras.Surefire920TestFailureIgnoreWithTimeoutIT
[2019-03-16T09:50:22.487Z] [INFO] Running org.apache.maven.surefire.its.jiras.Surefire926FailureWith2ProvidersIT
[2019-03-16T09:50:31.404Z] [INFO] Tests run: 1, Failures: 0, Errors: 0, Skipped: 0, Time elapsed: 10.222 s - in org.apache.maven.surefire.its.jiras.Surefire926FailureWith2ProvidersIT
[2019-03-16T09:50:31.404Z] [INFO] Running org.apache.maven.surefire.its.jiras.Surefire930TestNgSuiteXmlIT
[2019-03-16T09:50:42.025Z] [INFO] Tests run: 1, Failures: 0, Errors: 0, Skipped: 0, Time elapsed: 9.633 s - in org.apache.maven.surefire.its.jiras.Surefire930TestNgSuiteXmlIT
[2019-03-16T09:50:42.025Z] [INFO] Running org.apache.maven.surefire.its.jiras.Surefire943ReportContentIT
[2019-03-16T09:51:14.883Z] [INFO] Tests run: 2, Failures: 0, Errors: 0, Skipped: 0, Time elapsed: 33.482 s - in org.apache.maven.surefire.its.jiras.Surefire943ReportContentIT
[2019-03-16T09:51:14.883Z] [INFO] Running org.apache.maven.surefire.its.jiras.Surefire946KillMainProcessInReusableForkIT
[2019-03-16T09:51:42.247Z] [INFO] Tests run: 3, Failures: 0, Errors: 0, Skipped: 0, Time elapsed: 27.182 s - in org.apache.maven.surefire.its.jiras.Surefire946KillMainProcessInReusableForkIT
[2019-03-16T09:51:42.247Z] [INFO] Running org.apache.maven.surefire.its.jiras.Surefire972BizarreNoClassDefIT
[2019-03-16T09:51:54.995Z] [INFO] Tests run: 1, Failures: 0, Errors: 0, Skipped: 0, Time elapsed: 12.166 s - in org.apache.maven.surefire.its.jiras.Surefire972BizarreNoClassDefIT
[2019-03-16T09:51:54.995Z] [INFO] Running org.apache.maven.surefire.its.jiras.Surefire975DefaultVMEncodingIT
[2019-03-16T09:52:02.159Z] [INFO] Tests run: 1, Failures: 0, Errors: 0, Skipped: 0, Time elapsed: 8.516 s - in org.apache.maven.surefire.its.jiras.Surefire975DefaultVMEncodingIT
[2019-03-16T09:52:02.159Z] [INFO] Running org.apache.maven.surefire.its.jiras.Surefire979WrongClassLoaderIT
[2019-03-16T09:52:09.248Z] [INFO] Tests run: 1, Failures: 0, Errors: 0, Skipped: 0, Time elapsed: 7.553 s - in org.apache.maven.surefire.its.jiras.Surefire979WrongClassLoaderIT
[2019-03-16T09:52:09.248Z] [INFO] Running org.apache.maven.surefire.its.jiras.Surefire985ParameterizedRunnerAndCategoriesIT
[2019-03-16T09:52:16.311Z] [INFO] Tests run: 1, Failures: 0, Errors: 0, Skipped: 0, Time elapsed: 6.631 s - in org.apache.maven.surefire.its.jiras.Surefire985ParameterizedRunnerAndCategoriesIT
[2019-03-16T09:52:16.311Z] [INFO] Running org.apache.maven.surefire.its.jiras.Surefire995CategoryInheritanceIT
[2019-03-16T09:52:49.310Z] [INFO] Tests run: 5, Failures: 0, Errors: 0, Skipped: 0, Time elapsed: 31.974 s - in org.apache.maven.surefire.its.jiras.Surefire995CategoryInheritanceIT
[2019-03-16T09:52:49.310Z] [INFO]
[2019-03-16T09:52:49.310Z] [INFO] Results:
[2019-03-16T09:52:49.310Z] [INFO]
[2019-03-16T09:52:49.310Z] [WARNING] Tests run: 788, Failures: 0, Errors: 0, Skipped: 169
[2019-03-16T09:52:49.310Z] [INFO]
[2019-03-16T09:52:49.310Z] [INFO]
[2019-03-16T09:52:49.310Z] [INFO] --- maven-checkstyle-plugin:3.0.0:check (checkstyle-check) @ surefire-its ---
[2019-03-16T09:52:49.983Z] [INFO]
[2019-03-16T09:52:49.983Z] [INFO] --- maven-failsafe-plugin:3.0.0-M3:verify (default) @ surefire-its ---
[2019-03-16T09:52:49.983Z] [INFO] Failsafe report directory: C:\Users\jenkins\AppData\Local\Temp\2\jenkins-maven-box-maven-surefire-deployment-3\surefire-its\target\failsafe-reports
[2019-03-16T09:52:50.290Z] [INFO]
[2019-03-16T09:52:50.290Z] [INFO] --- maven-install-plugin:2.5.2:install (default-install) @ surefire-its ---
[2019-03-16T09:52:50.290Z] [INFO] Skipping artifact installation
[2019-03-16T09:52:50.290Z] [INFO] ------------------------------------------------------------------------
[2019-03-16T09:52:50.290Z] [INFO] Reactor Summary for Apache Maven Surefire 3.0.0-M4-SNAPSHOT:
[2019-03-16T09:52:50.290Z] [INFO]
[2019-03-16T09:52:50.290Z] [INFO] Apache Maven Surefire .............................. SUCCESS [01:00 min]
[2019-03-16T09:52:50.290Z] [INFO] SureFire Logger API ................................ SUCCESS [ 12.337 s]
[2019-03-16T09:52:50.290Z] [INFO] SureFire API ....................................... SUCCESS [ 21.512 s]
[2019-03-16T09:52:50.290Z] [INFO] SureFire Booter .................................... SUCCESS [ 24.382 s]
[2019-03-16T09:52:50.290Z] [INFO] Maven Surefire Test-Grouping Support ............... SUCCESS [ 13.947 s]
[2019-03-16T09:52:50.290Z] [INFO] SureFire Providers ................................. SUCCESS [ 1.841 s]
[2019-03-16T09:52:50.290Z] [INFO] Shared JUnit3 Provider Code ........................ SUCCESS [ 7.294 s]
[2019-03-16T09:52:50.290Z] [INFO] Shared Java 5 Provider Base ........................ SUCCESS [ 9.354 s]
[2019-03-16T09:52:50.290Z] [INFO] Shared JUnit4 Provider Code ........................ SUCCESS [ 9.093 s]
[2019-03-16T09:52:50.290Z] [INFO] Shared JUnit48 Provider Code ....................... SUCCESS [ 9.539 s]
[2019-03-16T09:52:50.290Z] [INFO] SureFire JUnit Runner .............................. SUCCESS [ 7.532 s]
[2019-03-16T09:52:50.290Z] [INFO] SureFire JUnit4 Runner ............................. SUCCESS [ 16.810 s]
[2019-03-16T09:52:50.290Z] [INFO] Maven Surefire Common .............................. SUCCESS [ 43.814 s]
[2019-03-16T09:52:50.290Z] [INFO] SureFire JUnitCore Runner .......................... SUCCESS [02:30 min]
[2019-03-16T09:52:50.290Z] [INFO] SureFire JUnit Platform Runner ..................... SUCCESS [ 15.780 s]
[2019-03-16T09:52:50.290Z] [INFO] SureFire TestNG Utils .............................. SUCCESS [ 8.518 s]
[2019-03-16T09:52:50.290Z] [INFO] SureFire TestNG Runner ............................. SUCCESS [ 9.355 s]
[2019-03-16T09:52:50.290Z] [INFO] ShadeFire JUnit3 Provider .......................... SUCCESS [ 4.491 s]
[2019-03-16T09:52:50.290Z] [INFO] Surefire Report Parser ............................. SUCCESS [ 10.064 s]
[2019-03-16T09:52:50.290Z] [INFO] Maven Surefire Plugin .............................. SUCCESS [ 19.449 s]
[2019-03-16T09:52:50.290Z] [INFO] Maven Failsafe Plugin .............................. SUCCESS [02:11 min]
[2019-03-16T09:52:50.290Z] [INFO] Maven Surefire Report Plugin ....................... SUCCESS [ 22.999 s]
[2019-03-16T09:52:50.290Z] [INFO] Maven Surefire Integration Tests ................... SUCCESS [ 01:33 h]
[2019-03-16T09:52:50.290Z] [INFO] ------------------------------------------------------------------------
[2019-03-16T09:52:50.290Z] [INFO] BUILD SUCCESS
[2019-03-16T09:52:50.290Z] [INFO] ------------------------------------------------------------------------
[2019-03-16T09:52:50.290Z] [INFO] Total time: 01:43 h
[2019-03-16T09:52:50.290Z] [INFO] Finished at: 2019-03-16T02:52:50-07:00
[2019-03-16T09:52:50.290Z] [INFO] ------------------------------------------------------------------------
[Pipeline] }
[Pipeline] // withEnv
[Pipeline] }
[Pipeline] // stage
[Pipeline] fileExists
[Pipeline] zip
[2019-03-16T09:52:50.505Z] Writing zip file of C:\Users\jenkins\AppData\Local\Temp\2\jenkins-maven-box-maven-surefire-deployment-3\maven-failsafe-plugin\target\it to C:\Users\jenkins\AppData\Local\Temp\2\jenkins-maven-box-maven-surefire-deployment-3\maven-failsafe-plugin--windows-jdk7-maven3.6.x.zip
[2019-03-16T09:52:50.641Z] Zipped 78 entries.
[2019-03-16T09:52:50.641Z] Archiving C:\Users\jenkins\AppData\Local\Temp\2\jenkins-maven-box-maven-surefire-deployment-3\maven-failsafe-plugin--windows-jdk7-maven3.6.x.zip
[2019-03-16T09:52:50.642Z] [Fast Archiver] No prior successful build to compare, so performing full copy of artifacts
[Pipeline] fileExists
[Pipeline] zip
[2019-03-16T09:52:50.752Z] Writing zip file of C:\Users\jenkins\AppData\Local\Temp\2\jenkins-maven-box-maven-surefire-deployment-3\surefire-its\target to C:\Users\jenkins\AppData\Local\Temp\2\jenkins-maven-box-maven-surefire-deployment-3\surefire-its--windows-jdk7-maven3.6.x.zip
[2019-03-16T09:53:05.001Z] Zipped 15823 entries.
[2019-03-16T09:53:05.001Z] Archiving C:\Users\jenkins\AppData\Local\Temp\2\jenkins-maven-box-maven-surefire-deployment-3\surefire-its--windows-jdk7-maven3.6.x.zip
[2019-03-16T09:53:05.001Z] [Fast Archiver] No prior successful build to compare, so performing full copy of artifacts
[Pipeline] archiveArtifacts
[2019-03-16T09:53:06.505Z] Archiving artifacts
[2019-03-16T09:53:06.527Z] [Fast Archiver] No prior successful build to compare, so performing full copy of artifacts
[Pipeline] cleanWs
[2019-03-16T09:53:08.153Z] [WS-CLEANUP] Deleting project workspace...
[2019-03-16T09:53:08.153Z] [WS-CLEANUP] Deferred wipeout is used...
[2019-03-16T09:53:08.326Z] [WS-CLEANUP] done
[Pipeline] }
[Pipeline] // ws
[Pipeline] }
[Pipeline] // timestamps
[Pipeline] }
[Pipeline] // node
[Pipeline] }
[Pipeline] // parallel
[Pipeline] echo
Build result: FAILURE
[Pipeline] jiraIssueSelector
[Pipeline] emailext
Build failed in Jenkins: Maven TLP » maven-surefire » deployment #10
Posted by Apache Jenkins Server <je...@builds.apache.org>.
See https://builds.apache.org/job/maven-box/job/maven-surefire/job/deployment/10/
No changes.
1 tests failed.
FAILED: org.apache.maven.surefire.its.JUnitPlatformEnginesIT.platform[1.4.0-SNAPSHOT]
Error Message:
Expected: <[\[DEBUG\] test\(compact\) classpath: test-classes classes junit-jupiter-engine-5\.4\.0-SNAPSHOT\.jar apiguardian-api-1\.0\.0\.jar junit-platform-engine-1\.4\.0-SNAPSHOT\.jar junit-platform-commons-1\.4\.0-SNAPSHOT\.jar opentest4j-1\.1\.1\.jar junit-jupiter-api-5\.4\.0-SNAPSHOT\.jar]>
but: was <[[DEBUG] test(compact) classpath: test-classes classes junit-jupiter-engine-5.4.0-SNAPSHOT.jar apiguardian-api-1.0.0.jar junit-platform-engine-1.4.0-SNAPSHOT.jar opentest4j-1.1.1.jar junit-platform-commons-1.4.0-SNAPSHOT.jar junit-jupiter-api-5.4.0-SNAPSHOT.jar]>
Stack Trace:
java.lang.AssertionError:
Expected: <[\[DEBUG\] test\(compact\) classpath: test-classes classes junit-jupiter-engine-5\.4\.0-SNAPSHOT\.jar apiguardian-api-1\.0\.0\.jar junit-platform-engine-1\.4\.0-SNAPSHOT\.jar junit-platform-commons-1\.4\.0-SNAPSHOT\.jar opentest4j-1\.1\.1\.jar junit-jupiter-api-5\.4\.0-SNAPSHOT\.jar]>
but: was <[[DEBUG] test(compact) classpath: test-classes classes junit-jupiter-engine-5.4.0-SNAPSHOT.jar apiguardian-api-1.0.0.jar junit-platform-engine-1.4.0-SNAPSHOT.jar opentest4j-1.1.1.jar junit-platform-commons-1.4.0-SNAPSHOT.jar junit-jupiter-api-5.4.0-SNAPSHOT.jar]>
at org.apache.maven.surefire.its.JUnitPlatformEnginesIT.platform(JUnitPlatformEnginesIT.java:111)
Build log:
[...truncated 24547 lines...]
[2019-06-22T11:55:06.952Z] at org.apache.maven.DefaultMaven.doExecute (DefaultMaven.java:192)
[2019-06-22T11:55:06.952Z] at org.apache.maven.DefaultMaven.execute (DefaultMaven.java:105)
[2019-06-22T11:55:06.952Z] at org.apache.maven.cli.MavenCli.execute (MavenCli.java:956)
[2019-06-22T11:55:06.952Z] at org.apache.maven.cli.MavenCli.doMain (MavenCli.java:288)
[2019-06-22T11:55:06.952Z] at org.apache.maven.cli.MavenCli.main (MavenCli.java:192)
[2019-06-22T11:55:06.952Z] at sun.reflect.NativeMethodAccessorImpl.invoke0 (Native Method)
[2019-06-22T11:55:06.952Z] at sun.reflect.NativeMethodAccessorImpl.invoke (NativeMethodAccessorImpl.java:62)
[2019-06-22T11:55:06.952Z] at sun.reflect.DelegatingMethodAccessorImpl.invoke (DelegatingMethodAccessorImpl.java:43)
[2019-06-22T11:55:06.952Z] at java.lang.reflect.Method.invoke (Method.java:498)
[2019-06-22T11:55:06.952Z] at org.codehaus.plexus.classworlds.launcher.Launcher.launchEnhanced (Launcher.java:289)
[2019-06-22T11:55:06.952Z] at org.codehaus.plexus.classworlds.launcher.Launcher.launch (Launcher.java:229)
[2019-06-22T11:55:06.952Z] at org.codehaus.plexus.classworlds.launcher.Launcher.mainWithExitCode (Launcher.java:415)
[2019-06-22T11:55:06.952Z] at org.codehaus.plexus.classworlds.launcher.Launcher.main (Launcher.java:356)
[2019-06-22T11:55:06.952Z] Caused by: org.apache.maven.plugin.MojoFailureException: There are test failures.
[2019-06-22T11:55:06.952Z]
[2019-06-22T11:55:06.952Z] Please refer to /home/jenkins/jenkins-slave/workspace/en-box_maven-surefire_deployment@2/surefire-its/target/failsafe-reports for the individual test results.
[2019-06-22T11:55:06.952Z] Please refer to dump files (if any exist) [date].dump, [date]-jvmRun[N].dump and [date].dumpstream.
[2019-06-22T11:55:06.952Z] at org.apache.maven.plugin.surefire.SurefireHelper.throwException (SurefireHelper.java:271)
[2019-06-22T11:55:06.952Z] at org.apache.maven.plugin.surefire.SurefireHelper.reportExecution (SurefireHelper.java:159)
[2019-06-22T11:55:06.952Z] at org.apache.maven.plugin.failsafe.VerifyMojo.execute (VerifyMojo.java:192)
[2019-06-22T11:55:06.952Z] at org.apache.maven.plugin.DefaultBuildPluginManager.executeMojo (DefaultBuildPluginManager.java:137)
[2019-06-22T11:55:06.952Z] at org.apache.maven.lifecycle.internal.MojoExecutor.execute (MojoExecutor.java:210)
[2019-06-22T11:55:06.952Z] at org.apache.maven.lifecycle.internal.MojoExecutor.execute (MojoExecutor.java:156)
[2019-06-22T11:55:06.952Z] at org.apache.maven.lifecycle.internal.MojoExecutor.execute (MojoExecutor.java:148)
[2019-06-22T11:55:06.952Z] at org.apache.maven.lifecycle.internal.LifecycleModuleBuilder.buildProject (LifecycleModuleBuilder.java:117)
[2019-06-22T11:55:06.952Z] at org.apache.maven.lifecycle.internal.LifecycleModuleBuilder.buildProject (LifecycleModuleBuilder.java:81)
[2019-06-22T11:55:06.952Z] at org.apache.maven.lifecycle.internal.builder.singlethreaded.SingleThreadedBuilder.build (SingleThreadedBuilder.java:56)
[2019-06-22T11:55:06.952Z] at org.apache.maven.lifecycle.internal.LifecycleStarter.execute (LifecycleStarter.java:128)
[2019-06-22T11:55:06.952Z] at org.apache.maven.DefaultMaven.doExecute (DefaultMaven.java:305)
[2019-06-22T11:55:06.952Z] at org.apache.maven.DefaultMaven.doExecute (DefaultMaven.java:192)
[2019-06-22T11:55:06.952Z] at org.apache.maven.DefaultMaven.execute (DefaultMaven.java:105)
[2019-06-22T11:55:06.952Z] at org.apache.maven.cli.MavenCli.execute (MavenCli.java:956)
[2019-06-22T11:55:06.952Z] at org.apache.maven.cli.MavenCli.doMain (MavenCli.java:288)
[2019-06-22T11:55:06.952Z] at org.apache.maven.cli.MavenCli.main (MavenCli.java:192)
[2019-06-22T11:55:06.952Z] at sun.reflect.NativeMethodAccessorImpl.invoke0 (Native Method)
[2019-06-22T11:55:06.952Z] at sun.reflect.NativeMethodAccessorImpl.invoke (NativeMethodAccessorImpl.java:62)
[2019-06-22T11:55:06.952Z] at sun.reflect.DelegatingMethodAccessorImpl.invoke (DelegatingMethodAccessorImpl.java:43)
[2019-06-22T11:55:06.953Z] at java.lang.reflect.Method.invoke (Method.java:498)
[2019-06-22T11:55:06.953Z] at org.codehaus.plexus.classworlds.launcher.Launcher.launchEnhanced (Launcher.java:289)
[2019-06-22T11:55:06.953Z] at org.codehaus.plexus.classworlds.launcher.Launcher.launch (Launcher.java:229)
[2019-06-22T11:55:06.953Z] at org.codehaus.plexus.classworlds.launcher.Launcher.mainWithExitCode (Launcher.java:415)
[2019-06-22T11:55:06.953Z] at org.codehaus.plexus.classworlds.launcher.Launcher.main (Launcher.java:356)
[2019-06-22T11:55:06.953Z] [ERROR]
[2019-06-22T11:55:06.953Z] [ERROR] Re-run Maven using the -X switch to enable full debug logging.
[2019-06-22T11:55:06.953Z] [ERROR]
[2019-06-22T11:55:06.953Z] [ERROR] For more information about the errors and possible solutions, please read the following articles:
[2019-06-22T11:55:06.953Z] [ERROR] [Help 1] http://cwiki.apache.org/confluence/display/MAVEN/MojoFailureException
[2019-06-22T11:55:06.953Z] [ERROR]
[2019-06-22T11:55:06.953Z] [ERROR] After correcting the problems, you can resume the build with the command
[2019-06-22T11:55:06.953Z] [ERROR] mvn <goals> -rf :surefire-its
[Pipeline] }
[Pipeline] // withEnv
[Pipeline] }
[Pipeline] // stage
[Pipeline] openTasks
[2019-06-22T11:55:07.535Z] [TASKS] Skipping publisher since build result is FAILURE
[Pipeline] jacoco
[Pipeline] junit
[2019-06-22T11:55:07.888Z] Recording test results
[Pipeline] fileExists
[Pipeline] zip
[2019-06-22T11:55:10.142Z] Writing zip file of /home/jenkins/jenkins-slave/workspace/en-box_maven-surefire_deployment@2/maven-failsafe-plugin/target/it to /home/jenkins/jenkins-slave/workspace/en-box_maven-surefire_deployment@2/maven-failsafe-plugin--linux-jdk12-maven3.6.x.zip
[2019-06-22T11:55:10.327Z] Zipped 78 entries.
[2019-06-22T11:55:10.328Z] Archiving /home/jenkins/jenkins-slave/workspace/en-box_maven-surefire_deployment@2/maven-failsafe-plugin--linux-jdk12-maven3.6.x.zip
[2019-06-22T11:55:10.328Z] [Fast Archiver] No prior successful build to compare, so performing full copy of artifacts
[Pipeline] fileExists
[Pipeline] zip
[2019-06-22T11:55:11.260Z] Writing zip file of /home/jenkins/jenkins-slave/workspace/en-box_maven-surefire_deployment@2/surefire-its/target to /home/jenkins/jenkins-slave/workspace/en-box_maven-surefire_deployment@2/surefire-its--linux-jdk12-maven3.6.x.zip
[2019-06-22T11:55:15.385Z] [INFO] Tests run: 2, Failures: 0, Errors: 0, Skipped: 0, Time elapsed: 21.573 s - in org.apache.maven.surefire.its.jiras.Surefire943ReportContentIT
[2019-06-22T11:55:15.385Z] [INFO] Running org.apache.maven.surefire.its.jiras.Surefire946KillMainProcessInReusableForkIT
[2019-06-22T11:55:19.050Z] Zipped 16485 entries.
[2019-06-22T11:55:19.050Z] Archiving /home/jenkins/jenkins-slave/workspace/en-box_maven-surefire_deployment@2/surefire-its--linux-jdk12-maven3.6.x.zip
[2019-06-22T11:55:19.050Z] [Fast Archiver] No prior successful build to compare, so performing full copy of artifacts
[Pipeline] archiveArtifacts
[2019-06-22T11:55:21.806Z] Archiving artifacts
[2019-06-22T11:55:21.965Z] [Fast Archiver] No prior successful build to compare, so performing full copy of artifacts
[Pipeline] cleanWs
[2019-06-22T11:55:24.348Z] [WS-CLEANUP] Deleting project workspace...
[2019-06-22T11:55:24.348Z] [WS-CLEANUP] Deferred wipeout is used...
[2019-06-22T11:55:24.663Z] [WS-CLEANUP] done
[Pipeline] }
[Pipeline] // ws
[Pipeline] }
[Pipeline] // timestamps
[Pipeline] }
[Pipeline] // node
[Pipeline] }
[2019-06-22T11:55:36.998Z] [INFO] Tests run: 3, Failures: 0, Errors: 0, Skipped: 0, Time elapsed: 21.288 s - in org.apache.maven.surefire.its.jiras.Surefire946KillMainProcessInReusableForkIT
[2019-06-22T11:55:36.998Z] [INFO] Running org.apache.maven.surefire.its.jiras.Surefire972BizarreNoClassDefIT
[2019-06-22T11:55:44.876Z] [INFO] Tests run: 1, Failures: 0, Errors: 0, Skipped: 0, Time elapsed: 6.792 s - in org.apache.maven.surefire.its.jiras.Surefire972BizarreNoClassDefIT
[2019-06-22T11:55:44.876Z] [INFO] Running org.apache.maven.surefire.its.jiras.Surefire975DefaultVMEncodingIT
[2019-06-22T11:55:49.329Z] [INFO] Tests run: 1, Failures: 0, Errors: 0, Skipped: 0, Time elapsed: 5.655 s - in org.apache.maven.surefire.its.jiras.Surefire975DefaultVMEncodingIT
[2019-06-22T11:55:49.329Z] [INFO] Running org.apache.maven.surefire.its.jiras.Surefire979WrongClassLoaderIT
[2019-06-22T11:55:54.587Z] [INFO] Tests run: 1, Failures: 0, Errors: 0, Skipped: 0, Time elapsed: 4.706 s - in org.apache.maven.surefire.its.jiras.Surefire979WrongClassLoaderIT
[2019-06-22T11:55:54.587Z] [INFO] Running org.apache.maven.surefire.its.jiras.Surefire985ParameterizedRunnerAndCategoriesIT
[2019-06-22T11:55:57.814Z] [INFO] Tests run: 1, Failures: 0, Errors: 0, Skipped: 0, Time elapsed: 3.931 s - in org.apache.maven.surefire.its.jiras.Surefire985ParameterizedRunnerAndCategoriesIT
[2019-06-22T11:55:57.814Z] [INFO] Running org.apache.maven.surefire.its.jiras.Surefire995CategoryInheritanceIT
[2019-06-22T11:56:19.145Z] [INFO] Tests run: 5, Failures: 0, Errors: 0, Skipped: 0, Time elapsed: 20.315 s - in org.apache.maven.surefire.its.jiras.Surefire995CategoryInheritanceIT
[2019-06-22T11:56:19.145Z] [INFO]
[2019-06-22T11:56:19.145Z] [INFO] Results:
[2019-06-22T11:56:19.145Z] [INFO]
[2019-06-22T11:56:19.145Z] [ERROR] Failures:
[2019-06-22T11:56:19.145Z] [ERROR] JUnitPlatformEnginesIT.platform:111
[2019-06-22T11:56:19.145Z] Expected: <[\[DEBUG\] test\(compact\) classpath: test-classes classes junit-jupiter-engine-5\.4\.0-SNAPSHOT\.jar apiguardian-api-1\.0\.0\.jar junit-platform-engine-1\.4\.0-SNAPSHOT\.jar junit-platform-commons-1\.4\.0-SNAPSHOT\.jar opentest4j-1\.1\.1\.jar junit-jupiter-api-5\.4\.0-SNAPSHOT\.jar]>
[2019-06-22T11:56:19.145Z] but: was <[[DEBUG] test(compact) classpath: test-classes classes junit-jupiter-engine-5.4.0-SNAPSHOT.jar apiguardian-api-1.0.0.jar junit-platform-engine-1.4.0-SNAPSHOT.jar opentest4j-1.1.1.jar junit-platform-commons-1.4.0-SNAPSHOT.jar junit-jupiter-api-5.4.0-SNAPSHOT.jar]>
[2019-06-22T11:56:19.145Z] [INFO]
[2019-06-22T11:56:19.145Z] [ERROR] Tests run: 788, Failures: 1, Errors: 0, Skipped: 134
[2019-06-22T11:56:19.145Z] [INFO]
[2019-06-22T11:56:19.145Z] [INFO]
[2019-06-22T11:56:19.145Z] [INFO] --- maven-checkstyle-plugin:3.0.0:check (checkstyle-check) @ surefire-its ---
[2019-06-22T11:56:19.145Z] [INFO]
[2019-06-22T11:56:19.145Z] [INFO] --- maven-failsafe-plugin:3.0.0-M3:verify (default) @ surefire-its ---
[2019-06-22T11:56:19.145Z] [INFO] Failsafe report directory: /home/jenkins/jenkins-slave/workspace/en-box_maven-surefire_deployment@3@2/surefire-its/target/failsafe-reports
[2019-06-22T11:56:19.145Z] [INFO] ------------------------------------------------------------------------
[2019-06-22T11:56:19.145Z] [INFO] Reactor Summary for Apache Maven Surefire 3.0.0-M4-SNAPSHOT:
[2019-06-22T11:56:19.145Z] [INFO]
[2019-06-22T11:56:19.145Z] [INFO] Apache Maven Surefire .............................. SUCCESS [ 15.956 s]
[2019-06-22T11:56:19.145Z] [INFO] SureFire Logger API ................................ SUCCESS [ 3.276 s]
[2019-06-22T11:56:19.145Z] [INFO] SureFire API ....................................... SUCCESS [ 8.347 s]
[2019-06-22T11:56:19.145Z] [INFO] SureFire Booter .................................... SUCCESS [ 10.224 s]
[2019-06-22T11:56:19.145Z] [INFO] Maven Surefire Test-Grouping Support ............... SUCCESS [ 4.578 s]
[2019-06-22T11:56:19.145Z] [INFO] SureFire Providers ................................. SUCCESS [ 0.828 s]
[2019-06-22T11:56:19.145Z] [INFO] Shared JUnit3 Provider Code ........................ SUCCESS [ 3.061 s]
[2019-06-22T11:56:19.145Z] [INFO] Shared Java 5 Provider Base ........................ SUCCESS [ 3.702 s]
[2019-06-22T11:56:19.145Z] [INFO] Shared JUnit4 Provider Code ........................ SUCCESS [ 3.819 s]
[2019-06-22T11:56:19.145Z] [INFO] Shared JUnit48 Provider Code ....................... SUCCESS [ 4.324 s]
[2019-06-22T11:56:19.145Z] [INFO] SureFire JUnit Runner .............................. SUCCESS [ 3.286 s]
[2019-06-22T11:56:19.145Z] [INFO] SureFire JUnit4 Runner ............................. SUCCESS [ 12.999 s]
[2019-06-22T11:56:19.145Z] [INFO] Maven Surefire Common .............................. SUCCESS [ 23.009 s]
[2019-06-22T11:56:19.145Z] [INFO] SureFire JUnitCore Runner .......................... SUCCESS [02:15 min]
[2019-06-22T11:56:19.145Z] [INFO] SureFire JUnit Platform Runner ..................... SUCCESS [ 7.606 s]
[2019-06-22T11:56:19.145Z] [INFO] SureFire TestNG Utils .............................. SUCCESS [ 3.471 s]
[2019-06-22T11:56:19.145Z] [INFO] SureFire TestNG Runner ............................. SUCCESS [ 3.914 s]
[2019-06-22T11:56:19.145Z] [INFO] ShadeFire JUnit3 Provider .......................... SUCCESS [ 1.262 s]
[2019-06-22T11:56:19.145Z] [INFO] Surefire Report Parser ............................. SUCCESS [ 4.667 s]
[2019-06-22T11:56:19.145Z] [INFO] Maven Surefire Plugin .............................. SUCCESS [ 8.078 s]
[2019-06-22T11:56:19.145Z] [INFO] Maven Failsafe Plugin .............................. SUCCESS [01:01 min]
[2019-06-22T11:56:19.145Z] [INFO] Maven Surefire Report Plugin ....................... SUCCESS [ 11.193 s]
[2019-06-22T11:56:19.145Z] [INFO] Maven Surefire Integration Tests ................... FAILURE [ 01:00 h]
[2019-06-22T11:56:19.145Z] [INFO] ------------------------------------------------------------------------
[2019-06-22T11:56:19.145Z] [INFO] BUILD FAILURE
[2019-06-22T11:56:19.145Z] [INFO] ------------------------------------------------------------------------
[2019-06-22T11:56:19.145Z] [INFO] Total time: 01:05 h
[2019-06-22T11:56:19.145Z] [INFO] Finished at: 2019-06-22T11:56:18Z
[2019-06-22T11:56:19.145Z] [INFO] ------------------------------------------------------------------------
[2019-06-22T11:56:19.145Z] [ERROR] Failed to execute goal org.apache.maven.plugins:maven-failsafe-plugin:3.0.0-M3:verify (default) on project surefire-its: There are test failures.
[2019-06-22T11:56:19.145Z] [ERROR]
[2019-06-22T11:56:19.145Z] [ERROR] Please refer to /home/jenkins/jenkins-slave/workspace/en-box_maven-surefire_deployment@3@2/surefire-its/target/failsafe-reports for the individual test results.
[2019-06-22T11:56:19.145Z] [ERROR] Please refer to dump files (if any exist) [date].dump, [date]-jvmRun[N].dump and [date].dumpstream.
[2019-06-22T11:56:19.145Z] [ERROR] -> [Help 1]
[2019-06-22T11:56:19.146Z] org.apache.maven.lifecycle.LifecycleExecutionException: Failed to execute goal org.apache.maven.plugins:maven-failsafe-plugin:3.0.0-M3:verify (default) on project surefire-its: There are test failures.
[2019-06-22T11:56:19.146Z]
[2019-06-22T11:56:19.146Z] Please refer to /home/jenkins/jenkins-slave/workspace/en-box_maven-surefire_deployment@3@2/surefire-its/target/failsafe-reports for the individual test results.
[2019-06-22T11:56:19.146Z] Please refer to dump files (if any exist) [date].dump, [date]-jvmRun[N].dump and [date].dumpstream.
[2019-06-22T11:56:19.146Z] at org.apache.maven.lifecycle.internal.MojoExecutor.execute (MojoExecutor.java:215)
[2019-06-22T11:56:19.146Z] at org.apache.maven.lifecycle.internal.MojoExecutor.execute (MojoExecutor.java:156)
[2019-06-22T11:56:19.146Z] at org.apache.maven.lifecycle.internal.MojoExecutor.execute (MojoExecutor.java:148)
[2019-06-22T11:56:19.146Z] at org.apache.maven.lifecycle.internal.LifecycleModuleBuilder.buildProject (LifecycleModuleBuilder.java:117)
[2019-06-22T11:56:19.146Z] at org.apache.maven.lifecycle.internal.LifecycleModuleBuilder.buildProject (LifecycleModuleBuilder.java:81)
[2019-06-22T11:56:19.146Z] at org.apache.maven.lifecycle.internal.builder.singlethreaded.SingleThreadedBuilder.build (SingleThreadedBuilder.java:56)
[2019-06-22T11:56:19.146Z] at org.apache.maven.lifecycle.internal.LifecycleStarter.execute (LifecycleStarter.java:128)
[2019-06-22T11:56:19.146Z] at org.apache.maven.DefaultMaven.doExecute (DefaultMaven.java:305)
[2019-06-22T11:56:19.146Z] at org.apache.maven.DefaultMaven.doExecute (DefaultMaven.java:192)
[2019-06-22T11:56:19.146Z] at org.apache.maven.DefaultMaven.execute (DefaultMaven.java:105)
[2019-06-22T11:56:19.146Z] at org.apache.maven.cli.MavenCli.execute (MavenCli.java:956)
[2019-06-22T11:56:19.146Z] at org.apache.maven.cli.MavenCli.doMain (MavenCli.java:288)
[2019-06-22T11:56:19.146Z] at org.apache.maven.cli.MavenCli.main (MavenCli.java:192)
[2019-06-22T11:56:19.146Z] at sun.reflect.NativeMethodAccessorImpl.invoke0 (Native Method)
[2019-06-22T11:56:19.146Z] at sun.reflect.NativeMethodAccessorImpl.invoke (NativeMethodAccessorImpl.java:62)
[2019-06-22T11:56:19.146Z] at sun.reflect.DelegatingMethodAccessorImpl.invoke (DelegatingMethodAccessorImpl.java:43)
[2019-06-22T11:56:19.146Z] at java.lang.reflect.Method.invoke (Method.java:498)
[2019-06-22T11:56:19.146Z] at org.codehaus.plexus.classworlds.launcher.Launcher.launchEnhanced (Launcher.java:289)
[2019-06-22T11:56:19.146Z] at org.codehaus.plexus.classworlds.launcher.Launcher.launch (Launcher.java:229)
[2019-06-22T11:56:19.146Z] at org.codehaus.plexus.classworlds.launcher.Launcher.mainWithExitCode (Launcher.java:415)
[2019-06-22T11:56:19.146Z] at org.codehaus.plexus.classworlds.launcher.Launcher.main (Launcher.java:356)
[2019-06-22T11:56:19.146Z] Caused by: org.apache.maven.plugin.MojoFailureException: There are test failures.
[2019-06-22T11:56:19.146Z]
[2019-06-22T11:56:19.146Z] Please refer to /home/jenkins/jenkins-slave/workspace/en-box_maven-surefire_deployment@3@2/surefire-its/target/failsafe-reports for the individual test results.
[2019-06-22T11:56:19.146Z] Please refer to dump files (if any exist) [date].dump, [date]-jvmRun[N].dump and [date].dumpstream.
[2019-06-22T11:56:19.146Z] at org.apache.maven.plugin.surefire.SurefireHelper.throwException (SurefireHelper.java:271)
[2019-06-22T11:56:19.146Z] at org.apache.maven.plugin.surefire.SurefireHelper.reportExecution (SurefireHelper.java:159)
[2019-06-22T11:56:19.146Z] at org.apache.maven.plugin.failsafe.VerifyMojo.execute (VerifyMojo.java:192)
[2019-06-22T11:56:19.146Z] at org.apache.maven.plugin.DefaultBuildPluginManager.executeMojo (DefaultBuildPluginManager.java:137)
[2019-06-22T11:56:19.146Z] at org.apache.maven.lifecycle.internal.MojoExecutor.execute (MojoExecutor.java:210)
[2019-06-22T11:56:19.146Z] at org.apache.maven.lifecycle.internal.MojoExecutor.execute (MojoExecutor.java:156)
[2019-06-22T11:56:19.146Z] at org.apache.maven.lifecycle.internal.MojoExecutor.execute (MojoExecutor.java:148)
[2019-06-22T11:56:19.146Z] at org.apache.maven.lifecycle.internal.LifecycleModuleBuilder.buildProject (LifecycleModuleBuilder.java:117)
[2019-06-22T11:56:19.146Z] at org.apache.maven.lifecycle.internal.LifecycleModuleBuilder.buildProject (LifecycleModuleBuilder.java:81)
[2019-06-22T11:56:19.146Z] at org.apache.maven.lifecycle.internal.builder.singlethreaded.SingleThreadedBuilder.build (SingleThreadedBuilder.java:56)
[2019-06-22T11:56:19.146Z] at org.apache.maven.lifecycle.internal.LifecycleStarter.execute (LifecycleStarter.java:128)
[2019-06-22T11:56:19.146Z] at org.apache.maven.DefaultMaven.doExecute (DefaultMaven.java:305)
[2019-06-22T11:56:19.146Z] at org.apache.maven.DefaultMaven.doExecute (DefaultMaven.java:192)
[2019-06-22T11:56:19.146Z] at org.apache.maven.DefaultMaven.execute (DefaultMaven.java:105)
[2019-06-22T11:56:19.146Z] at org.apache.maven.cli.MavenCli.execute (MavenCli.java:956)
[2019-06-22T11:56:19.146Z] at org.apache.maven.cli.MavenCli.doMain (MavenCli.java:288)
[2019-06-22T11:56:19.146Z] at org.apache.maven.cli.MavenCli.main (MavenCli.java:192)
[2019-06-22T11:56:19.146Z] at sun.reflect.NativeMethodAccessorImpl.invoke0 (Native Method)
[2019-06-22T11:56:19.146Z] at sun.reflect.NativeMethodAccessorImpl.invoke (NativeMethodAccessorImpl.java:62)
[2019-06-22T11:56:19.146Z] at sun.reflect.DelegatingMethodAccessorImpl.invoke (DelegatingMethodAccessorImpl.java:43)
[2019-06-22T11:56:19.146Z] at java.lang.reflect.Method.invoke (Method.java:498)
[2019-06-22T11:56:19.146Z] at org.codehaus.plexus.classworlds.launcher.Launcher.launchEnhanced (Launcher.java:289)
[2019-06-22T11:56:19.146Z] at org.codehaus.plexus.classworlds.launcher.Launcher.launch (Launcher.java:229)
[2019-06-22T11:56:19.146Z] at org.codehaus.plexus.classworlds.launcher.Launcher.mainWithExitCode (Launcher.java:415)
[2019-06-22T11:56:19.146Z] at org.codehaus.plexus.classworlds.launcher.Launcher.main (Launcher.java:356)
[2019-06-22T11:56:19.146Z] [ERROR]
[2019-06-22T11:56:19.146Z] [ERROR] Re-run Maven using the -X switch to enable full debug logging.
[2019-06-22T11:56:19.146Z] [ERROR]
[2019-06-22T11:56:19.146Z] [ERROR] For more information about the errors and possible solutions, please read the following articles:
[2019-06-22T11:56:19.146Z] [ERROR] [Help 1] http://cwiki.apache.org/confluence/display/MAVEN/MojoFailureException
[2019-06-22T11:56:19.146Z] [ERROR]
[2019-06-22T11:56:19.146Z] [ERROR] After correcting the problems, you can resume the build with the command
[2019-06-22T11:56:19.146Z] [ERROR] mvn <goals> -rf :surefire-its
[Pipeline] }
[Pipeline] // withEnv
[Pipeline] }
[Pipeline] // stage
[Pipeline] fileExists
[Pipeline] zip
[2019-06-22T11:56:20.189Z] Writing zip file of /home/jenkins/jenkins-slave/workspace/en-box_maven-surefire_deployment@3@2/maven-failsafe-plugin/target/it to /home/jenkins/jenkins-slave/workspace/en-box_maven-surefire_deployment@3@2/maven-failsafe-plugin--linux-jdk11-maven3.6.x.zip
[2019-06-22T11:56:20.372Z] Zipped 78 entries.
[2019-06-22T11:56:20.372Z] Archiving /home/jenkins/jenkins-slave/workspace/en-box_maven-surefire_deployment@3@2/maven-failsafe-plugin--linux-jdk11-maven3.6.x.zip
[2019-06-22T11:56:20.373Z] [Fast Archiver] No prior successful build to compare, so performing full copy of artifacts
[Pipeline] fileExists
[Pipeline] zip
[2019-06-22T11:56:21.325Z] Writing zip file of /home/jenkins/jenkins-slave/workspace/en-box_maven-surefire_deployment@3@2/surefire-its/target to /home/jenkins/jenkins-slave/workspace/en-box_maven-surefire_deployment@3@2/surefire-its--linux-jdk11-maven3.6.x.zip
[2019-06-22T11:56:29.347Z] Zipped 16493 entries.
[2019-06-22T11:56:29.347Z] Archiving /home/jenkins/jenkins-slave/workspace/en-box_maven-surefire_deployment@3@2/surefire-its--linux-jdk11-maven3.6.x.zip
[2019-06-22T11:56:29.348Z] [Fast Archiver] No prior successful build to compare, so performing full copy of artifacts
[Pipeline] archiveArtifacts
[2019-06-22T11:56:31.922Z] Archiving artifacts
[2019-06-22T11:56:32.083Z] [Fast Archiver] No prior successful build to compare, so performing full copy of artifacts
[Pipeline] cleanWs
[2019-06-22T11:56:34.472Z] [WS-CLEANUP] Deleting project workspace...
[2019-06-22T11:56:34.472Z] [WS-CLEANUP] Deferred wipeout is used...
[2019-06-22T11:56:34.782Z] [WS-CLEANUP] done
[Pipeline] }
[Pipeline] // ws
[Pipeline] }
[Pipeline] // timestamps
[Pipeline] }
[Pipeline] // node
[Pipeline] }
[Pipeline] // parallel
[Pipeline] echo
hudson.AbortException: hudson.AbortException: Error cloning remote repo 'origin'
[Pipeline] echo
Build result: FAILURE
[Pipeline] jiraIssueSelector
[Pipeline] emailext
Build failed in Jenkins: Maven TLP » maven-surefire » deployment #9
Posted by Apache Jenkins Server <je...@builds.apache.org>.
See https://builds.apache.org/job/maven-box/job/maven-surefire/job/deployment/9/
No changes.
1 tests failed.
FAILED: org.apache.maven.surefire.its.JUnitPlatformEnginesIT.platform[1.4.0-SNAPSHOT]
Error Message:
Expected: <[\[DEBUG\] test\(compact\) classpath: test-classes classes junit-jupiter-engine-5\.4\.0-SNAPSHOT\.jar apiguardian-api-1\.0\.0\.jar junit-platform-engine-1\.4\.0-SNAPSHOT\.jar junit-platform-commons-1\.4\.0-SNAPSHOT\.jar opentest4j-1\.1\.1\.jar junit-jupiter-api-5\.4\.0-SNAPSHOT\.jar]>
but: was <[[DEBUG] test(compact) classpath: test-classes classes junit-jupiter-engine-5.4.0-SNAPSHOT.jar apiguardian-api-1.0.0.jar junit-platform-engine-1.4.0-SNAPSHOT.jar opentest4j-1.1.1.jar junit-platform-commons-1.4.0-SNAPSHOT.jar junit-jupiter-api-5.4.0-SNAPSHOT.jar]>
Stack Trace:
java.lang.AssertionError:
Expected: <[\[DEBUG\] test\(compact\) classpath: test-classes classes junit-jupiter-engine-5\.4\.0-SNAPSHOT\.jar apiguardian-api-1\.0\.0\.jar junit-platform-engine-1\.4\.0-SNAPSHOT\.jar junit-platform-commons-1\.4\.0-SNAPSHOT\.jar opentest4j-1\.1\.1\.jar junit-jupiter-api-5\.4\.0-SNAPSHOT\.jar]>
but: was <[[DEBUG] test(compact) classpath: test-classes classes junit-jupiter-engine-5.4.0-SNAPSHOT.jar apiguardian-api-1.0.0.jar junit-platform-engine-1.4.0-SNAPSHOT.jar opentest4j-1.1.1.jar junit-platform-commons-1.4.0-SNAPSHOT.jar junit-jupiter-api-5.4.0-SNAPSHOT.jar]>
at org.apache.maven.surefire.its.JUnitPlatformEnginesIT.platform(JUnitPlatformEnginesIT.java:111)
Build log:
[...truncated 36802 lines...]
[2019-06-17T17:20:25.110Z] [INFO] Downloaded from central: https://repo.maven.apache.org/maven2/org/apache/maven/maven-model/2.0.4/maven-model-2.0.4.jar (80 kB at 2.0 MB/s)
[2019-06-17T17:20:25.110Z] [INFO] Downloading from central: https://repo.maven.apache.org/maven2/org/apache/maven/reporting/maven-reporting-impl/2.0.4/maven-reporting-impl-2.0.4.jar
[2019-06-17T17:20:25.110Z] [INFO] Downloaded from central: https://repo.maven.apache.org/maven2/org/apache/maven/reporting/maven-reporting-api/2.0.4/maven-reporting-api-2.0.4.jar (5.0 kB at 96 kB/s)
[2019-06-17T17:20:25.110Z] [INFO] Downloading from central: https://repo.maven.apache.org/maven2/org/apache/maven/doxia/doxia-core/1.0-alpha-7/doxia-core-1.0-alpha-7.jar
[2019-06-17T17:20:25.110Z] [INFO] Downloaded from central: https://repo.maven.apache.org/maven2/org/apache/maven/reporting/maven-reporting-impl/2.0.4/maven-reporting-impl-2.0.4.jar (14 kB at 244 kB/s)
[2019-06-17T17:20:25.110Z] [INFO] Downloading from central: https://repo.maven.apache.org/maven2/oro/oro/2.0.7/oro-2.0.7.jar
[2019-06-17T17:20:25.110Z] [INFO] Downloaded from central: https://repo.maven.apache.org/maven2/org/apache/maven/maven-artifact/2.0.4/maven-artifact-2.0.4.jar (80 kB at 1.4 MB/s)
[2019-06-17T17:20:25.110Z] [INFO] Downloading from central: https://repo.maven.apache.org/maven2/org/apache/maven/doxia/doxia-sink-api/1.0-alpha-9/doxia-sink-api-1.0-alpha-9.jar
[2019-06-17T17:20:25.285Z] [INFO] Downloaded from central: https://repo.maven.apache.org/maven2/xerces/xercesImpl/2.9.1/xercesImpl-2.9.1.jar (1.2 MB at 1.8 MB/s)
[2019-06-17T17:20:25.411Z] [INFO] Downloaded from central: https://repo.maven.apache.org/maven2/org/apache/maven/doxia/doxia-sink-api/1.0-alpha-9/doxia-sink-api-1.0-alpha-9.jar (9.9 kB at 140 kB/s)
[2019-06-17T17:20:25.411Z] [INFO] Downloading from central: https://repo.maven.apache.org/maven2/org/apache/maven/doxia/doxia-site-renderer/1.0-alpha-7/doxia-site-renderer-1.0-alpha-7.jar
[2019-06-17T17:20:25.411Z] [INFO] Downloaded from central: https://repo.maven.apache.org/maven2/net/java/dev/javacc/javacc/5.0/javacc-5.0.jar (299 kB at 4.0 MB/s)
[2019-06-17T17:20:25.411Z] [INFO] Downloading from central: https://repo.maven.apache.org/maven2/org/codehaus/plexus/plexus-i18n/1.0-beta-6/plexus-i18n-1.0-beta-6.jar
[2019-06-17T17:20:25.411Z] [INFO] Downloaded from central: https://repo.maven.apache.org/maven2/org/codehaus/plexus/plexus-i18n/1.0-beta-6/plexus-i18n-1.0-beta-6.jar (12 kB at 143 kB/s)
[2019-06-17T17:20:25.411Z] [INFO] Downloaded from central: https://repo.maven.apache.org/maven2/org/apache/maven/doxia/doxia-site-renderer/1.0-alpha-7/doxia-site-renderer-1.0-alpha-7.jar (13 kB at 151 kB/s)
[2019-06-17T17:20:25.411Z] [INFO] Downloading from central: https://repo.maven.apache.org/maven2/org/codehaus/plexus/plexus-velocity/1.1.2/plexus-velocity-1.1.2.jar
[2019-06-17T17:20:25.411Z] [INFO] Downloading from central: https://repo.maven.apache.org/maven2/commons-collections/commons-collections/2.0/commons-collections-2.0.jar
[2019-06-17T17:20:25.411Z] [INFO] Downloaded from central: https://repo.maven.apache.org/maven2/oro/oro/2.0.7/oro-2.0.7.jar (65 kB at 752 kB/s)
[2019-06-17T17:20:25.411Z] [INFO] Downloading from central: https://repo.maven.apache.org/maven2/commons-logging/commons-logging-api/1.0.4/commons-logging-api-1.0.4.jar
[2019-06-17T17:20:25.411Z] [INFO] Downloaded from central: https://repo.maven.apache.org/maven2/edu/ucla/cs/compilers/jtb/1.3.2/jtb-1.3.2.jar (337 kB at 3.8 MB/s)
[2019-06-17T17:20:25.411Z] [INFO] Downloading from central: https://repo.maven.apache.org/maven2/velocity/velocity/1.4/velocity-1.4.jar
[2019-06-17T17:20:25.411Z] [INFO] Downloaded from central: https://repo.maven.apache.org/maven2/org/codehaus/plexus/plexus-velocity/1.1.2/plexus-velocity-1.1.2.jar (8.0 kB at 83 kB/s)
[2019-06-17T17:20:25.411Z] [INFO] Downloading from central: https://repo.maven.apache.org/maven2/velocity/velocity-dep/1.4/velocity-dep-1.4.jar
[2019-06-17T17:20:25.411Z] [INFO] Downloaded from central: https://repo.maven.apache.org/maven2/commons-logging/commons-logging-api/1.0.4/commons-logging-api-1.0.4.jar (26 kB at 262 kB/s)
[2019-06-17T17:20:25.411Z] [INFO] Downloading from central: https://repo.maven.apache.org/maven2/org/apache/maven/doxia/doxia-decoration-model/1.0-alpha-7/doxia-decoration-model-1.0-alpha-7.jar
[2019-06-17T17:20:25.411Z] [INFO] Downloaded from central: https://repo.maven.apache.org/maven2/commons-collections/commons-collections/2.0/commons-collections-2.0.jar (91 kB at 879 kB/s)
[2019-06-17T17:20:25.411Z] [INFO] Downloaded from central: https://repo.maven.apache.org/maven2/org/apache/maven/doxia/doxia-decoration-model/1.0-alpha-7/doxia-decoration-model-1.0-alpha-7.jar (38 kB at 341 kB/s)
[2019-06-17T17:20:25.411Z] [INFO] Downloaded from central: https://repo.maven.apache.org/maven2/velocity/velocity/1.4/velocity-1.4.jar (361 kB at 2.6 MB/s)
[2019-06-17T17:20:25.411Z] [INFO] Downloaded from central: https://repo.maven.apache.org/maven2/velocity/velocity-dep/1.4/velocity-dep-1.4.jar (518 kB at 1.8 MB/s)
[2019-06-17T17:20:25.704Z] [INFO] Downloaded from central: https://repo.maven.apache.org/maven2/org/apache/maven/doxia/doxia-core/1.0-alpha-7/doxia-core-1.0-alpha-7.jar (231 kB at 420 kB/s)
[2019-06-17T17:20:25.999Z] Java Compiler Compiler Version 5.0 (Parser Generator)
[2019-06-17T17:20:25.999Z] (type "javacc" with no arguments for help)
[2019-06-17T17:20:25.999Z] Reading from file C:\Users\jenkins\AppData\Local\Temp\2\jenkins-maven-box-maven-surefire-deployment-9\surefire-grouper\src\main\javacc\category-expression.jj . . .
[2019-06-17T17:20:25.999Z] Warning: Choice conflict involving two expansions at
[2019-06-17T17:20:25.999Z] line 105, column 3 and line 106, column 3 respectively.
[2019-06-17T17:20:25.999Z] A common prefix is: "NOT"
[2019-06-17T17:20:25.999Z] Consider using a lookahead of 2 for earlier expansion.
[2019-06-17T17:20:25.999Z] Warning: Choice conflict in [...] construct at line 118, column 16.
[2019-06-17T17:20:25.999Z] Expansion nested within construct and expansion following construct
[2019-06-17T17:20:25.999Z] have common prefixes, one of which is: <AND>
[2019-06-17T17:20:25.999Z] Consider using a lookahead of 2 or more for nested expansion.
[2019-06-17T17:20:26.248Z] [INFO]
[2019-06-17T17:20:26.248Z] [INFO] --- maven-surefire-plugin:3.0.0-M3:test (default-test) @ common-junit4 ---
[2019-06-17T17:20:26.248Z] [INFO] Surefire report directory: C:\Users\jenkins\AppData\Local\Temp\2\jenkins-maven-box-maven-surefire-deployment-9\surefire-providers\common-junit4\target\surefire-reports
[2019-06-17T17:20:26.248Z] [INFO] Using configured provider org.apache.maven.shadefire.surefire.junit.JUnit3Provider
[2019-06-17T17:20:26.248Z] [INFO] parallel='none', perCoreThreadCount=true, threadCount=0, useUnlimitedThreads=false, threadCountSuites=0, threadCountClasses=0, threadCountMethods=0, parallelOptimized=true
[2019-06-17T17:20:26.294Z] Warning: ".class" cannot be matched as a string literal token at line 87, column 3. It will be matched as <STRING>.
[2019-06-17T17:20:26.294Z] File "TokenMgrError.java" does not exist. Will create one.
[2019-06-17T17:20:26.294Z] File "ParseException.java" does not exist. Will create one.
[2019-06-17T17:20:26.294Z] File "Token.java" does not exist. Will create one.
[2019-06-17T17:20:26.294Z] File "SimpleCharStream.java" does not exist. Will create one.
[2019-06-17T17:20:26.294Z] Parser generated with 0 errors and 3 warnings.
[2019-06-17T17:20:26.294Z] [INFO] Processed 1 grammar
[2019-06-17T17:20:26.294Z] [INFO]
[2019-06-17T17:20:26.294Z] [INFO] --- maven-compiler-plugin:3.7.0:compile (compile-generated) @ surefire-grouper ---
[2019-06-17T17:20:26.294Z] [INFO] Nothing to compile - all classes are up to date
[2019-06-17T17:20:26.294Z] [INFO]
[2019-06-17T17:20:26.294Z] [INFO] --- maven-remote-resources-plugin:1.5:process (process-resource-bundles) @ surefire-grouper ---
[2019-06-17T17:20:26.294Z] [INFO]
[2019-06-17T17:20:26.294Z] [INFO] --- maven-resources-plugin:3.1.0:resources (default-resources) @ surefire-grouper ---
[2019-06-17T17:20:26.294Z] [INFO] Using 'UTF-8' encoding to copy filtered resources.
[2019-06-17T17:20:26.294Z] [INFO] skip non existing resourceDirectory C:\Users\jenkins\AppData\Local\Temp\2\jenkins-maven-box-maven-surefire-deployment-9\surefire-grouper\src\main\resources
[2019-06-17T17:20:26.295Z] [INFO] Copying 3 resources
[2019-06-17T17:20:26.295Z] [INFO]
[2019-06-17T17:20:26.295Z] [INFO] --- maven-compiler-plugin:3.7.0:compile (default-compile) @ surefire-grouper ---
[2019-06-17T17:20:26.295Z] [INFO] Changes detected - recompiling the module!
[2019-06-17T17:20:26.295Z] [INFO] Compiling 13 source files to C:\Users\jenkins\AppData\Local\Temp\2\jenkins-maven-box-maven-surefire-deployment-9\surefire-grouper\target\classes
[2019-06-17T17:20:26.541Z] [INFO]
[2019-06-17T17:20:26.541Z] [INFO] -------------------------------------------------------
[2019-06-17T17:20:26.541Z] [INFO] T E S T S
[2019-06-17T17:20:26.541Z] [INFO] -------------------------------------------------------
[2019-06-17T17:20:26.569Z] Sending interrupt signal to process
[2019-06-17T17:20:26.762Z] Sending interrupt signal to process
[2019-06-17T17:20:26.934Z] Destroying 1 processes
[2019-06-17T17:20:26.934Z] Destroying process..
[2019-06-17T17:20:26.934Z] Destroyed 1 processes
[2019-06-17T17:20:26.980Z] script returned exit code -1
[2019-06-17T17:20:27.224Z] [INFO] Running org.apache.maven.surefire.common.junit4.JUnit4ProviderUtilTest
[2019-06-17T17:20:27.224Z] [INFO] Tests run: 4, Failures: 0, Errors: 0, Skipped: 0, Time elapsed: 0.054 s - in org.apache.maven.surefire.common.junit4.JUnit4ProviderUtilTest
[2019-06-17T17:20:27.224Z] [INFO] Running org.apache.maven.surefire.common.junit4.JUnit4Reflector40Test
[2019-06-17T17:20:27.224Z] [INFO] Tests run: 4, Failures: 0, Errors: 0, Skipped: 0, Time elapsed: 0 s - in org.apache.maven.surefire.common.junit4.JUnit4Reflector40Test
[2019-06-17T17:20:27.224Z] [INFO] Running org.apache.maven.surefire.common.junit4.JUnit4RunListenerTest
[2019-06-17T17:20:27.224Z] [INFO] Tests run: 2, Failures: 0, Errors: 0, Skipped: 0, Time elapsed: 0.041 s - in org.apache.maven.surefire.common.junit4.JUnit4RunListenerTest
[2019-06-17T17:20:27.224Z] [INFO] Running org.apache.maven.surefire.junit4.JUnit4TestCheckerTest
[2019-06-17T17:20:27.224Z] [INFO] Tests run: 12, Failures: 0, Errors: 0, Skipped: 0, Time elapsed: 0.006 s - in org.apache.maven.surefire.junit4.JUnit4TestCheckerTest
[2019-06-17T17:20:27.251Z] Terminate batch job (Y/N)?
[2019-06-17T17:20:27.284Z] script returned exit code 1
[2019-06-17T17:20:27.540Z] [INFO]
[2019-06-17T17:20:27.540Z] [INFO] Results:
[2019-06-17T17:20:27.540Z] [INFO]
[2019-06-17T17:20:27.540Z] [INFO] Tests run: 22, Failures: 0, Errors: 0, Skipped: 0
[2019-06-17T17:20:27.540Z] [INFO]
[2019-06-17T17:20:27.540Z] [INFO]
[2019-06-17T17:20:27.540Z] [INFO] --- maven-jar-plugin:3.1.0:jar (default-jar) @ common-junit4 ---
[2019-06-17T17:20:27.540Z] [INFO] Building jar: C:\Users\jenkins\AppData\Local\Temp\2\jenkins-maven-box-maven-surefire-deployment-9\surefire-providers\common-junit4\target\common-junit4-3.0.0-M4-SNAPSHOT.jar
[2019-06-17T17:20:28.073Z] [INFO]
[2019-06-17T17:20:28.073Z] [INFO] --- maven-site-plugin:3.7.1:attach-descriptor (attach-descriptor) @ common-junit4 ---
[2019-06-17T17:20:28.073Z] [INFO] Skipping because packaging 'jar' is not pom.
[2019-06-17T17:20:28.073Z] [INFO]
[2019-06-17T17:20:28.073Z] [INFO] --- maven-checkstyle-plugin:3.0.0:check (checkstyle-check) @ common-junit4 ---
[2019-06-17T17:20:28.104Z] Sending interrupt signal to process
[2019-06-17T17:20:28.394Z] Terminate batch job (Y/N)?
[2019-06-17T17:20:28.424Z] script returned exit code 1
[2019-06-17T17:20:28.567Z] Sending interrupt signal to process
Click here to forcibly terminate running steps
[2019-06-17T17:20:48.567Z] After 20s process did not stop
[2019-06-17T17:20:49.005Z] java.nio.file.FileSystemException: C:\Users\jenkins\AppData\Local\Temp\2\jenkins-maven-box-maven-surefire-deployment-9@tmp\durable-a7dc3c49\jenkins-log.txt: The process cannot access the file because it is being used by another process.
[2019-06-17T17:20:49.005Z]
[2019-06-17T17:20:49.005Z] at sun.nio.fs.WindowsException.translateToIOException(Unknown Source)
[2019-06-17T17:20:49.005Z] at sun.nio.fs.WindowsException.rethrowAsIOException(Unknown Source)
[2019-06-17T17:20:49.005Z] at sun.nio.fs.WindowsException.rethrowAsIOException(Unknown Source)
[2019-06-17T17:20:49.005Z] at sun.nio.fs.WindowsFileSystemProvider.implDelete(Unknown Source)
[2019-06-17T17:20:49.005Z] at sun.nio.fs.AbstractFileSystemProvider.deleteIfExists(Unknown Source)
[2019-06-17T17:20:49.005Z] at java.nio.file.Files.deleteIfExists(Unknown Source)
[2019-06-17T17:20:49.005Z] at hudson.Util.tryOnceDeleteFile(Util.java:316)
[2019-06-17T17:20:49.005Z] at hudson.Util.deleteFile(Util.java:272)
[2019-06-17T17:20:49.005Z] Also: hudson.remoting.Channel$CallSiteStackTrace: Remote call to JNLP4-connect connection from 37.48.69.226/37.48.69.226:58797
[2019-06-17T17:20:49.005Z] at hudson.remoting.Channel.attachCallSiteStackTrace(Channel.java:1741)
[2019-06-17T17:20:49.005Z] at hudson.remoting.UserRequest$ExceptionResponse.retrieve(UserRequest.java:357)
[2019-06-17T17:20:49.005Z] at hudson.remoting.Channel.call(Channel.java:955)
[2019-06-17T17:20:49.005Z] at hudson.FilePath.act(FilePath.java:1072)
[2019-06-17T17:20:49.005Z] at hudson.FilePath.act(FilePath.java:1061)
[2019-06-17T17:20:49.005Z] at hudson.FilePath.deleteRecursive(FilePath.java:1268)
[2019-06-17T17:20:49.005Z] at org.jenkinsci.plugins.durabletask.FileMonitoringTask$FileMonitoringController.cleanup(FileMonitoringTask.java:349)
[2019-06-17T17:20:49.005Z] at org.jenkinsci.plugins.workflow.steps.durable_task.DurableTaskStep$Execution$1.run(DurableTaskStep.java:409)
[2019-06-17T17:20:49.005Z] at jenkins.security.ImpersonatingScheduledExecutorService$1.run(ImpersonatingScheduledExecutorService.java:58)
[2019-06-17T17:20:49.005Z] at java.util.concurrent.Executors$RunnableAdapter.call(Executors.java:511)
[2019-06-17T17:20:49.005Z] at java.util.concurrent.FutureTask.run(FutureTask.java:266)
[2019-06-17T17:20:49.005Z] at java.util.concurrent.ScheduledThreadPoolExecutor$ScheduledFutureTask.access$201(ScheduledThreadPoolExecutor.java:180)
[2019-06-17T17:20:49.005Z] at java.util.concurrent.ScheduledThreadPoolExecutor$ScheduledFutureTask.run(ScheduledThreadPoolExecutor.java:293)
[2019-06-17T17:20:49.005Z] at java.util.concurrent.ThreadPoolExecutor.runWorker(ThreadPoolExecutor.java:1149)
[2019-06-17T17:20:49.005Z] at java.util.concurrent.ThreadPoolExecutor$Worker.run(ThreadPoolExecutor.java:624)
[2019-06-17T17:20:49.005Z] at java.lang.Thread.run(Thread.java:748)
[2019-06-17T17:20:49.005Z] Caused: java.io.IOException: Unable to delete 'C:\Users\jenkins\AppData\Local\Temp\2\jenkins-maven-box-maven-surefire-deployment-9@tmp\durable-a7dc3c49\jenkins-log.txt'. Tried 3 times (of a maximum of 3) waiting 0.1 sec between attempts.
[2019-06-17T17:20:49.005Z] at hudson.Util.deleteFile(Util.java:277)
[2019-06-17T17:20:49.005Z] at hudson.FilePath.deleteRecursive(FilePath.java:1305)
[2019-06-17T17:20:49.005Z] at hudson.FilePath.deleteContentsRecursive(FilePath.java:1314)
[2019-06-17T17:20:49.005Z] at hudson.FilePath.deleteRecursive(FilePath.java:1296)
[2019-06-17T17:20:49.005Z] at hudson.FilePath.access$1600(FilePath.java:213)
[2019-06-17T17:20:49.005Z] at hudson.FilePath$DeleteRecursive.invoke(FilePath.java:1274)
[2019-06-17T17:20:49.005Z] at hudson.FilePath$DeleteRecursive.invoke(FilePath.java:1270)
[2019-06-17T17:20:49.005Z] at hudson.FilePath$FileCallableWrapper.call(FilePath.java:3086)
[2019-06-17T17:20:49.005Z] at hudson.remoting.UserRequest.perform(UserRequest.java:212)
[2019-06-17T17:20:49.005Z] at hudson.remoting.UserRequest.perform(UserRequest.java:54)
[2019-06-17T17:20:49.005Z] at hudson.remoting.Request$2.run(Request.java:369)
[2019-06-17T17:20:49.006Z] at hudson.remoting.InterceptingExecutorService$1.call(InterceptingExecutorService.java:72)
[2019-06-17T17:20:49.006Z] at java.util.concurrent.FutureTask.run(Unknown Source)
[2019-06-17T17:20:49.006Z] at java.util.concurrent.ThreadPoolExecutor.runWorker(Unknown Source)
[2019-06-17T17:20:49.006Z] at java.util.concurrent.ThreadPoolExecutor$Worker.run(Unknown Source)
[2019-06-17T17:20:49.006Z] at hudson.remoting.Engine$1.lambda$newThread$0(Engine.java:93)
[2019-06-17T17:20:49.006Z] at java.lang.Thread.run(Unknown Source)
[Pipeline] }
[Pipeline] }
[Pipeline] }
[Pipeline] }
[Pipeline] // withEnv
[Pipeline] // withEnv
[Pipeline] // withEnv
[Pipeline] // withEnv
[Pipeline] }
[Pipeline] }
[Pipeline] }
[Pipeline] }
[Pipeline] // stage
[Pipeline] // stage
[Pipeline] // stage
[Pipeline] // stage
[Pipeline] fileExists
[Pipeline] fileExists
[Pipeline] fileExists
[Pipeline] fileExists
[Pipeline] zip
[Pipeline] fileExists
[Pipeline] fileExists
[Pipeline] archiveArtifacts
[2019-06-17T17:20:59.089Z] Writing zip file of C:\Users\jenkins\AppData\Local\Temp\2\jenkins-maven-box-maven-surefire-deployment-9\maven-failsafe-plugin\target\it to C:\Users\jenkins\AppData\Local\Temp\2\jenkins-maven-box-maven-surefire-deployment-9\maven-failsafe-plugin--windows-jdk12-maven3.6.x.zip
[2019-06-17T17:20:59.099Z] Archiving artifacts
[Pipeline] archiveArtifacts
[2019-06-17T17:20:59.121Z] Archiving artifacts
[Pipeline] fileExists
[Pipeline] cleanWs
[Pipeline] archiveArtifacts
[2019-06-17T17:20:59.182Z] [WS-CLEANUP] Deleting project workspace...
[2019-06-17T17:20:59.182Z] [WS-CLEANUP] Deferred wipeout is used...
[Pipeline] cleanWs
[2019-06-17T17:20:59.195Z] Archiving artifacts
[2019-06-17T17:20:59.214Z] Zipped 79 entries.
[2019-06-17T17:20:59.214Z] Archiving C:\Users\jenkins\AppData\Local\Temp\2\jenkins-maven-box-maven-surefire-deployment-9\maven-failsafe-plugin--windows-jdk12-maven3.6.x.zip
[2019-06-17T17:20:59.215Z] [Fast Archiver] No prior successful build to compare, so performing full copy of artifacts
[2019-06-17T17:20:59.223Z] [WS-CLEANUP] Deleting project workspace...
[2019-06-17T17:20:59.223Z] [WS-CLEANUP] Deferred wipeout is used...
[2019-06-17T17:20:59.234Z] [WS-CLEANUP] done
[Pipeline] cleanWs
[Pipeline] fileExists
[Pipeline] }
[2019-06-17T17:20:59.267Z] [WS-CLEANUP] done
[2019-06-17T17:20:59.277Z] [WS-CLEANUP] Deleting project workspace...
[2019-06-17T17:20:59.277Z] [WS-CLEANUP] Deferred wipeout is used...
[Pipeline] // ws
[Pipeline] zip
[Pipeline] }
[Pipeline] }
[2019-06-17T17:20:59.332Z] [WS-CLEANUP] done
[Pipeline] // timestamps
[2019-06-17T17:20:59.348Z] Writing zip file of C:\Users\jenkins\AppData\Local\Temp\2\jenkins-maven-box-maven-surefire-deployment-9\surefire-its\target to C:\Users\jenkins\AppData\Local\Temp\2\jenkins-maven-box-maven-surefire-deployment-9\surefire-its--windows-jdk12-maven3.6.x.zip
[Pipeline] // ws
[Pipeline] }
[Pipeline] }
[Pipeline] }
[Pipeline] // ws
[Pipeline] // node
[Pipeline] // timestamps
[Pipeline] }
Failed in branch windows-jdk8-maven3.6.x
[Pipeline] }
[Pipeline] }
[Pipeline] // timestamps
[Pipeline] // node
[Pipeline] }
Failed in branch windows-jdk7-maven3.6.x
[Pipeline] }
[Pipeline] // node
[Pipeline] }
Failed in branch windows-jdk11-maven3.6.x
[2019-06-17T17:21:09.121Z] Zipped 10030 entries.
[2019-06-17T17:21:09.121Z] Archiving C:\Users\jenkins\AppData\Local\Temp\2\jenkins-maven-box-maven-surefire-deployment-9\surefire-its--windows-jdk12-maven3.6.x.zip
[2019-06-17T17:21:09.122Z] [Fast Archiver] No prior successful build to compare, so performing full copy of artifacts
[Pipeline] archiveArtifacts
[2019-06-17T17:21:09.878Z] Archiving artifacts
[2019-06-17T17:21:09.898Z] [Fast Archiver] No prior successful build to compare, so performing full copy of artifacts
[Pipeline] cleanWs
[2019-06-17T17:21:10.758Z] [WS-CLEANUP] Deleting project workspace...
[2019-06-17T17:21:10.758Z] [WS-CLEANUP] Deferred wipeout is used...
[2019-06-17T17:21:11.237Z] ERROR: Cannot delete workspace :Unable to delete 'C:\Users\jenkins\AppData\Local\Temp\2\jenkins-maven-box-maven-surefire-deployment-9\.m2\antlr\antlr\2.7.2\antlr-2.7.2.jar'. Tried 3 times (of a maximum of 3) waiting 0.1 sec between attempts.
[Pipeline] }
[Pipeline] // ws
[Pipeline] }
[Pipeline] // timestamps
[Pipeline] }
[Pipeline] // node
[Pipeline] }
Failed in branch windows-jdk12-maven3.6.x
[Pipeline] // parallel
[Pipeline] echo
org.jenkinsci.plugins.workflow.steps.FlowInterruptedException: org.jenkinsci.plugins.workflow.steps.FlowInterruptedException
[Pipeline] echo
Build result: FAILURE
[Pipeline] jiraIssueSelector
[Pipeline] emailext
Build failed in Jenkins: Maven TLP » maven-surefire » deployment #8
Posted by Apache Jenkins Server <je...@builds.apache.org>.
See https://builds.apache.org/job/maven-box/job/maven-surefire/job/deployment/8/
No changes.
1 tests failed.
FAILED: org.apache.maven.surefire.its.JUnitPlatformEnginesIT.platform[1.4.0-SNAPSHOT]
Error Message:
Expected: <[\[DEBUG\] test\(compact\) classpath: test-classes classes junit-jupiter-engine-5\.4\.0-SNAPSHOT\.jar apiguardian-api-1\.0\.0\.jar junit-platform-engine-1\.4\.0-SNAPSHOT\.jar junit-platform-commons-1\.4\.0-SNAPSHOT\.jar opentest4j-1\.1\.1\.jar junit-jupiter-api-5\.4\.0-SNAPSHOT\.jar]>
but: was <[[DEBUG] test(compact) classpath: test-classes classes junit-jupiter-engine-5.4.0-SNAPSHOT.jar apiguardian-api-1.0.0.jar junit-platform-engine-1.4.0-SNAPSHOT.jar opentest4j-1.1.1.jar junit-platform-commons-1.4.0-SNAPSHOT.jar junit-jupiter-api-5.4.0-SNAPSHOT.jar]>
Stack Trace:
java.lang.AssertionError:
Expected: <[\[DEBUG\] test\(compact\) classpath: test-classes classes junit-jupiter-engine-5\.4\.0-SNAPSHOT\.jar apiguardian-api-1\.0\.0\.jar junit-platform-engine-1\.4\.0-SNAPSHOT\.jar junit-platform-commons-1\.4\.0-SNAPSHOT\.jar opentest4j-1\.1\.1\.jar junit-jupiter-api-5\.4\.0-SNAPSHOT\.jar]>
but: was <[[DEBUG] test(compact) classpath: test-classes classes junit-jupiter-engine-5.4.0-SNAPSHOT.jar apiguardian-api-1.0.0.jar junit-platform-engine-1.4.0-SNAPSHOT.jar opentest4j-1.1.1.jar junit-platform-commons-1.4.0-SNAPSHOT.jar junit-jupiter-api-5.4.0-SNAPSHOT.jar]>
at org.apache.maven.surefire.its.JUnitPlatformEnginesIT.platform(JUnitPlatformEnginesIT.java:111)
Build log:
[...truncated 47117 lines...]
[2019-06-14T13:31:27.055Z] [INFO] Tests run: 3, Failures: 0, Errors: 0, Skipped: 0, Time elapsed: 35.002 s - in org.apache.maven.surefire.its.jiras.Surefire1082ParallelJUnitParameterizedIT
[2019-06-14T13:31:27.055Z] [INFO] Running org.apache.maven.surefire.its.jiras.Surefire1098BalancedRunOrderIT
[2019-06-14T13:32:01.632Z] [INFO] Tests run: 1, Failures: 0, Errors: 0, Skipped: 0, Time elapsed: 33.032 s - in org.apache.maven.surefire.its.jiras.Surefire1098BalancedRunOrderIT
[2019-06-14T13:32:01.632Z] [INFO] Running org.apache.maven.surefire.its.jiras.Surefire1122ParallelAndFlakyTestsIT
[2019-06-14T13:32:29.800Z] [INFO] Tests run: 3, Failures: 0, Errors: 0, Skipped: 0, Time elapsed: 28.105 s - in org.apache.maven.surefire.its.jiras.Surefire1122ParallelAndFlakyTestsIT
[2019-06-14T13:32:29.800Z] [INFO] Running org.apache.maven.surefire.its.jiras.Surefire1135ImproveIgnoreMessageForTestNGIT
[2019-06-14T13:32:49.051Z] [INFO] Tests run: 2, Failures: 0, Errors: 0, Skipped: 0, Time elapsed: 20.702 s - in org.apache.maven.surefire.its.jiras.Surefire1135ImproveIgnoreMessageForTestNGIT
[2019-06-14T13:32:49.051Z] [INFO] Running org.apache.maven.surefire.its.jiras.Surefire1136CwdPropagationInForkedModeIT
[2019-06-14T13:32:58.278Z] [INFO] Tests run: 1, Failures: 0, Errors: 0, Skipped: 0, Time elapsed: 8.802 s - in org.apache.maven.surefire.its.jiras.Surefire1136CwdPropagationInForkedModeIT
[2019-06-14T13:32:58.278Z] [INFO] Running org.apache.maven.surefire.its.jiras.Surefire1144XmlRunTimeIT
[2019-06-14T13:33:07.375Z] [INFO] Tests run: 1, Failures: 0, Errors: 0, Skipped: 0, Time elapsed: 9.152 s - in org.apache.maven.surefire.its.jiras.Surefire1144XmlRunTimeIT
[2019-06-14T13:33:07.375Z] [INFO] Running org.apache.maven.surefire.its.jiras.Surefire1152RerunFailingTestsInSuiteIT
[2019-06-14T13:33:30.637Z] [INFO] Tests run: 2, Failures: 0, Errors: 0, Skipped: 0, Time elapsed: 20.712 s - in org.apache.maven.surefire.its.jiras.Surefire1152RerunFailingTestsInSuiteIT
[2019-06-14T13:33:30.637Z] [INFO] Running org.apache.maven.surefire.its.jiras.Surefire1153IncludesAndSpecifiedTestIT
[2019-06-14T13:33:41.291Z] [INFO] Tests run: 2, Failures: 0, Errors: 0, Skipped: 0, Time elapsed: 13.781 s - in org.apache.maven.surefire.its.jiras.Surefire1153IncludesAndSpecifiedTestIT
[2019-06-14T13:33:41.291Z] [INFO] Running org.apache.maven.surefire.its.jiras.Surefire1158RemoveInfoLinesIT
[2019-06-14T13:34:39.595Z] [INFO] Tests run: 6, Failures: 0, Errors: 0, Skipped: 0, Time elapsed: 53.391 s - in org.apache.maven.surefire.its.jiras.Surefire1158RemoveInfoLinesIT
[2019-06-14T13:34:39.595Z] [INFO] Running org.apache.maven.surefire.its.jiras.Surefire1177TestngParallelSuitesIT
[2019-06-14T13:34:58.915Z] [INFO] Tests run: 2, Failures: 0, Errors: 0, Skipped: 0, Time elapsed: 21.728 s - in org.apache.maven.surefire.its.jiras.Surefire1177TestngParallelSuitesIT
[2019-06-14T13:34:58.915Z] [INFO] Running org.apache.maven.surefire.its.jiras.Surefire1179IT
[2019-06-14T13:35:07.519Z] [INFO] Tests run: 1, Failures: 0, Errors: 0, Skipped: 0, Time elapsed: 11.471 s - in org.apache.maven.surefire.its.jiras.Surefire1179IT
[2019-06-14T13:35:07.519Z] [INFO] Running org.apache.maven.surefire.its.jiras.Surefire1185DoNotSpawnTestsIT
[2019-06-14T13:35:15.663Z] [INFO] Tests run: 1, Failures: 0, Errors: 0, Skipped: 0, Time elapsed: 7.582 s - in org.apache.maven.surefire.its.jiras.Surefire1185DoNotSpawnTestsIT
[2019-06-14T13:35:15.663Z] [INFO] Running org.apache.maven.surefire.its.jiras.Surefire1202RerunAndSkipIT
[2019-06-14T13:36:03.666Z] [INFO] Tests run: 2, Failures: 0, Errors: 0, Skipped: 0, Time elapsed: 41.066 s - in org.apache.maven.surefire.its.jiras.Surefire1202RerunAndSkipIT
[2019-06-14T13:36:03.666Z] [INFO] Running org.apache.maven.surefire.its.jiras.Surefire1209RerunAndForkCountIT
[2019-06-14T13:37:12.445Z] [INFO] Tests run: 4, Failures: 0, Errors: 0, Skipped: 0, Time elapsed: 65.099 s - in org.apache.maven.surefire.its.jiras.Surefire1209RerunAndForkCountIT
[2019-06-14T13:37:12.445Z] [INFO] Running org.apache.maven.surefire.its.jiras.Surefire1211JUnitTestNgIT
[2019-06-14T13:37:21.120Z] [INFO] Tests run: 2, Failures: 0, Errors: 0, Skipped: 0, Time elapsed: 19.896 s - in org.apache.maven.surefire.its.jiras.Surefire1211JUnitTestNgIT
[2019-06-14T13:37:21.120Z] [INFO] Running org.apache.maven.surefire.its.jiras.Surefire1264IT
[2019-06-14T13:37:44.187Z] [INFO] Tests run: 2, Failures: 0, Errors: 0, Skipped: 0, Time elapsed: 19.361 s - in org.apache.maven.surefire.its.jiras.Surefire1264IT
[2019-06-14T13:37:44.187Z] [INFO] Running org.apache.maven.surefire.its.jiras.Surefire1265Java9IT
[2019-06-14T13:37:44.187Z] [WARNING] Tests run: 1, Failures: 0, Errors: 0, Skipped: 1, Time elapsed: 0.001 s - in org.apache.maven.surefire.its.jiras.Surefire1265Java9IT
[2019-06-14T13:37:44.187Z] [INFO] Running org.apache.maven.surefire.its.jiras.Surefire1278GroupNameEndingIT
[2019-06-14T13:37:50.070Z] [INFO] Tests run: 1, Failures: 0, Errors: 0, Skipped: 0, Time elapsed: 9.753 s - in org.apache.maven.surefire.its.jiras.Surefire1278GroupNameEndingIT
[2019-06-14T13:37:50.070Z] [INFO] Running org.apache.maven.surefire.its.jiras.Surefire1295AttributeJvmCrashesToTestsIT
[2019-06-14T13:37:50.070Z] [WARNING] Tests run: 9, Failures: 0, Errors: 0, Skipped: 9, Time elapsed: 0 s - in org.apache.maven.surefire.its.jiras.Surefire1295AttributeJvmCrashesToTestsIT
[2019-06-14T13:37:50.070Z] [INFO] Running org.apache.maven.surefire.its.jiras.Surefire1364SystemPropertiesIT
[2019-06-14T13:39:27.692Z] [INFO] Tests run: 10, Failures: 0, Errors: 0, Skipped: 0, Time elapsed: 93.218 s - in org.apache.maven.surefire.its.jiras.Surefire1364SystemPropertiesIT
[2019-06-14T13:39:27.692Z] [INFO] Running org.apache.maven.surefire.its.jiras.Surefire1367AssumptionLogsIT
[2019-06-14T13:39:55.066Z] [INFO] Tests run: 4, Failures: 0, Errors: 0, Skipped: 0, Time elapsed: 30.911 s - in org.apache.maven.surefire.its.jiras.Surefire1367AssumptionLogsIT
[2019-06-14T13:39:55.066Z] [INFO] Running org.apache.maven.surefire.its.jiras.Surefire1383ScanSessionDependenciesIT
[2019-06-14T13:40:13.988Z] [INFO] Tests run: 1, Failures: 0, Errors: 0, Skipped: 0, Time elapsed: 17.961 s - in org.apache.maven.surefire.its.jiras.Surefire1383ScanSessionDependenciesIT
[2019-06-14T13:40:13.988Z] [INFO] Running org.apache.maven.surefire.its.jiras.Surefire1396CustomProviderClassPathIT
[2019-06-14T13:40:33.274Z] [INFO] Tests run: 1, Failures: 0, Errors: 0, Skipped: 0, Time elapsed: 18.384 s - in org.apache.maven.surefire.its.jiras.Surefire1396CustomProviderClassPathIT
[2019-06-14T13:40:33.274Z] [INFO] Running org.apache.maven.surefire.its.jiras.Surefire141PluggableProvidersIT
[2019-06-14T13:41:21.045Z] [INFO] Tests run: 4, Failures: 0, Errors: 0, Skipped: 0, Time elapsed: 43.206 s - in org.apache.maven.surefire.its.jiras.Surefire141PluggableProvidersIT
[2019-06-14T13:41:21.045Z] [INFO] Running org.apache.maven.surefire.its.jiras.Surefire146ForkPerTestNoSetupIT
[2019-06-14T13:41:23.223Z] [INFO] Tests run: 1, Failures: 0, Errors: 0, Skipped: 0, Time elapsed: 9.27 s - in org.apache.maven.surefire.its.jiras.Surefire146ForkPerTestNoSetupIT
[2019-06-14T13:41:23.223Z] [INFO] Running org.apache.maven.surefire.its.jiras.Surefire1490ReportTitleDescriptionIT
[2019-06-14T13:42:03.500Z] [INFO] Tests run: 2, Failures: 0, Errors: 0, Skipped: 0, Time elapsed: 40.116 s - in org.apache.maven.surefire.its.jiras.Surefire1490ReportTitleDescriptionIT
[2019-06-14T13:42:03.500Z] [INFO] Running org.apache.maven.surefire.its.jiras.Surefire1534ReuseForksFalseWithJavaModuleIT
[2019-06-14T13:42:03.500Z] [WARNING] Tests run: 3, Failures: 0, Errors: 0, Skipped: 3, Time elapsed: 0 s - in org.apache.maven.surefire.its.jiras.Surefire1534ReuseForksFalseWithJavaModuleIT
[2019-06-14T13:42:03.500Z] [INFO] Running org.apache.maven.surefire.its.jiras.Surefire1535TestNGParallelSuitesIT
[2019-06-14T13:42:51.433Z] [INFO] Tests run: 4, Failures: 0, Errors: 0, Skipped: 0, Time elapsed: 42.215 s - in org.apache.maven.surefire.its.jiras.Surefire1535TestNGParallelSuitesIT
[2019-06-14T13:42:51.433Z] [INFO] Running org.apache.maven.surefire.its.jiras.Surefire162CharsetProviderIT
[2019-06-14T13:42:53.524Z] [INFO] Tests run: 1, Failures: 0, Errors: 0, Skipped: 0, Time elapsed: 7.775 s - in org.apache.maven.surefire.its.jiras.Surefire162CharsetProviderIT
[2019-06-14T13:42:53.524Z] [INFO] Running org.apache.maven.surefire.its.jiras.Surefire224WellFormedXmlFailuresIT
[2019-06-14T13:43:03.041Z] [INFO] Tests run: 1, Failures: 0, Errors: 0, Skipped: 0, Time elapsed: 9.046 s - in org.apache.maven.surefire.its.jiras.Surefire224WellFormedXmlFailuresIT
[2019-06-14T13:43:03.041Z] [INFO] Running org.apache.maven.surefire.its.jiras.Surefire257NotRerunningTestsIT
[2019-06-14T13:43:14.317Z] [INFO] Tests run: 1, Failures: 0, Errors: 0, Skipped: 0, Time elapsed: 11.48 s - in org.apache.maven.surefire.its.jiras.Surefire257NotRerunningTestsIT
[2019-06-14T13:43:14.317Z] [INFO] Running org.apache.maven.surefire.its.jiras.Surefire260TestWithIdenticalNamesIT
[2019-06-14T13:43:14.317Z] [WARNING] Tests run: 1, Failures: 0, Errors: 0, Skipped: 1, Time elapsed: 0 s - in org.apache.maven.surefire.its.jiras.Surefire260TestWithIdenticalNamesIT
[2019-06-14T13:43:14.317Z] [INFO] Running org.apache.maven.surefire.its.jiras.Surefire34SecurityManagerIT
[2019-06-14T13:43:30.256Z] [INFO] Tests run: 2, Failures: 0, Errors: 0, Skipped: 0, Time elapsed: 16.487 s - in org.apache.maven.surefire.its.jiras.Surefire34SecurityManagerIT
[2019-06-14T13:43:30.256Z] [INFO] Running org.apache.maven.surefire.its.jiras.Surefire376TestNgAfterSuiteFailureIT
[2019-06-14T13:43:38.912Z] [INFO] Tests run: 1, Failures: 0, Errors: 0, Skipped: 0, Time elapsed: 8.192 s - in org.apache.maven.surefire.its.jiras.Surefire376TestNgAfterSuiteFailureIT
[2019-06-14T13:43:38.912Z] [INFO] Running org.apache.maven.surefire.its.jiras.Surefire377TestNgAndJUnitTogetherIT
[2019-06-14T13:43:57.812Z] [INFO] Tests run: 2, Failures: 0, Errors: 0, Skipped: 0, Time elapsed: 17.355 s - in org.apache.maven.surefire.its.jiras.Surefire377TestNgAndJUnitTogetherIT
[2019-06-14T13:43:57.812Z] [INFO] Running org.apache.maven.surefire.its.jiras.Surefire408ManualProviderSelectionIT
[2019-06-14T13:44:04.779Z] [INFO] Tests run: 1, Failures: 0, Errors: 0, Skipped: 0, Time elapsed: 8.192 s - in org.apache.maven.surefire.its.jiras.Surefire408ManualProviderSelectionIT
[2019-06-14T13:44:04.779Z] [INFO] Running org.apache.maven.surefire.its.jiras.Surefire42NotExtendingTestCaseIT
[2019-06-14T13:44:13.783Z] [INFO] Tests run: 1, Failures: 0, Errors: 0, Skipped: 0, Time elapsed: 8.313 s - in org.apache.maven.surefire.its.jiras.Surefire42NotExtendingTestCaseIT
[2019-06-14T13:44:13.783Z] [INFO] Running org.apache.maven.surefire.its.jiras.Surefire44InnerClassTestIT
[2019-06-14T13:44:20.860Z] [INFO] Tests run: 1, Failures: 0, Errors: 0, Skipped: 0, Time elapsed: 7.817 s - in org.apache.maven.surefire.its.jiras.Surefire44InnerClassTestIT
[2019-06-14T13:44:20.860Z] [INFO] Running org.apache.maven.surefire.its.jiras.Surefire500PuzzlingErrorIT
[2019-06-14T13:44:29.733Z] [INFO] Tests run: 1, Failures: 0, Errors: 0, Skipped: 0, Time elapsed: 8.584 s - in org.apache.maven.surefire.its.jiras.Surefire500PuzzlingErrorIT
[2019-06-14T13:44:29.733Z] [INFO] Running org.apache.maven.surefire.its.jiras.Surefire510TestClassPathForkModesIT
[2019-06-14T13:44:45.438Z] [INFO] Tests run: 2, Failures: 0, Errors: 0, Skipped: 0, Time elapsed: 15.864 s - in org.apache.maven.surefire.its.jiras.Surefire510TestClassPathForkModesIT
[2019-06-14T13:44:45.438Z] [INFO] Running org.apache.maven.surefire.its.jiras.Surefire569RunTestFromDependencyJarsIT
[2019-06-14T13:44:52.469Z] [INFO] Tests run: 1, Failures: 0, Errors: 0, Skipped: 0, Time elapsed: 7.682 s - in org.apache.maven.surefire.its.jiras.Surefire569RunTestFromDependencyJarsIT
[2019-06-14T13:44:52.469Z] [INFO] Running org.apache.maven.surefire.its.jiras.Surefire570MultipleReportDirectoriesIT
[2019-06-14T13:45:40.053Z] [INFO] Tests run: 2, Failures: 0, Errors: 0, Skipped: 0, Time elapsed: 43.328 s - in org.apache.maven.surefire.its.jiras.Surefire570MultipleReportDirectoriesIT
[2019-06-14T13:45:40.053Z] [INFO] Running org.apache.maven.surefire.its.jiras.Surefire613TestCountInParallelIT
[2019-06-14T13:45:44.608Z] [INFO] Tests run: 1, Failures: 0, Errors: 0, Skipped: 0, Time elapsed: 8.85 s - in org.apache.maven.surefire.its.jiras.Surefire613TestCountInParallelIT
[2019-06-14T13:45:44.608Z] [INFO] Running org.apache.maven.surefire.its.jiras.Surefire621TestCountingJunit3InParallelIT
[2019-06-14T13:46:32.978Z] [INFO] Tests run: 5, Failures: 0, Errors: 0, Skipped: 0, Time elapsed: 46.334 s - in org.apache.maven.surefire.its.jiras.Surefire621TestCountingJunit3InParallelIT
[2019-06-14T13:46:32.978Z] [INFO] Running org.apache.maven.surefire.its.jiras.Surefire628ConsoleOutputBeforeAndAfterClassIT
[2019-06-14T13:46:40.187Z] [INFO] Tests run: 1, Failures: 0, Errors: 0, Skipped: 0, Time elapsed: 8.872 s - in org.apache.maven.surefire.its.jiras.Surefire628ConsoleOutputBeforeAndAfterClassIT
[2019-06-14T13:46:40.187Z] [INFO] Running org.apache.maven.surefire.its.jiras.Surefire634UnsettableSystemPropertiesWarningIT
[2019-06-14T13:46:48.734Z] [INFO] Tests run: 1, Failures: 0, Errors: 0, Skipped: 0, Time elapsed: 7.585 s - in org.apache.maven.surefire.its.jiras.Surefire634UnsettableSystemPropertiesWarningIT
[2019-06-14T13:46:48.734Z] [INFO] Running org.apache.maven.surefire.its.jiras.Surefire649EmptyStringSystemPropertiesIT
[2019-06-14T13:47:02.209Z] [INFO] Tests run: 2, Failures: 0, Errors: 0, Skipped: 0, Time elapsed: 14.164 s - in org.apache.maven.surefire.its.jiras.Surefire649EmptyStringSystemPropertiesIT
[2019-06-14T13:47:02.209Z] [INFO] Running org.apache.maven.surefire.its.jiras.Surefire673MockitoIT
[2019-06-14T13:47:11.029Z] [INFO] Tests run: 1, Failures: 0, Errors: 0, Skipped: 0, Time elapsed: 9.42 s - in org.apache.maven.surefire.its.jiras.Surefire673MockitoIT
[2019-06-14T13:47:11.029Z] [INFO] Running org.apache.maven.surefire.its.jiras.Surefire674BuildFailingWhenErrorsIT
[2019-06-14T13:47:20.121Z] [INFO] Tests run: 1, Failures: 0, Errors: 0, Skipped: 0, Time elapsed: 9.191 s - in org.apache.maven.surefire.its.jiras.Surefire674BuildFailingWhenErrorsIT
[2019-06-14T13:47:20.121Z] [INFO] Running org.apache.maven.surefire.its.jiras.Surefire674BuildFailingWhenFailsafeErrorsIT
[2019-06-14T13:47:33.974Z] [INFO] Tests run: 1, Failures: 0, Errors: 0, Skipped: 0, Time elapsed: 13.368 s - in org.apache.maven.surefire.its.jiras.Surefire674BuildFailingWhenFailsafeErrorsIT
[2019-06-14T13:47:33.974Z] [INFO] Running org.apache.maven.surefire.its.jiras.Surefire685CommaSeparatedIncludesIT
[2019-06-14T13:47:41.105Z] [INFO] Tests run: 1, Failures: 0, Errors: 0, Skipped: 0, Time elapsed: 7.507 s - in org.apache.maven.surefire.its.jiras.Surefire685CommaSeparatedIncludesIT
[2019-06-14T13:47:41.105Z] [INFO] Running org.apache.maven.surefire.its.jiras.Surefire697NiceSummaryIT
[2019-06-14T13:47:49.830Z] [INFO] Tests run: 1, Failures: 0, Errors: 0, Skipped: 0, Time elapsed: 7.488 s - in org.apache.maven.surefire.its.jiras.Surefire697NiceSummaryIT
[2019-06-14T13:47:49.830Z] [INFO] Running org.apache.maven.surefire.its.jiras.Surefire705ParallelForkTimeoutIT
[2019-06-14T13:47:58.721Z] [INFO] Tests run: 1, Failures: 0, Errors: 0, Skipped: 0, Time elapsed: 9.974 s - in org.apache.maven.surefire.its.jiras.Surefire705ParallelForkTimeoutIT
[2019-06-14T13:47:58.721Z] [INFO] Running org.apache.maven.surefire.its.jiras.Surefire733AllOverrridesCapturedIT
[2019-06-14T13:48:07.396Z] [INFO] Tests run: 1, Failures: 0, Errors: 0, Skipped: 0, Time elapsed: 7.858 s - in org.apache.maven.surefire.its.jiras.Surefire733AllOverrridesCapturedIT
[2019-06-14T13:48:07.396Z] [INFO] Running org.apache.maven.surefire.its.jiras.Surefire735ForkFailWithRedirectConsoleOutputIT
[2019-06-14T13:48:22.999Z] [INFO] Tests run: 2, Failures: 0, Errors: 0, Skipped: 0, Time elapsed: 15.28 s - in org.apache.maven.surefire.its.jiras.Surefire735ForkFailWithRedirectConsoleOutputIT
[2019-06-14T13:48:22.999Z] [INFO] Running org.apache.maven.surefire.its.jiras.Surefire740TruncatedCommaIT
[2019-06-14T13:48:30.322Z] [INFO] Tests run: 1, Failures: 0, Errors: 0, Skipped: 0, Time elapsed: 8.015 s - in org.apache.maven.surefire.its.jiras.Surefire740TruncatedCommaIT
[2019-06-14T13:48:30.322Z] [INFO] Running org.apache.maven.surefire.its.jiras.Surefire747MethodParallelWithSuiteCountIT
[2019-06-14T13:48:58.696Z] [INFO] Tests run: 2, Failures: 0, Errors: 0, Skipped: 0, Time elapsed: 28.794 s - in org.apache.maven.surefire.its.jiras.Surefire747MethodParallelWithSuiteCountIT
[2019-06-14T13:48:58.696Z] [INFO] Running org.apache.maven.surefire.its.jiras.Surefire772BothReportsIT
[2019-06-14T13:49:17.589Z] [INFO] Tests run: 3, Failures: 0, Errors: 0, Skipped: 0, Time elapsed: 16.928 s - in org.apache.maven.surefire.its.jiras.Surefire772BothReportsIT
[2019-06-14T13:49:17.589Z] [INFO] Running org.apache.maven.surefire.its.jiras.Surefire772NoFailsafeReportsIT
[2019-06-14T13:49:40.608Z] [INFO] Tests run: 4, Failures: 0, Errors: 0, Skipped: 0, Time elapsed: 22.13 s - in org.apache.maven.surefire.its.jiras.Surefire772NoFailsafeReportsIT
[2019-06-14T13:49:40.608Z] [INFO] Running org.apache.maven.surefire.its.jiras.Surefire772NoSurefireReportsIT
[2019-06-14T13:50:03.523Z] [INFO] Tests run: 4, Failures: 0, Errors: 0, Skipped: 0, Time elapsed: 23.115 s - in org.apache.maven.surefire.its.jiras.Surefire772NoSurefireReportsIT
[2019-06-14T13:50:03.524Z] [INFO] Running org.apache.maven.surefire.its.jiras.Surefire772SpecifiedReportsIT
[2019-06-14T13:50:19.068Z] [INFO] Tests run: 3, Failures: 0, Errors: 0, Skipped: 0, Time elapsed: 18.264 s - in org.apache.maven.surefire.its.jiras.Surefire772SpecifiedReportsIT
[2019-06-14T13:50:19.068Z] [INFO] Running org.apache.maven.surefire.its.jiras.Surefire801ForkModeNoneClassLoaderIT
[2019-06-14T13:50:26.029Z] [INFO] Tests run: 1, Failures: 0, Errors: 0, Skipped: 0, Time elapsed: 6.695 s - in org.apache.maven.surefire.its.jiras.Surefire801ForkModeNoneClassLoaderIT
[2019-06-14T13:50:26.029Z] [INFO] Running org.apache.maven.surefire.its.jiras.Surefire803MultiFailsafeExecsIT
[2019-06-14T13:50:58.912Z] [INFO] Tests run: 2, Failures: 0, Errors: 0, Skipped: 0, Time elapsed: 29.507 s - in org.apache.maven.surefire.its.jiras.Surefire803MultiFailsafeExecsIT
[2019-06-14T13:50:58.912Z] [INFO] Running org.apache.maven.surefire.its.jiras.Surefire806SpecifiedTestControlsIT
[2019-06-14T13:51:03.446Z] [WARNING] Tests run: 3, Failures: 0, Errors: 0, Skipped: 2, Time elapsed: 7.7 s - in org.apache.maven.surefire.its.jiras.Surefire806SpecifiedTestControlsIT
[2019-06-14T13:51:03.446Z] [INFO] Running org.apache.maven.surefire.its.jiras.Surefire809GroupExpressionsIT
[2019-06-14T13:52:00.785Z] [INFO] Tests run: 6, Failures: 0, Errors: 0, Skipped: 0, Time elapsed: 50.461 s - in org.apache.maven.surefire.its.jiras.Surefire809GroupExpressionsIT
[2019-06-14T13:52:00.785Z] [INFO] Running org.apache.maven.surefire.its.jiras.Surefire812Log4JClassLoaderIT
[2019-06-14T13:52:03.535Z] [INFO] Tests run: 1, Failures: 0, Errors: 0, Skipped: 0, Time elapsed: 9.889 s - in org.apache.maven.surefire.its.jiras.Surefire812Log4JClassLoaderIT
[2019-06-14T13:52:03.535Z] [INFO] Running org.apache.maven.surefire.its.jiras.Surefire817SystemExitIT
[2019-06-14T13:52:12.092Z] [INFO] Tests run: 1, Failures: 0, Errors: 0, Skipped: 0, Time elapsed: 8.197 s - in org.apache.maven.surefire.its.jiras.Surefire817SystemExitIT
[2019-06-14T13:52:12.092Z] [INFO] Running org.apache.maven.surefire.its.jiras.Surefire818NpeIgnoresTestsIT
[2019-06-14T13:52:20.705Z] [INFO] Tests run: 1, Failures: 0, Errors: 0, Skipped: 0, Time elapsed: 9.016 s - in org.apache.maven.surefire.its.jiras.Surefire818NpeIgnoresTestsIT
[2019-06-14T13:52:20.705Z] [INFO] Running org.apache.maven.surefire.its.jiras.Surefire828EmptyGroupExprIT
[2019-06-14T13:52:53.982Z] [INFO] Tests run: 4, Failures: 0, Errors: 0, Skipped: 0, Time elapsed: 33.707 s - in org.apache.maven.surefire.its.jiras.Surefire828EmptyGroupExprIT
[2019-06-14T13:52:53.982Z] [INFO] Running org.apache.maven.surefire.its.jiras.Surefire832ProviderSelectionIT
[2019-06-14T13:53:02.560Z] [INFO] Tests run: 1, Failures: 0, Errors: 0, Skipped: 0, Time elapsed: 8.597 s - in org.apache.maven.surefire.its.jiras.Surefire832ProviderSelectionIT
[2019-06-14T13:53:02.560Z] [INFO] Running org.apache.maven.surefire.its.jiras.Surefire839TestWithoutCategoriesIT
[2019-06-14T13:53:21.498Z] [INFO] Tests run: 2, Failures: 0, Errors: 0, Skipped: 0, Time elapsed: 17.618 s - in org.apache.maven.surefire.its.jiras.Surefire839TestWithoutCategoriesIT
[2019-06-14T13:53:21.498Z] [INFO] Running org.apache.maven.surefire.its.jiras.Surefire847AdditionalFailureIT
[2019-06-14T13:53:35.012Z] [INFO] Tests run: 1, Failures: 0, Errors: 0, Skipped: 0, Time elapsed: 14.772 s - in org.apache.maven.surefire.its.jiras.Surefire847AdditionalFailureIT
[2019-06-14T13:53:35.012Z] [INFO] Running org.apache.maven.surefire.its.jiras.Surefire855AllowFailsafeUseArtifactFileIT
[2019-06-14T13:54:57.626Z] [INFO] Tests run: 4, Failures: 0, Errors: 0, Skipped: 0, Time elapsed: 70.78 s - in org.apache.maven.surefire.its.jiras.Surefire855AllowFailsafeUseArtifactFileIT
[2019-06-14T13:54:57.626Z] [INFO] Running org.apache.maven.surefire.its.jiras.Surefire901MIssingResultfileWhenNoTestsIT
[2019-06-14T13:54:57.626Z] [INFO] Tests run: 1, Failures: 0, Errors: 0, Skipped: 0, Time elapsed: 6.474 s - in org.apache.maven.surefire.its.jiras.Surefire901MIssingResultfileWhenNoTestsIT
[2019-06-14T13:54:57.626Z] [INFO] Running org.apache.maven.surefire.its.jiras.Surefire907PerThreadWithoutThreadCountIT
[2019-06-14T13:54:58.671Z] [INFO] Tests run: 1, Failures: 0, Errors: 0, Skipped: 0, Time elapsed: 6.307 s - in org.apache.maven.surefire.its.jiras.Surefire907PerThreadWithoutThreadCountIT
[2019-06-14T13:54:58.671Z] [INFO] Running org.apache.maven.surefire.its.jiras.Surefire920TestFailureIgnoreWithTimeoutIT
[2019-06-14T13:55:17.713Z] [INFO] Tests run: 2, Failures: 0, Errors: 0, Skipped: 0, Time elapsed: 18.162 s - in org.apache.maven.surefire.its.jiras.Surefire920TestFailureIgnoreWithTimeoutIT
[2019-06-14T13:55:17.713Z] [INFO] Running org.apache.maven.surefire.its.jiras.Surefire926FailureWith2ProvidersIT
[2019-06-14T13:55:28.203Z] [INFO] Tests run: 1, Failures: 0, Errors: 0, Skipped: 0, Time elapsed: 11.5 s - in org.apache.maven.surefire.its.jiras.Surefire926FailureWith2ProvidersIT
[2019-06-14T13:55:28.203Z] [INFO] Running org.apache.maven.surefire.its.jiras.Surefire930TestNgSuiteXmlIT
[2019-06-14T13:55:39.391Z] [INFO] Tests run: 1, Failures: 0, Errors: 0, Skipped: 0, Time elapsed: 9.954 s - in org.apache.maven.surefire.its.jiras.Surefire930TestNgSuiteXmlIT
[2019-06-14T13:55:39.391Z] [INFO] Running org.apache.maven.surefire.its.jiras.Surefire943ReportContentIT
[2019-06-14T13:56:19.032Z] [INFO] Tests run: 2, Failures: 0, Errors: 0, Skipped: 0, Time elapsed: 35.081 s - in org.apache.maven.surefire.its.jiras.Surefire943ReportContentIT
[2019-06-14T13:56:19.032Z] [INFO] Running org.apache.maven.surefire.its.jiras.Surefire946KillMainProcessInReusableForkIT
[2019-06-14T13:56:46.597Z] [INFO] Tests run: 3, Failures: 0, Errors: 0, Skipped: 0, Time elapsed: 29.953 s - in org.apache.maven.surefire.its.jiras.Surefire946KillMainProcessInReusableForkIT
[2019-06-14T13:56:46.597Z] [INFO] Running org.apache.maven.surefire.its.jiras.Surefire972BizarreNoClassDefIT
[2019-06-14T13:56:58.411Z] [INFO] Tests run: 1, Failures: 0, Errors: 0, Skipped: 0, Time elapsed: 14.382 s - in org.apache.maven.surefire.its.jiras.Surefire972BizarreNoClassDefIT
[2019-06-14T13:56:58.411Z] [INFO] Running org.apache.maven.surefire.its.jiras.Surefire975DefaultVMEncodingIT
[2019-06-14T13:57:12.854Z] [INFO] Tests run: 1, Failures: 0, Errors: 0, Skipped: 0, Time elapsed: 13.141 s - in org.apache.maven.surefire.its.jiras.Surefire975DefaultVMEncodingIT
[2019-06-14T13:57:12.854Z] [INFO] Running org.apache.maven.surefire.its.jiras.Surefire979WrongClassLoaderIT
[2019-06-14T13:57:19.972Z] [INFO] Tests run: 1, Failures: 0, Errors: 0, Skipped: 0, Time elapsed: 8.807 s - in org.apache.maven.surefire.its.jiras.Surefire979WrongClassLoaderIT
[2019-06-14T13:57:19.972Z] [INFO] Running org.apache.maven.surefire.its.jiras.Surefire985ParameterizedRunnerAndCategoriesIT
[2019-06-14T13:57:28.755Z] [INFO] Tests run: 1, Failures: 0, Errors: 0, Skipped: 0, Time elapsed: 8.21 s - in org.apache.maven.surefire.its.jiras.Surefire985ParameterizedRunnerAndCategoriesIT
[2019-06-14T13:57:28.755Z] [INFO] Running org.apache.maven.surefire.its.jiras.Surefire995CategoryInheritanceIT
[2019-06-14T13:58:08.416Z] [INFO] Tests run: 5, Failures: 0, Errors: 0, Skipped: 0, Time elapsed: 34.788 s - in org.apache.maven.surefire.its.jiras.Surefire995CategoryInheritanceIT
[2019-06-14T13:58:08.416Z] [INFO]
[2019-06-14T13:58:08.416Z] [INFO] Results:
[2019-06-14T13:58:08.416Z] [INFO]
[2019-06-14T13:58:08.416Z] [WARNING] Tests run: 788, Failures: 0, Errors: 0, Skipped: 169
[2019-06-14T13:58:08.416Z] [INFO]
[2019-06-14T13:58:08.416Z] [INFO]
[2019-06-14T13:58:08.416Z] [INFO] --- maven-checkstyle-plugin:3.0.0:check (checkstyle-check) @ surefire-its ---
[2019-06-14T13:58:08.416Z] [INFO]
[2019-06-14T13:58:08.416Z] [INFO] --- maven-failsafe-plugin:3.0.0-M3:verify (default) @ surefire-its ---
[2019-06-14T13:58:08.416Z] [INFO] Failsafe report directory: C:\Users\jenkins\AppData\Local\Temp\2\jenkins-maven-box-maven-surefire-deployment-8@2\surefire-its\target\failsafe-reports
[2019-06-14T13:58:08.416Z] [INFO]
[2019-06-14T13:58:08.416Z] [INFO] --- maven-install-plugin:2.5.2:install (default-install) @ surefire-its ---
[2019-06-14T13:58:08.416Z] [INFO] Skipping artifact installation
[2019-06-14T13:58:08.416Z] [INFO] ------------------------------------------------------------------------
[2019-06-14T13:58:08.416Z] [INFO] Reactor Summary for Apache Maven Surefire 3.0.0-M4-SNAPSHOT:
[2019-06-14T13:58:08.416Z] [INFO]
[2019-06-14T13:58:08.416Z] [INFO] Apache Maven Surefire .............................. SUCCESS [ 37.716 s]
[2019-06-14T13:58:08.416Z] [INFO] SureFire Logger API ................................ SUCCESS [ 8.658 s]
[2019-06-14T13:58:08.416Z] [INFO] SureFire API ....................................... SUCCESS [ 17.850 s]
[2019-06-14T13:58:08.416Z] [INFO] SureFire Booter .................................... SUCCESS [ 23.095 s]
[2019-06-14T13:58:08.416Z] [INFO] Maven Surefire Test-Grouping Support ............... SUCCESS [ 10.272 s]
[2019-06-14T13:58:08.416Z] [INFO] SureFire Providers ................................. SUCCESS [ 1.693 s]
[2019-06-14T13:58:08.416Z] [INFO] Shared JUnit3 Provider Code ........................ SUCCESS [ 6.834 s]
[2019-06-14T13:58:08.416Z] [INFO] Shared Java 5 Provider Base ........................ SUCCESS [ 7.864 s]
[2019-06-14T13:58:08.416Z] [INFO] Shared JUnit4 Provider Code ........................ SUCCESS [ 7.686 s]
[2019-06-14T13:58:08.416Z] [INFO] Shared JUnit48 Provider Code ....................... SUCCESS [ 8.947 s]
[2019-06-14T13:58:08.416Z] [INFO] SureFire JUnit Runner .............................. SUCCESS [ 7.229 s]
[2019-06-14T13:58:08.416Z] [INFO] SureFire JUnit4 Runner ............................. SUCCESS [ 7.280 s]
[2019-06-14T13:58:08.416Z] [INFO] Maven Surefire Common .............................. SUCCESS [ 38.447 s]
[2019-06-14T13:58:08.416Z] [INFO] SureFire JUnitCore Runner .......................... SUCCESS [02:23 min]
[2019-06-14T13:58:08.416Z] [INFO] SureFire JUnit Platform Runner ..................... SUCCESS [ 15.381 s]
[2019-06-14T13:58:08.416Z] [INFO] SureFire TestNG Utils .............................. SUCCESS [ 8.446 s]
[2019-06-14T13:58:08.416Z] [INFO] SureFire TestNG Runner ............................. SUCCESS [ 8.330 s]
[2019-06-14T13:58:08.416Z] [INFO] ShadeFire JUnit3 Provider .......................... SUCCESS [ 2.262 s]
[2019-06-14T13:58:08.416Z] [INFO] Surefire Report Parser ............................. SUCCESS [ 10.230 s]
[2019-06-14T13:58:08.416Z] [INFO] Maven Surefire Plugin .............................. SUCCESS [ 16.611 s]
[2019-06-14T13:58:08.416Z] [INFO] Maven Failsafe Plugin .............................. SUCCESS [01:48 min]
[2019-06-14T13:58:08.416Z] [INFO] Maven Surefire Report Plugin ....................... SUCCESS [ 22.944 s]
[2019-06-14T13:58:08.416Z] [INFO] Maven Surefire Integration Tests ................... SUCCESS [ 01:39 h]
[2019-06-14T13:58:08.416Z] [INFO] ------------------------------------------------------------------------
[2019-06-14T13:58:08.416Z] [INFO] BUILD SUCCESS
[2019-06-14T13:58:08.416Z] [INFO] ------------------------------------------------------------------------
[2019-06-14T13:58:08.416Z] [INFO] Total time: 01:47 h
[2019-06-14T13:58:08.416Z] [INFO] Finished at: 2019-06-14T13:58:03Z
[2019-06-14T13:58:08.417Z] [INFO] ------------------------------------------------------------------------
[Pipeline] }
[Pipeline] // withEnv
[Pipeline] }
[Pipeline] // stage
[Pipeline] fileExists
[Pipeline] zip
[2019-06-14T13:58:08.611Z] Writing zip file of C:\Users\jenkins\AppData\Local\Temp\2\jenkins-maven-box-maven-surefire-deployment-8@2\maven-failsafe-plugin\target\it to C:\Users\jenkins\AppData\Local\Temp\2\jenkins-maven-box-maven-surefire-deployment-8@2\maven-failsafe-plugin--windows-jdk7-maven3.6.x.zip
[2019-06-14T13:58:08.682Z] Zipped 78 entries.
[2019-06-14T13:58:08.682Z] Archiving C:\Users\jenkins\AppData\Local\Temp\2\jenkins-maven-box-maven-surefire-deployment-8@2\maven-failsafe-plugin--windows-jdk7-maven3.6.x.zip
[2019-06-14T13:58:08.683Z] [Fast Archiver] No prior successful build to compare, so performing full copy of artifacts
[Pipeline] fileExists
[Pipeline] zip
[2019-06-14T13:58:08.947Z] Writing zip file of C:\Users\jenkins\AppData\Local\Temp\2\jenkins-maven-box-maven-surefire-deployment-8@2\surefire-its\target to C:\Users\jenkins\AppData\Local\Temp\2\jenkins-maven-box-maven-surefire-deployment-8@2\surefire-its--windows-jdk7-maven3.6.x.zip
[2019-06-14T13:58:19.904Z] Zipped 15817 entries.
[2019-06-14T13:58:19.904Z] Archiving C:\Users\jenkins\AppData\Local\Temp\2\jenkins-maven-box-maven-surefire-deployment-8@2\surefire-its--windows-jdk7-maven3.6.x.zip
[2019-06-14T13:58:19.904Z] [Fast Archiver] No prior successful build to compare, so performing full copy of artifacts
[Pipeline] archiveArtifacts
[2019-06-14T13:58:21.366Z] Archiving artifacts
[2019-06-14T13:58:21.385Z] [Fast Archiver] No prior successful build to compare, so performing full copy of artifacts
[Pipeline] cleanWs
[2019-06-14T13:58:22.939Z] [WS-CLEANUP] Deleting project workspace...
[2019-06-14T13:58:22.939Z] [WS-CLEANUP] Deferred wipeout is used...
[2019-06-14T13:58:23.077Z] [WS-CLEANUP] done
[Pipeline] }
[Pipeline] // ws
[Pipeline] }
[Pipeline] // timestamps
[Pipeline] }
[Pipeline] // node
[Pipeline] }
[Pipeline] // parallel
[Pipeline] echo
Build result: FAILURE
[Pipeline] jiraIssueSelector
[Pipeline] emailext
Build failed in Jenkins: Maven TLP » maven-surefire » deployment #7
Posted by Apache Jenkins Server <je...@builds.apache.org>.
See https://builds.apache.org/job/maven-box/job/maven-surefire/job/deployment/7/
No changes.
1 tests failed.
FAILED: org.apache.maven.surefire.its.JUnitPlatformEnginesIT.platform[1.4.0-SNAPSHOT]
Error Message:
Expected: <[\[DEBUG\] test\(compact\) classpath: test-classes classes junit-jupiter-engine-5\.4\.0-SNAPSHOT\.jar apiguardian-api-1\.0\.0\.jar junit-platform-engine-1\.4\.0-SNAPSHOT\.jar junit-platform-commons-1\.4\.0-SNAPSHOT\.jar opentest4j-1\.1\.1\.jar junit-jupiter-api-5\.4\.0-SNAPSHOT\.jar]>
but: was <[[DEBUG] test(compact) classpath: test-classes classes junit-jupiter-engine-5.4.0-SNAPSHOT.jar apiguardian-api-1.0.0.jar junit-platform-engine-1.4.0-SNAPSHOT.jar opentest4j-1.1.1.jar junit-platform-commons-1.4.0-SNAPSHOT.jar junit-jupiter-api-5.4.0-SNAPSHOT.jar]>
Stack Trace:
java.lang.AssertionError:
Expected: <[\[DEBUG\] test\(compact\) classpath: test-classes classes junit-jupiter-engine-5\.4\.0-SNAPSHOT\.jar apiguardian-api-1\.0\.0\.jar junit-platform-engine-1\.4\.0-SNAPSHOT\.jar junit-platform-commons-1\.4\.0-SNAPSHOT\.jar opentest4j-1\.1\.1\.jar junit-jupiter-api-5\.4\.0-SNAPSHOT\.jar]>
but: was <[[DEBUG] test(compact) classpath: test-classes classes junit-jupiter-engine-5.4.0-SNAPSHOT.jar apiguardian-api-1.0.0.jar junit-platform-engine-1.4.0-SNAPSHOT.jar opentest4j-1.1.1.jar junit-platform-commons-1.4.0-SNAPSHOT.jar junit-jupiter-api-5.4.0-SNAPSHOT.jar]>
at org.apache.maven.surefire.its.JUnitPlatformEnginesIT.platform(JUnitPlatformEnginesIT.java:111)
Build log:
[...truncated 23377 lines...]
[2019-06-10T08:08:21.526Z] [INFO] Tests run: 1, Failures: 0, Errors: 0, Skipped: 0, Time elapsed: 5.442 s - in org.apache.maven.surefire.its.jiras.Surefire628ConsoleOutputBeforeAndAfterClassIT
[2019-06-10T08:08:21.526Z] [INFO] Running org.apache.maven.surefire.its.jiras.Surefire634UnsettableSystemPropertiesWarningIT
[2019-06-10T08:08:28.042Z] [INFO] Tests run: 1, Failures: 0, Errors: 0, Skipped: 0, Time elapsed: 5.355 s - in org.apache.maven.surefire.its.jiras.Surefire634UnsettableSystemPropertiesWarningIT
[2019-06-10T08:08:28.042Z] [INFO] Running org.apache.maven.surefire.its.jiras.Surefire649EmptyStringSystemPropertiesIT
[2019-06-10T08:08:35.932Z] [INFO] Tests run: 2, Failures: 0, Errors: 0, Skipped: 0, Time elapsed: 9.028 s - in org.apache.maven.surefire.its.jiras.Surefire649EmptyStringSystemPropertiesIT
[2019-06-10T08:08:35.932Z] [INFO] Running org.apache.maven.surefire.its.jiras.Surefire673MockitoIT
[2019-06-10T08:08:43.846Z] [INFO] Tests run: 1, Failures: 0, Errors: 0, Skipped: 0, Time elapsed: 6.666 s - in org.apache.maven.surefire.its.jiras.Surefire673MockitoIT
[2019-06-10T08:08:43.847Z] [INFO] Running org.apache.maven.surefire.its.jiras.Surefire674BuildFailingWhenErrorsIT
[2019-06-10T08:08:46.888Z] [INFO] Tests run: 4, Failures: 0, Errors: 0, Skipped: 0, Time elapsed: 26.746 s - in org.apache.maven.surefire.its.jiras.Surefire1535TestNGParallelSuitesIT
[2019-06-10T08:08:46.888Z] [INFO] Running org.apache.maven.surefire.its.jiras.Surefire162CharsetProviderIT
[2019-06-10T08:08:48.363Z] [INFO] Tests run: 1, Failures: 0, Errors: 0, Skipped: 0, Time elapsed: 4.684 s - in org.apache.maven.surefire.its.jiras.Surefire162CharsetProviderIT
[2019-06-10T08:08:48.363Z] [INFO] Running org.apache.maven.surefire.its.jiras.Surefire224WellFormedXmlFailuresIT
[2019-06-10T08:08:49.121Z] [INFO] Tests run: 1, Failures: 0, Errors: 0, Skipped: 0, Time elapsed: 5.592 s - in org.apache.maven.surefire.its.jiras.Surefire674BuildFailingWhenErrorsIT
[2019-06-10T08:08:49.121Z] [INFO] Running org.apache.maven.surefire.its.jiras.Surefire674BuildFailingWhenFailsafeErrorsIT
[2019-06-10T08:08:52.320Z] [INFO] Tests run: 1, Failures: 0, Errors: 0, Skipped: 0, Time elapsed: 3.997 s - in org.apache.maven.surefire.its.jiras.Surefire674BuildFailingWhenFailsafeErrorsIT
[2019-06-10T08:08:52.320Z] [INFO] Running org.apache.maven.surefire.its.jiras.Surefire685CommaSeparatedIncludesIT
[2019-06-10T08:08:53.627Z] [INFO] Tests run: 1, Failures: 0, Errors: 0, Skipped: 0, Time elapsed: 4.785 s - in org.apache.maven.surefire.its.jiras.Surefire224WellFormedXmlFailuresIT
[2019-06-10T08:08:53.627Z] [INFO] Running org.apache.maven.surefire.its.jiras.Surefire257NotRerunningTestsIT
[2019-06-10T08:08:57.583Z] [INFO] Tests run: 1, Failures: 0, Errors: 0, Skipped: 0, Time elapsed: 5.377 s - in org.apache.maven.surefire.its.jiras.Surefire685CommaSeparatedIncludesIT
[2019-06-10T08:08:57.583Z] [INFO] Running org.apache.maven.surefire.its.jiras.Surefire697NiceSummaryIT
[2019-06-10T08:09:00.150Z] [INFO] Tests run: 1, Failures: 0, Errors: 0, Skipped: 0, Time elapsed: 6.549 s - in org.apache.maven.surefire.its.jiras.Surefire257NotRerunningTestsIT
[2019-06-10T08:09:00.150Z] [INFO] Running org.apache.maven.surefire.its.jiras.Surefire260TestWithIdenticalNamesIT
[2019-06-10T08:09:00.150Z] [WARNING] Tests run: 1, Failures: 0, Errors: 0, Skipped: 1, Time elapsed: 0 s - in org.apache.maven.surefire.its.jiras.Surefire260TestWithIdenticalNamesIT
[2019-06-10T08:09:00.150Z] [INFO] Running org.apache.maven.surefire.its.jiras.Surefire34SecurityManagerIT
[2019-06-10T08:09:04.064Z] [INFO] Tests run: 1, Failures: 0, Errors: 0, Skipped: 0, Time elapsed: 5.444 s - in org.apache.maven.surefire.its.jiras.Surefire697NiceSummaryIT
[2019-06-10T08:09:04.064Z] [INFO] Running org.apache.maven.surefire.its.jiras.Surefire705ParallelForkTimeoutIT
[2019-06-10T08:09:09.565Z] [INFO] Tests run: 2, Failures: 0, Errors: 0, Skipped: 0, Time elapsed: 9.56 s - in org.apache.maven.surefire.its.jiras.Surefire34SecurityManagerIT
[2019-06-10T08:09:09.565Z] [INFO] Running org.apache.maven.surefire.its.jiras.Surefire376TestNgAfterSuiteFailureIT
[2019-06-10T08:09:10.541Z] [INFO] Tests run: 1, Failures: 0, Errors: 0, Skipped: 0, Time elapsed: 7.425 s - in org.apache.maven.surefire.its.jiras.Surefire705ParallelForkTimeoutIT
[2019-06-10T08:09:10.541Z] [INFO] Running org.apache.maven.surefire.its.jiras.Surefire733AllOverrridesCapturedIT
[2019-06-10T08:09:14.826Z] [INFO] Tests run: 1, Failures: 0, Errors: 0, Skipped: 0, Time elapsed: 4.979 s - in org.apache.maven.surefire.its.jiras.Surefire376TestNgAfterSuiteFailureIT
[2019-06-10T08:09:14.826Z] [INFO] Running org.apache.maven.surefire.its.jiras.Surefire377TestNgAndJUnitTogetherIT
[2019-06-10T08:09:17.016Z] [INFO] Tests run: 1, Failures: 0, Errors: 0, Skipped: 0, Time elapsed: 5.567 s - in org.apache.maven.surefire.its.jiras.Surefire733AllOverrridesCapturedIT
[2019-06-10T08:09:17.016Z] [INFO] Running org.apache.maven.surefire.its.jiras.Surefire735ForkFailWithRedirectConsoleOutputIT
[2019-06-10T08:09:24.204Z] [INFO] Tests run: 2, Failures: 0, Errors: 0, Skipped: 0, Time elapsed: 9.435 s - in org.apache.maven.surefire.its.jiras.Surefire377TestNgAndJUnitTogetherIT
[2019-06-10T08:09:24.204Z] [INFO] Running org.apache.maven.surefire.its.jiras.Surefire408ManualProviderSelectionIT
[2019-06-10T08:09:26.565Z] [INFO] Tests run: 2, Failures: 0, Errors: 0, Skipped: 0, Time elapsed: 9.744 s - in org.apache.maven.surefire.its.jiras.Surefire735ForkFailWithRedirectConsoleOutputIT
[2019-06-10T08:09:26.565Z] [INFO] Running org.apache.maven.surefire.its.jiras.Surefire740TruncatedCommaIT
[2019-06-10T08:09:29.549Z] [INFO] Tests run: 1, Failures: 0, Errors: 0, Skipped: 0, Time elapsed: 5.034 s - in org.apache.maven.surefire.its.jiras.Surefire408ManualProviderSelectionIT
[2019-06-10T08:09:29.549Z] [INFO] Running org.apache.maven.surefire.its.jiras.Surefire42NotExtendingTestCaseIT
[2019-06-10T08:09:30.752Z] [INFO] Tests run: 1, Failures: 0, Errors: 0, Skipped: 0, Time elapsed: 4.679 s - in org.apache.maven.surefire.its.jiras.Surefire740TruncatedCommaIT
[2019-06-10T08:09:30.752Z] [INFO] Running org.apache.maven.surefire.its.jiras.Surefire747MethodParallelWithSuiteCountIT
[2019-06-10T08:09:33.733Z] [INFO] Tests run: 1, Failures: 0, Errors: 0, Skipped: 0, Time elapsed: 4.634 s - in org.apache.maven.surefire.its.jiras.Surefire42NotExtendingTestCaseIT
[2019-06-10T08:09:33.733Z] [INFO] Running org.apache.maven.surefire.its.jiras.Surefire44InnerClassTestIT
[2019-06-10T08:09:37.964Z] [INFO] Tests run: 1, Failures: 0, Errors: 0, Skipped: 0, Time elapsed: 4.627 s - in org.apache.maven.surefire.its.jiras.Surefire44InnerClassTestIT
[2019-06-10T08:09:37.964Z] [INFO] Running org.apache.maven.surefire.its.jiras.Surefire500PuzzlingErrorIT
[2019-06-10T08:09:43.209Z] [INFO] Tests run: 1, Failures: 0, Errors: 0, Skipped: 0, Time elapsed: 4.92 s - in org.apache.maven.surefire.its.jiras.Surefire500PuzzlingErrorIT
[2019-06-10T08:09:43.209Z] [INFO] Running org.apache.maven.surefire.its.jiras.Surefire510TestClassPathForkModesIT
[2019-06-10T08:09:52.079Z] [INFO] Tests run: 2, Failures: 0, Errors: 0, Skipped: 0, Time elapsed: 21.549 s - in org.apache.maven.surefire.its.jiras.Surefire747MethodParallelWithSuiteCountIT
[2019-06-10T08:09:52.079Z] [INFO] Running org.apache.maven.surefire.its.jiras.Surefire772BothReportsIT
[2019-06-10T08:09:52.550Z] [INFO] Tests run: 2, Failures: 0, Errors: 0, Skipped: 0, Time elapsed: 9.532 s - in org.apache.maven.surefire.its.jiras.Surefire510TestClassPathForkModesIT
[2019-06-10T08:09:52.550Z] [INFO] Running org.apache.maven.surefire.its.jiras.Surefire569RunTestFromDependencyJarsIT
[2019-06-10T08:09:57.869Z] [INFO] Tests run: 1, Failures: 0, Errors: 0, Skipped: 0, Time elapsed: 4.803 s - in org.apache.maven.surefire.its.jiras.Surefire569RunTestFromDependencyJarsIT
[2019-06-10T08:09:57.869Z] [INFO] Running org.apache.maven.surefire.its.jiras.Surefire570MultipleReportDirectoriesIT
[2019-06-10T08:10:03.183Z] [INFO] Tests run: 3, Failures: 0, Errors: 0, Skipped: 0, Time elapsed: 10.639 s - in org.apache.maven.surefire.its.jiras.Surefire772BothReportsIT
[2019-06-10T08:10:03.184Z] [INFO] Running org.apache.maven.surefire.its.jiras.Surefire772NoFailsafeReportsIT
[2019-06-10T08:10:16.359Z] [INFO] Tests run: 4, Failures: 0, Errors: 0, Skipped: 0, Time elapsed: 12.787 s - in org.apache.maven.surefire.its.jiras.Surefire772NoFailsafeReportsIT
[2019-06-10T08:10:16.359Z] [INFO] Running org.apache.maven.surefire.its.jiras.Surefire772NoSurefireReportsIT
[2019-06-10T08:10:22.784Z] [INFO] Tests run: 2, Failures: 0, Errors: 0, Skipped: 0, Time elapsed: 25.115 s - in org.apache.maven.surefire.its.jiras.Surefire570MultipleReportDirectoriesIT
[2019-06-10T08:10:22.784Z] [INFO] Running org.apache.maven.surefire.its.jiras.Surefire613TestCountInParallelIT
[2019-06-10T08:10:28.058Z] [INFO] Tests run: 1, Failures: 0, Errors: 0, Skipped: 0, Time elapsed: 5.456 s - in org.apache.maven.surefire.its.jiras.Surefire613TestCountInParallelIT
[2019-06-10T08:10:28.058Z] [INFO] Running org.apache.maven.surefire.its.jiras.Surefire621TestCountingJunit3InParallelIT
[2019-06-10T08:10:29.467Z] [INFO] Tests run: 4, Failures: 0, Errors: 0, Skipped: 0, Time elapsed: 13.166 s - in org.apache.maven.surefire.its.jiras.Surefire772NoSurefireReportsIT
[2019-06-10T08:10:29.467Z] [INFO] Running org.apache.maven.surefire.its.jiras.Surefire772SpecifiedReportsIT
[2019-06-10T08:10:38.976Z] [INFO] Tests run: 3, Failures: 0, Errors: 0, Skipped: 0, Time elapsed: 9.651 s - in org.apache.maven.surefire.its.jiras.Surefire772SpecifiedReportsIT
[2019-06-10T08:10:38.976Z] [INFO] Running org.apache.maven.surefire.its.jiras.Surefire801ForkModeNoneClassLoaderIT
[2019-06-10T08:10:43.152Z] [INFO] Tests run: 1, Failures: 0, Errors: 0, Skipped: 0, Time elapsed: 4.08 s - in org.apache.maven.surefire.its.jiras.Surefire801ForkModeNoneClassLoaderIT
[2019-06-10T08:10:43.152Z] [INFO] Running org.apache.maven.surefire.its.jiras.Surefire803MultiFailsafeExecsIT
[2019-06-10T08:10:57.242Z] [INFO] Tests run: 5, Failures: 0, Errors: 0, Skipped: 0, Time elapsed: 27.178 s - in org.apache.maven.surefire.its.jiras.Surefire621TestCountingJunit3InParallelIT
[2019-06-10T08:10:57.242Z] [INFO] Running org.apache.maven.surefire.its.jiras.Surefire628ConsoleOutputBeforeAndAfterClassIT
[2019-06-10T08:11:00.432Z] [INFO] Tests run: 1, Failures: 0, Errors: 0, Skipped: 0, Time elapsed: 5.144 s - in org.apache.maven.surefire.its.jiras.Surefire628ConsoleOutputBeforeAndAfterClassIT
[2019-06-10T08:11:00.432Z] [INFO] Running org.apache.maven.surefire.its.jiras.Surefire634UnsettableSystemPropertiesWarningIT
[2019-06-10T08:11:01.270Z] [INFO] Tests run: 2, Failures: 0, Errors: 0, Skipped: 0, Time elapsed: 18.489 s - in org.apache.maven.surefire.its.jiras.Surefire803MultiFailsafeExecsIT
[2019-06-10T08:11:01.270Z] [INFO] Running org.apache.maven.surefire.its.jiras.Surefire806SpecifiedTestControlsIT
[2019-06-10T08:11:05.687Z] [INFO] Tests run: 1, Failures: 0, Errors: 0, Skipped: 0, Time elapsed: 4.894 s - in org.apache.maven.surefire.its.jiras.Surefire634UnsettableSystemPropertiesWarningIT
[2019-06-10T08:11:05.687Z] [INFO] Running org.apache.maven.surefire.its.jiras.Surefire649EmptyStringSystemPropertiesIT
[2019-06-10T08:11:06.542Z] [WARNING] Tests run: 3, Failures: 0, Errors: 0, Skipped: 2, Time elapsed: 5.283 s - in org.apache.maven.surefire.its.jiras.Surefire806SpecifiedTestControlsIT
[2019-06-10T08:11:06.543Z] [INFO] Running org.apache.maven.surefire.its.jiras.Surefire809GroupExpressionsIT
[2019-06-10T08:11:13.502Z] [INFO] Tests run: 2, Failures: 0, Errors: 0, Skipped: 0, Time elapsed: 8.18 s - in org.apache.maven.surefire.its.jiras.Surefire649EmptyStringSystemPropertiesIT
[2019-06-10T08:11:13.502Z] [INFO] Running org.apache.maven.surefire.its.jiras.Surefire673MockitoIT
[2019-06-10T08:11:19.990Z] [INFO] Tests run: 1, Failures: 0, Errors: 0, Skipped: 0, Time elapsed: 6.061 s - in org.apache.maven.surefire.its.jiras.Surefire673MockitoIT
[2019-06-10T08:11:19.990Z] [INFO] Running org.apache.maven.surefire.its.jiras.Surefire674BuildFailingWhenErrorsIT
[2019-06-10T08:11:24.155Z] [INFO] Tests run: 1, Failures: 0, Errors: 0, Skipped: 0, Time elapsed: 4.946 s - in org.apache.maven.surefire.its.jiras.Surefire674BuildFailingWhenErrorsIT
[2019-06-10T08:11:24.155Z] [INFO] Running org.apache.maven.surefire.its.jiras.Surefire674BuildFailingWhenFailsafeErrorsIT
[2019-06-10T08:11:32.097Z] [INFO] Tests run: 1, Failures: 0, Errors: 0, Skipped: 0, Time elapsed: 6.998 s - in org.apache.maven.surefire.its.jiras.Surefire674BuildFailingWhenFailsafeErrorsIT
[2019-06-10T08:11:32.097Z] [INFO] Running org.apache.maven.surefire.its.jiras.Surefire685CommaSeparatedIncludesIT
[2019-06-10T08:11:36.268Z] [INFO] Tests run: 1, Failures: 0, Errors: 0, Skipped: 0, Time elapsed: 4.86 s - in org.apache.maven.surefire.its.jiras.Surefire685CommaSeparatedIncludesIT
[2019-06-10T08:11:36.268Z] [INFO] Running org.apache.maven.surefire.its.jiras.Surefire697NiceSummaryIT
[2019-06-10T08:11:40.810Z] [INFO] Tests run: 6, Failures: 0, Errors: 0, Skipped: 0, Time elapsed: 32.654 s - in org.apache.maven.surefire.its.jiras.Surefire809GroupExpressionsIT
[2019-06-10T08:11:40.810Z] [INFO] Running org.apache.maven.surefire.its.jiras.Surefire812Log4JClassLoaderIT
[2019-06-10T08:11:41.515Z] [INFO] Tests run: 1, Failures: 0, Errors: 0, Skipped: 0, Time elapsed: 4.544 s - in org.apache.maven.surefire.its.jiras.Surefire697NiceSummaryIT
[2019-06-10T08:11:41.515Z] [INFO] Running org.apache.maven.surefire.its.jiras.Surefire705ParallelForkTimeoutIT
[2019-06-10T08:11:46.067Z] [INFO] Tests run: 1, Failures: 0, Errors: 0, Skipped: 0, Time elapsed: 6.444 s - in org.apache.maven.surefire.its.jiras.Surefire812Log4JClassLoaderIT
[2019-06-10T08:11:46.067Z] [INFO] Running org.apache.maven.surefire.its.jiras.Surefire817SystemExitIT
[2019-06-10T08:11:47.965Z] [INFO] Tests run: 1, Failures: 0, Errors: 0, Skipped: 0, Time elapsed: 6.915 s - in org.apache.maven.surefire.its.jiras.Surefire705ParallelForkTimeoutIT
[2019-06-10T08:11:47.965Z] [INFO] Running org.apache.maven.surefire.its.jiras.Surefire733AllOverrridesCapturedIT
[2019-06-10T08:11:51.321Z] [INFO] Tests run: 1, Failures: 0, Errors: 0, Skipped: 0, Time elapsed: 5.392 s - in org.apache.maven.surefire.its.jiras.Surefire817SystemExitIT
[2019-06-10T08:11:51.321Z] [INFO] Running org.apache.maven.surefire.its.jiras.Surefire818NpeIgnoresTestsIT
[2019-06-10T08:11:52.283Z] [INFO] Tests run: 1, Failures: 0, Errors: 0, Skipped: 0, Time elapsed: 4.754 s - in org.apache.maven.surefire.its.jiras.Surefire733AllOverrridesCapturedIT
[2019-06-10T08:11:52.283Z] [INFO] Running org.apache.maven.surefire.its.jiras.Surefire735ForkFailWithRedirectConsoleOutputIT
[2019-06-10T08:11:57.799Z] [INFO] Tests run: 1, Failures: 0, Errors: 0, Skipped: 0, Time elapsed: 6.218 s - in org.apache.maven.surefire.its.jiras.Surefire818NpeIgnoresTestsIT
[2019-06-10T08:11:57.799Z] [INFO] Running org.apache.maven.surefire.its.jiras.Surefire828EmptyGroupExprIT
[2019-06-10T08:12:01.662Z] [INFO] Tests run: 2, Failures: 0, Errors: 0, Skipped: 0, Time elapsed: 8.286 s - in org.apache.maven.surefire.its.jiras.Surefire735ForkFailWithRedirectConsoleOutputIT
[2019-06-10T08:12:01.662Z] [INFO] Running org.apache.maven.surefire.its.jiras.Surefire740TruncatedCommaIT
[2019-06-10T08:12:06.911Z] [INFO] Tests run: 1, Failures: 0, Errors: 0, Skipped: 0, Time elapsed: 5.92 s - in org.apache.maven.surefire.its.jiras.Surefire740TruncatedCommaIT
[2019-06-10T08:12:06.911Z] [INFO] Running org.apache.maven.surefire.its.jiras.Surefire747MethodParallelWithSuiteCountIT
[2019-06-10T08:12:22.689Z] [INFO] Tests run: 4, Failures: 0, Errors: 0, Skipped: 0, Time elapsed: 22.215 s - in org.apache.maven.surefire.its.jiras.Surefire828EmptyGroupExprIT
[2019-06-10T08:12:22.689Z] [INFO] Running org.apache.maven.surefire.its.jiras.Surefire832ProviderSelectionIT
[2019-06-10T08:12:24.988Z] [INFO] Tests run: 1, Failures: 0, Errors: 0, Skipped: 0, Time elapsed: 5.919 s - in org.apache.maven.surefire.its.jiras.Surefire832ProviderSelectionIT
[2019-06-10T08:12:24.988Z] [INFO] Running org.apache.maven.surefire.its.jiras.Surefire839TestWithoutCategoriesIT
[2019-06-10T08:12:28.116Z] [INFO] Tests run: 2, Failures: 0, Errors: 0, Skipped: 0, Time elapsed: 20.343 s - in org.apache.maven.surefire.its.jiras.Surefire747MethodParallelWithSuiteCountIT
[2019-06-10T08:12:28.116Z] [INFO] Running org.apache.maven.surefire.its.jiras.Surefire772BothReportsIT
[2019-06-10T08:12:37.454Z] [INFO] Tests run: 3, Failures: 0, Errors: 0, Skipped: 0, Time elapsed: 9.776 s - in org.apache.maven.surefire.its.jiras.Surefire772BothReportsIT
[2019-06-10T08:12:37.454Z] [INFO] Running org.apache.maven.surefire.its.jiras.Surefire772NoFailsafeReportsIT
[2019-06-10T08:12:38.196Z] [INFO] Tests run: 2, Failures: 0, Errors: 0, Skipped: 0, Time elapsed: 11.243 s - in org.apache.maven.surefire.its.jiras.Surefire839TestWithoutCategoriesIT
[2019-06-10T08:12:38.196Z] [INFO] Running org.apache.maven.surefire.its.jiras.Surefire847AdditionalFailureIT
[2019-06-10T08:12:43.452Z] [INFO] Tests run: 1, Failures: 0, Errors: 0, Skipped: 0, Time elapsed: 6.456 s - in org.apache.maven.surefire.its.jiras.Surefire847AdditionalFailureIT
[2019-06-10T08:12:43.452Z] [INFO] Running org.apache.maven.surefire.its.jiras.Surefire855AllowFailsafeUseArtifactFileIT
[2019-06-10T08:12:50.545Z] [INFO] Tests run: 4, Failures: 0, Errors: 0, Skipped: 0, Time elapsed: 13.389 s - in org.apache.maven.surefire.its.jiras.Surefire772NoFailsafeReportsIT
[2019-06-10T08:12:50.546Z] [INFO] Running org.apache.maven.surefire.its.jiras.Surefire772NoSurefireReportsIT
[2019-06-10T08:13:03.643Z] [INFO] Tests run: 4, Failures: 0, Errors: 0, Skipped: 0, Time elapsed: 13.161 s - in org.apache.maven.surefire.its.jiras.Surefire772NoSurefireReportsIT
[2019-06-10T08:13:03.643Z] [INFO] Running org.apache.maven.surefire.its.jiras.Surefire772SpecifiedReportsIT
[2019-06-10T08:13:14.728Z] [INFO] Tests run: 3, Failures: 0, Errors: 0, Skipped: 0, Time elapsed: 9.857 s - in org.apache.maven.surefire.its.jiras.Surefire772SpecifiedReportsIT
[2019-06-10T08:13:14.728Z] [INFO] Running org.apache.maven.surefire.its.jiras.Surefire801ForkModeNoneClassLoaderIT
[2019-06-10T08:13:17.025Z] [INFO] Tests run: 1, Failures: 0, Errors: 0, Skipped: 0, Time elapsed: 3.977 s - in org.apache.maven.surefire.its.jiras.Surefire801ForkModeNoneClassLoaderIT
[2019-06-10T08:13:17.025Z] [INFO] Running org.apache.maven.surefire.its.jiras.Surefire803MultiFailsafeExecsIT
[2019-06-10T08:13:30.792Z] [INFO] Tests run: 4, Failures: 0, Errors: 0, Skipped: 0, Time elapsed: 43.827 s - in org.apache.maven.surefire.its.jiras.Surefire855AllowFailsafeUseArtifactFileIT
[2019-06-10T08:13:30.793Z] [INFO] Running org.apache.maven.surefire.its.jiras.Surefire901MIssingResultfileWhenNoTestsIT
[2019-06-10T08:13:31.504Z] [INFO] Tests run: 1, Failures: 0, Errors: 0, Skipped: 0, Time elapsed: 4.405 s - in org.apache.maven.surefire.its.jiras.Surefire901MIssingResultfileWhenNoTestsIT
[2019-06-10T08:13:31.504Z] [INFO] Running org.apache.maven.surefire.its.jiras.Surefire907PerThreadWithoutThreadCountIT
[2019-06-10T08:13:35.184Z] [INFO] Tests run: 2, Failures: 0, Errors: 0, Skipped: 0, Time elapsed: 17.404 s - in org.apache.maven.surefire.its.jiras.Surefire803MultiFailsafeExecsIT
[2019-06-10T08:13:35.184Z] [INFO] Running org.apache.maven.surefire.its.jiras.Surefire806SpecifiedTestControlsIT
[2019-06-10T08:13:35.678Z] [INFO] Tests run: 1, Failures: 0, Errors: 0, Skipped: 0, Time elapsed: 4.075 s - in org.apache.maven.surefire.its.jiras.Surefire907PerThreadWithoutThreadCountIT
[2019-06-10T08:13:35.678Z] [INFO] Running org.apache.maven.surefire.its.jiras.Surefire920TestFailureIgnoreWithTimeoutIT
[2019-06-10T08:13:39.349Z] [WARNING] Tests run: 3, Failures: 0, Errors: 0, Skipped: 2, Time elapsed: 4.63 s - in org.apache.maven.surefire.its.jiras.Surefire806SpecifiedTestControlsIT
[2019-06-10T08:13:39.349Z] [INFO] Running org.apache.maven.surefire.its.jiras.Surefire809GroupExpressionsIT
[2019-06-10T08:13:48.782Z] [INFO] Tests run: 2, Failures: 0, Errors: 0, Skipped: 0, Time elapsed: 12.456 s - in org.apache.maven.surefire.its.jiras.Surefire920TestFailureIgnoreWithTimeoutIT
[2019-06-10T08:13:48.782Z] [INFO] Running org.apache.maven.surefire.its.jiras.Surefire926FailureWith2ProvidersIT
[2019-06-10T08:13:51.974Z] [INFO] Tests run: 1, Failures: 0, Errors: 0, Skipped: 0, Time elapsed: 3.83 s - in org.apache.maven.surefire.its.jiras.Surefire926FailureWith2ProvidersIT
[2019-06-10T08:13:51.974Z] [INFO] Running org.apache.maven.surefire.its.jiras.Surefire930TestNgSuiteXmlIT
[2019-06-10T08:13:58.437Z] [INFO] Tests run: 1, Failures: 0, Errors: 0, Skipped: 0, Time elapsed: 6.255 s - in org.apache.maven.surefire.its.jiras.Surefire930TestNgSuiteXmlIT
[2019-06-10T08:13:58.437Z] [INFO] Running org.apache.maven.surefire.its.jiras.Surefire943ReportContentIT
Aborted by tibordigana
[2019-06-10T08:13:58.841Z] Sending interrupt signal to process
[2019-06-10T08:14:00.161Z] Sending interrupt signal to process
[2019-06-10T08:14:00.551Z] [INFO]
[2019-06-10T08:14:00.551Z] [INFO] Results:
[2019-06-10T08:14:00.551Z] [INFO]
[2019-06-10T08:14:00.551Z] [WARNING] Tests run: 747, Failures: 0, Errors: 0, Skipped: 162
[2019-06-10T08:14:00.551Z] [INFO]
[2019-06-10T08:14:00.551Z] [INFO]
[2019-06-10T08:14:00.551Z] [INFO] --- maven-checkstyle-plugin:3.0.0:check (checkstyle-check) @ surefire-its ---
[2019-06-10T08:14:00.857Z] script returned exit code 143
[Pipeline] // node
[Pipeline] // node
[Pipeline] // node
[Pipeline] // node
[2019-06-10T08:14:01.504Z] Sending interrupt signal to process
[2019-06-10T08:14:01.645Z] [INFO]
[2019-06-10T08:14:01.645Z] [INFO] Results:
[2019-06-10T08:14:01.645Z] [INFO]
[2019-06-10T08:14:01.645Z] [ERROR] Failures:
[2019-06-10T08:14:01.645Z] [ERROR] JUnitPlatformEnginesIT.platform:111
[2019-06-10T08:14:01.645Z] Expected: <[\[DEBUG\] test\(compact\) classpath: test-classes classes junit-jupiter-engine-5\.4\.0-SNAPSHOT\.jar apiguardian-api-1\.0\.0\.jar junit-platform-engine-1\.4\.0-SNAPSHOT\.jar junit-platform-commons-1\.4\.0-SNAPSHOT\.jar opentest4j-1\.1\.1\.jar junit-jupiter-api-5\.4\.0-SNAPSHOT\.jar]>
[2019-06-10T08:14:01.645Z] but: was <[[DEBUG] test(compact) classpath: test-classes classes junit-jupiter-engine-5.4.0-SNAPSHOT.jar apiguardian-api-1.0.0.jar junit-platform-engine-1.4.0-SNAPSHOT.jar opentest4j-1.1.1.jar junit-platform-commons-1.4.0-SNAPSHOT.jar junit-jupiter-api-5.4.0-SNAPSHOT.jar]>
[2019-06-10T08:14:01.645Z] [INFO]
[2019-06-10T08:14:01.645Z] [ERROR] Tests run: 774, Failures: 1, Errors: 0, Skipped: 134
[2019-06-10T08:14:01.645Z] [INFO]
[2019-06-10T08:14:01.645Z] [INFO]
[2019-06-10T08:14:01.645Z] [INFO] --- maven-checkstyle-plugin:3.0.0:check (checkstyle-check) @ surefire-its ---
[Pipeline] }
Failed in branch windows-jdk12-maven3.6.x
[Pipeline] }
Failed in branch windows-jdk11-maven3.6.x
[Pipeline] }
Failed in branch windows-jdk8-maven3.6.x
[Pipeline] }
[2019-06-10T08:14:01.954Z] script returned exit code 143
Failed in branch windows-jdk7-maven3.6.x
[Pipeline] }
[Pipeline] // withEnv
[Pipeline] }
[Pipeline] }
[Pipeline] // withEnv
[Pipeline] // stage
[Pipeline] }
[Pipeline] fileExists
[Pipeline] // stage
[Pipeline] fileExists
[Pipeline] zip
[Pipeline] zip
[2019-06-10T08:14:02.809Z] Writing zip file of /home/jenkins/jenkins-slave/workspace/en-box_maven-surefire_deployment@2/maven-failsafe-plugin/target/it to /home/jenkins/jenkins-slave/workspace/en-box_maven-surefire_deployment@2/maven-failsafe-plugin--linux-jdk7-maven3.6.x.zip
[2019-06-10T08:14:02.852Z] Writing zip file of /home/jenkins/jenkins-slave/workspace/en-box_maven-surefire_deployment@2/maven-failsafe-plugin/target/it to /home/jenkins/jenkins-slave/workspace/en-box_maven-surefire_deployment@2/maven-failsafe-plugin--linux-jdk11-maven3.6.x.zip
[2019-06-10T08:14:02.998Z] Zipped 78 entries.
[2019-06-10T08:14:02.998Z] Archiving /home/jenkins/jenkins-slave/workspace/en-box_maven-surefire_deployment@2/maven-failsafe-plugin--linux-jdk7-maven3.6.x.zip
[2019-06-10T08:14:02.999Z] [Fast Archiver] No prior successful build to compare, so performing full copy of artifacts
[2019-06-10T08:14:03.052Z] Zipped 78 entries.
[2019-06-10T08:14:03.052Z] Archiving /home/jenkins/jenkins-slave/workspace/en-box_maven-surefire_deployment@2/maven-failsafe-plugin--linux-jdk11-maven3.6.x.zip
[2019-06-10T08:14:03.053Z] [Fast Archiver] No prior successful build to compare, so performing full copy of artifacts
[Pipeline] fileExists
[Pipeline] fileExists
[Pipeline] zip
[Pipeline] zip
[2019-06-10T08:14:04.119Z] Writing zip file of /home/jenkins/jenkins-slave/workspace/en-box_maven-surefire_deployment@2/surefire-its/target to /home/jenkins/jenkins-slave/workspace/en-box_maven-surefire_deployment@2/surefire-its--linux-jdk7-maven3.6.x.zip
[2019-06-10T08:14:04.156Z] Writing zip file of /home/jenkins/jenkins-slave/workspace/en-box_maven-surefire_deployment@2/surefire-its/target to /home/jenkins/jenkins-slave/workspace/en-box_maven-surefire_deployment@2/surefire-its--linux-jdk11-maven3.6.x.zip
[2019-06-10T08:14:11.508Z] Zipped 15113 entries.
[2019-06-10T08:14:11.509Z] Archiving /home/jenkins/jenkins-slave/workspace/en-box_maven-surefire_deployment@2/surefire-its--linux-jdk7-maven3.6.x.zip
[2019-06-10T08:14:11.509Z] [Fast Archiver] No prior successful build to compare, so performing full copy of artifacts
[2019-06-10T08:14:11.626Z] Zipped 16203 entries.
[2019-06-10T08:14:11.626Z] Archiving /home/jenkins/jenkins-slave/workspace/en-box_maven-surefire_deployment@2/surefire-its--linux-jdk11-maven3.6.x.zip
[2019-06-10T08:14:11.627Z] [Fast Archiver] No prior successful build to compare, so performing full copy of artifacts
Click here to forcibly terminate running steps
[Pipeline] archiveArtifacts
[2019-06-10T08:14:14.042Z] Archiving artifacts
[2019-06-10T08:14:14.201Z] [Fast Archiver] No prior successful build to compare, so performing full copy of artifacts
[Pipeline] archiveArtifacts
[2019-06-10T08:14:14.750Z] Archiving artifacts
[2019-06-10T08:14:14.911Z] [Fast Archiver] No prior successful build to compare, so performing full copy of artifacts
[Pipeline] cleanWs
[2019-06-10T08:14:16.088Z] [WS-CLEANUP] Deleting project workspace...
[2019-06-10T08:14:16.088Z] [WS-CLEANUP] Deferred wipeout is used...
[2019-06-10T08:14:16.401Z] [WS-CLEANUP] done
[Pipeline] }
[Pipeline] // ws
[Pipeline] }
[Pipeline] // timestamps
[Pipeline] }
[Pipeline] // node
[Pipeline] }
Failed in branch linux-jdk7-maven3.6.x
[Pipeline] cleanWs
[2019-06-10T08:14:17.458Z] [WS-CLEANUP] Deleting project workspace...
[2019-06-10T08:14:17.458Z] [WS-CLEANUP] Deferred wipeout is used...
[2019-06-10T08:14:17.772Z] [WS-CLEANUP] done
[Pipeline] }
[Pipeline] // ws
[Pipeline] }
[Pipeline] // timestamps
[Pipeline] }
[Pipeline] // node
[Pipeline] }
Failed in branch linux-jdk11-maven3.6.x
[Pipeline] // parallel
[Pipeline] echo
org.jenkinsci.plugins.workflow.steps.FlowInterruptedException: org.jenkinsci.plugins.workflow.steps.FlowInterruptedException
[Pipeline] echo
Build result: FAILURE
[Pipeline] jiraIssueSelector
[Pipeline] emailext
Build failed in Jenkins: Maven TLP » maven-surefire » deployment #6
Posted by Apache Jenkins Server <je...@builds.apache.org>.
See https://builds.apache.org/job/maven-box/job/maven-surefire/job/deployment/6/
Changes:
* [MNG-6573] Use Maven 3.6.0 as default
* H39 has weird issues, exclude it for now
* Fix no access to currentBuild.rawBuild
* fixed typo
* Include more recent JDKs
1 tests failed.
FAILED: org.apache.maven.surefire.its.JUnitPlatformEnginesIT.platform[1.4.0-SNAPSHOT]
Error Message:
Expected: <[\[DEBUG\] test\(compact\) classpath: test-classes classes junit-jupiter-engine-5\.4\.0-SNAPSHOT\.jar apiguardian-api-1\.0\.0\.jar junit-platform-engine-1\.4\.0-SNAPSHOT\.jar junit-platform-commons-1\.4\.0-SNAPSHOT\.jar opentest4j-1\.1\.1\.jar junit-jupiter-api-5\.4\.0-SNAPSHOT\.jar]>
but: was <[[DEBUG] test(compact) classpath: test-classes classes junit-jupiter-engine-5.4.0-SNAPSHOT.jar apiguardian-api-1.0.0.jar junit-platform-engine-1.4.0-SNAPSHOT.jar opentest4j-1.1.1.jar junit-platform-commons-1.4.0-SNAPSHOT.jar junit-jupiter-api-5.4.0-SNAPSHOT.jar]>
Stack Trace:
java.lang.AssertionError:
Expected: <[\[DEBUG\] test\(compact\) classpath: test-classes classes junit-jupiter-engine-5\.4\.0-SNAPSHOT\.jar apiguardian-api-1\.0\.0\.jar junit-platform-engine-1\.4\.0-SNAPSHOT\.jar junit-platform-commons-1\.4\.0-SNAPSHOT\.jar opentest4j-1\.1\.1\.jar junit-jupiter-api-5\.4\.0-SNAPSHOT\.jar]>
but: was <[[DEBUG] test(compact) classpath: test-classes classes junit-jupiter-engine-5.4.0-SNAPSHOT.jar apiguardian-api-1.0.0.jar junit-platform-engine-1.4.0-SNAPSHOT.jar opentest4j-1.1.1.jar junit-platform-commons-1.4.0-SNAPSHOT.jar junit-jupiter-api-5.4.0-SNAPSHOT.jar]>
at org.apache.maven.surefire.its.JUnitPlatformEnginesIT.platform(JUnitPlatformEnginesIT.java:111)
Build log:
[...truncated 47118 lines...]
[2019-06-04T10:58:14.032Z] [INFO] Tests run: 1, Failures: 0, Errors: 0, Skipped: 0, Time elapsed: 10.096 s - in org.apache.maven.surefire.its.jiras.Surefire408ManualProviderSelectionIT
[2019-06-04T10:58:14.032Z] [INFO] Running org.apache.maven.surefire.its.jiras.Surefire42NotExtendingTestCaseIT
[2019-06-04T10:58:24.869Z] [INFO] Tests run: 1, Failures: 0, Errors: 0, Skipped: 0, Time elapsed: 10.183 s - in org.apache.maven.surefire.its.jiras.Surefire42NotExtendingTestCaseIT
[2019-06-04T10:58:24.869Z] [INFO] Running org.apache.maven.surefire.its.jiras.Surefire44InnerClassTestIT
[2019-06-04T10:58:34.018Z] [INFO] Tests run: 1, Failures: 0, Errors: 0, Skipped: 0, Time elapsed: 9.894 s - in org.apache.maven.surefire.its.jiras.Surefire44InnerClassTestIT
[2019-06-04T10:58:34.018Z] [INFO] Running org.apache.maven.surefire.its.jiras.Surefire500PuzzlingErrorIT
[2019-06-04T10:58:42.744Z] [INFO] Tests run: 1, Failures: 0, Errors: 0, Skipped: 0, Time elapsed: 9.038 s - in org.apache.maven.surefire.its.jiras.Surefire500PuzzlingErrorIT
[2019-06-04T10:58:42.744Z] [INFO] Running org.apache.maven.surefire.its.jiras.Surefire510TestClassPathForkModesIT
[2019-06-04T10:59:02.115Z] [INFO] Tests run: 2, Failures: 0, Errors: 0, Skipped: 0, Time elapsed: 18.344 s - in org.apache.maven.surefire.its.jiras.Surefire510TestClassPathForkModesIT
[2019-06-04T10:59:02.115Z] [INFO] Running org.apache.maven.surefire.its.jiras.Surefire569RunTestFromDependencyJarsIT
[2019-06-04T10:59:11.232Z] [INFO] Tests run: 1, Failures: 0, Errors: 0, Skipped: 0, Time elapsed: 9.957 s - in org.apache.maven.surefire.its.jiras.Surefire569RunTestFromDependencyJarsIT
[2019-06-04T10:59:11.232Z] [INFO] Running org.apache.maven.surefire.its.jiras.Surefire570MultipleReportDirectoriesIT
[2019-06-04T11:00:09.299Z] [INFO] Tests run: 2, Failures: 0, Errors: 0, Skipped: 0, Time elapsed: 51.317 s - in org.apache.maven.surefire.its.jiras.Surefire570MultipleReportDirectoriesIT
[2019-06-04T11:00:09.300Z] [INFO] Running org.apache.maven.surefire.its.jiras.Surefire613TestCountInParallelIT
[2019-06-04T11:00:12.131Z] [INFO] Tests run: 1, Failures: 0, Errors: 0, Skipped: 0, Time elapsed: 9.903 s - in org.apache.maven.surefire.its.jiras.Surefire613TestCountInParallelIT
[2019-06-04T11:00:12.131Z] [INFO] Running org.apache.maven.surefire.its.jiras.Surefire621TestCountingJunit3InParallelIT
[2019-06-04T11:01:10.088Z] [INFO] Tests run: 5, Failures: 0, Errors: 0, Skipped: 0, Time elapsed: 50.874 s - in org.apache.maven.surefire.its.jiras.Surefire621TestCountingJunit3InParallelIT
[2019-06-04T11:01:10.088Z] [INFO] Running org.apache.maven.surefire.its.jiras.Surefire628ConsoleOutputBeforeAndAfterClassIT
[2019-06-04T11:01:13.065Z] [INFO] Tests run: 1, Failures: 0, Errors: 0, Skipped: 0, Time elapsed: 9.848 s - in org.apache.maven.surefire.its.jiras.Surefire628ConsoleOutputBeforeAndAfterClassIT
[2019-06-04T11:01:13.065Z] [INFO] Running org.apache.maven.surefire.its.jiras.Surefire634UnsettableSystemPropertiesWarningIT
[2019-06-04T11:01:22.027Z] [INFO] Tests run: 1, Failures: 0, Errors: 0, Skipped: 0, Time elapsed: 8.232 s - in org.apache.maven.surefire.its.jiras.Surefire634UnsettableSystemPropertiesWarningIT
[2019-06-04T11:01:22.027Z] [INFO] Running org.apache.maven.surefire.its.jiras.Surefire649EmptyStringSystemPropertiesIT
[2019-06-04T11:01:35.539Z] [INFO] Tests run: 2, Failures: 0, Errors: 0, Skipped: 0, Time elapsed: 14.411 s - in org.apache.maven.surefire.its.jiras.Surefire649EmptyStringSystemPropertiesIT
[2019-06-04T11:01:35.539Z] [INFO] Running org.apache.maven.surefire.its.jiras.Surefire673MockitoIT
[2019-06-04T11:01:48.748Z] [INFO] Tests run: 1, Failures: 0, Errors: 0, Skipped: 0, Time elapsed: 11.067 s - in org.apache.maven.surefire.its.jiras.Surefire673MockitoIT
[2019-06-04T11:01:48.748Z] [INFO] Running org.apache.maven.surefire.its.jiras.Surefire674BuildFailingWhenErrorsIT
[2019-06-04T11:01:55.874Z] [INFO] Tests run: 1, Failures: 0, Errors: 0, Skipped: 0, Time elapsed: 8.703 s - in org.apache.maven.surefire.its.jiras.Surefire674BuildFailingWhenErrorsIT
[2019-06-04T11:01:55.874Z] [INFO] Running org.apache.maven.surefire.its.jiras.Surefire674BuildFailingWhenFailsafeErrorsIT
[2019-06-04T11:02:11.592Z] [INFO] Tests run: 1, Failures: 0, Errors: 0, Skipped: 0, Time elapsed: 15.487 s - in org.apache.maven.surefire.its.jiras.Surefire674BuildFailingWhenFailsafeErrorsIT
[2019-06-04T11:02:11.592Z] [INFO] Running org.apache.maven.surefire.its.jiras.Surefire685CommaSeparatedIncludesIT
[2019-06-04T11:02:20.536Z] [INFO] Tests run: 1, Failures: 0, Errors: 0, Skipped: 0, Time elapsed: 8.991 s - in org.apache.maven.surefire.its.jiras.Surefire685CommaSeparatedIncludesIT
[2019-06-04T11:02:20.536Z] [INFO] Running org.apache.maven.surefire.its.jiras.Surefire697NiceSummaryIT
[2019-06-04T11:02:30.025Z] [INFO] Tests run: 1, Failures: 0, Errors: 0, Skipped: 0, Time elapsed: 9.432 s - in org.apache.maven.surefire.its.jiras.Surefire697NiceSummaryIT
[2019-06-04T11:02:30.025Z] [INFO] Running org.apache.maven.surefire.its.jiras.Surefire705ParallelForkTimeoutIT
[2019-06-04T11:02:40.821Z] [INFO] Tests run: 1, Failures: 0, Errors: 0, Skipped: 0, Time elapsed: 11.173 s - in org.apache.maven.surefire.its.jiras.Surefire705ParallelForkTimeoutIT
[2019-06-04T11:02:40.821Z] [INFO] Running org.apache.maven.surefire.its.jiras.Surefire733AllOverrridesCapturedIT
[2019-06-04T11:02:49.715Z] [INFO] Tests run: 1, Failures: 0, Errors: 0, Skipped: 0, Time elapsed: 8.811 s - in org.apache.maven.surefire.its.jiras.Surefire733AllOverrridesCapturedIT
[2019-06-04T11:02:49.715Z] [INFO] Running org.apache.maven.surefire.its.jiras.Surefire735ForkFailWithRedirectConsoleOutputIT
[2019-06-04T11:03:06.026Z] [INFO] Tests run: 2, Failures: 0, Errors: 0, Skipped: 0, Time elapsed: 15.441 s - in org.apache.maven.surefire.its.jiras.Surefire735ForkFailWithRedirectConsoleOutputIT
[2019-06-04T11:03:06.026Z] [INFO] Running org.apache.maven.surefire.its.jiras.Surefire740TruncatedCommaIT
[2019-06-04T11:03:13.602Z] [INFO] Tests run: 1, Failures: 0, Errors: 0, Skipped: 0, Time elapsed: 8.17 s - in org.apache.maven.surefire.its.jiras.Surefire740TruncatedCommaIT
[2019-06-04T11:03:13.602Z] [INFO] Running org.apache.maven.surefire.its.jiras.Surefire747MethodParallelWithSuiteCountIT
[2019-06-04T11:03:47.431Z] [INFO] Tests run: 2, Failures: 0, Errors: 0, Skipped: 0, Time elapsed: 29.198 s - in org.apache.maven.surefire.its.jiras.Surefire747MethodParallelWithSuiteCountIT
[2019-06-04T11:03:47.431Z] [INFO] Running org.apache.maven.surefire.its.jiras.Surefire772BothReportsIT
[2019-06-04T11:03:57.897Z] [INFO] Tests run: 3, Failures: 0, Errors: 0, Skipped: 0, Time elapsed: 15.35 s - in org.apache.maven.surefire.its.jiras.Surefire772BothReportsIT
[2019-06-04T11:03:57.897Z] [INFO] Running org.apache.maven.surefire.its.jiras.Surefire772NoFailsafeReportsIT
[2019-06-04T11:04:20.533Z] [INFO] Tests run: 4, Failures: 0, Errors: 0, Skipped: 0, Time elapsed: 20.152 s - in org.apache.maven.surefire.its.jiras.Surefire772NoFailsafeReportsIT
[2019-06-04T11:04:20.533Z] [INFO] Running org.apache.maven.surefire.its.jiras.Surefire772NoSurefireReportsIT
[2019-06-04T11:04:45.372Z] [INFO] Tests run: 4, Failures: 0, Errors: 0, Skipped: 0, Time elapsed: 24.346 s - in org.apache.maven.surefire.its.jiras.Surefire772NoSurefireReportsIT
[2019-06-04T11:04:45.372Z] [INFO] Running org.apache.maven.surefire.its.jiras.Surefire772SpecifiedReportsIT
[2019-06-04T11:05:00.963Z] [INFO] Tests run: 3, Failures: 0, Errors: 0, Skipped: 0, Time elapsed: 16.937 s - in org.apache.maven.surefire.its.jiras.Surefire772SpecifiedReportsIT
[2019-06-04T11:05:00.963Z] [INFO] Running org.apache.maven.surefire.its.jiras.Surefire801ForkModeNoneClassLoaderIT
[2019-06-04T11:05:06.686Z] [INFO] Tests run: 1, Failures: 0, Errors: 0, Skipped: 0, Time elapsed: 7.08 s - in org.apache.maven.surefire.its.jiras.Surefire801ForkModeNoneClassLoaderIT
[2019-06-04T11:05:06.687Z] [INFO] Running org.apache.maven.surefire.its.jiras.Surefire803MultiFailsafeExecsIT
[2019-06-04T11:05:46.686Z] [INFO] Tests run: 2, Failures: 0, Errors: 0, Skipped: 0, Time elapsed: 34.576 s - in org.apache.maven.surefire.its.jiras.Surefire803MultiFailsafeExecsIT
[2019-06-04T11:05:46.686Z] [INFO] Running org.apache.maven.surefire.its.jiras.Surefire806SpecifiedTestControlsIT
[2019-06-04T11:05:49.558Z] [WARNING] Tests run: 3, Failures: 0, Errors: 0, Skipped: 2, Time elapsed: 8.692 s - in org.apache.maven.surefire.its.jiras.Surefire806SpecifiedTestControlsIT
[2019-06-04T11:05:49.558Z] [INFO] Running org.apache.maven.surefire.its.jiras.Surefire809GroupExpressionsIT
[2019-06-04T11:06:46.932Z] [INFO] Tests run: 6, Failures: 0, Errors: 0, Skipped: 0, Time elapsed: 51.001 s - in org.apache.maven.surefire.its.jiras.Surefire809GroupExpressionsIT
[2019-06-04T11:06:46.932Z] [INFO] Running org.apache.maven.surefire.its.jiras.Surefire812Log4JClassLoaderIT
[2019-06-04T11:06:49.729Z] [INFO] Tests run: 1, Failures: 0, Errors: 0, Skipped: 0, Time elapsed: 9.053 s - in org.apache.maven.surefire.its.jiras.Surefire812Log4JClassLoaderIT
[2019-06-04T11:06:49.729Z] [INFO] Running org.apache.maven.surefire.its.jiras.Surefire817SystemExitIT
[2019-06-04T11:06:58.305Z] [INFO] Tests run: 1, Failures: 0, Errors: 0, Skipped: 0, Time elapsed: 7.94 s - in org.apache.maven.surefire.its.jiras.Surefire817SystemExitIT
[2019-06-04T11:06:58.305Z] [INFO] Running org.apache.maven.surefire.its.jiras.Surefire818NpeIgnoresTestsIT
[2019-06-04T11:07:08.792Z] [INFO] Tests run: 1, Failures: 0, Errors: 0, Skipped: 0, Time elapsed: 9.685 s - in org.apache.maven.surefire.its.jiras.Surefire818NpeIgnoresTestsIT
[2019-06-04T11:07:08.792Z] [INFO] Running org.apache.maven.surefire.its.jiras.Surefire828EmptyGroupExprIT
[2019-06-04T11:07:48.609Z] [INFO] Tests run: 4, Failures: 0, Errors: 0, Skipped: 0, Time elapsed: 35.106 s - in org.apache.maven.surefire.its.jiras.Surefire828EmptyGroupExprIT
[2019-06-04T11:07:48.609Z] [INFO] Running org.apache.maven.surefire.its.jiras.Surefire832ProviderSelectionIT
[2019-06-04T11:07:52.224Z] [INFO] Tests run: 1, Failures: 0, Errors: 0, Skipped: 0, Time elapsed: 9.363 s - in org.apache.maven.surefire.its.jiras.Surefire832ProviderSelectionIT
[2019-06-04T11:07:52.224Z] [INFO] Running org.apache.maven.surefire.its.jiras.Surefire839TestWithoutCategoriesIT
[2019-06-04T11:08:12.718Z] [INFO] Tests run: 2, Failures: 0, Errors: 0, Skipped: 0, Time elapsed: 18.036 s - in org.apache.maven.surefire.its.jiras.Surefire839TestWithoutCategoriesIT
[2019-06-04T11:08:12.718Z] [INFO] Running org.apache.maven.surefire.its.jiras.Surefire847AdditionalFailureIT
[2019-06-04T11:08:20.998Z] [INFO] Tests run: 1, Failures: 0, Errors: 0, Skipped: 0, Time elapsed: 10.957 s - in org.apache.maven.surefire.its.jiras.Surefire847AdditionalFailureIT
[2019-06-04T11:08:20.998Z] [INFO] Running org.apache.maven.surefire.its.jiras.Surefire855AllowFailsafeUseArtifactFileIT
[2019-06-04T11:09:44.768Z] [INFO] Tests run: 4, Failures: 0, Errors: 0, Skipped: 0, Time elapsed: 79.071 s - in org.apache.maven.surefire.its.jiras.Surefire855AllowFailsafeUseArtifactFileIT
[2019-06-04T11:09:44.768Z] [INFO] Running org.apache.maven.surefire.its.jiras.Surefire901MIssingResultfileWhenNoTestsIT
[2019-06-04T11:09:46.875Z] [INFO] Tests run: 1, Failures: 0, Errors: 0, Skipped: 0, Time elapsed: 6.903 s - in org.apache.maven.surefire.its.jiras.Surefire901MIssingResultfileWhenNoTestsIT
[2019-06-04T11:09:46.875Z] [INFO] Running org.apache.maven.surefire.its.jiras.Surefire907PerThreadWithoutThreadCountIT
[2019-06-04T11:09:53.850Z] [INFO] Tests run: 1, Failures: 0, Errors: 0, Skipped: 0, Time elapsed: 5.893 s - in org.apache.maven.surefire.its.jiras.Surefire907PerThreadWithoutThreadCountIT
[2019-06-04T11:09:53.850Z] [INFO] Running org.apache.maven.surefire.its.jiras.Surefire920TestFailureIgnoreWithTimeoutIT
[2019-06-04T11:10:12.542Z] [INFO] Tests run: 2, Failures: 0, Errors: 0, Skipped: 0, Time elapsed: 17.857 s - in org.apache.maven.surefire.its.jiras.Surefire920TestFailureIgnoreWithTimeoutIT
[2019-06-04T11:10:12.542Z] [INFO] Running org.apache.maven.surefire.its.jiras.Surefire926FailureWith2ProvidersIT
[2019-06-04T11:10:25.943Z] [INFO] Tests run: 1, Failures: 0, Errors: 0, Skipped: 0, Time elapsed: 13.258 s - in org.apache.maven.surefire.its.jiras.Surefire926FailureWith2ProvidersIT
[2019-06-04T11:10:25.943Z] [INFO] Running org.apache.maven.surefire.its.jiras.Surefire930TestNgSuiteXmlIT
[2019-06-04T11:10:35.293Z] [INFO] Tests run: 1, Failures: 0, Errors: 0, Skipped: 0, Time elapsed: 10.49 s - in org.apache.maven.surefire.its.jiras.Surefire930TestNgSuiteXmlIT
[2019-06-04T11:10:35.293Z] [INFO] Running org.apache.maven.surefire.its.jiras.Surefire943ReportContentIT
[2019-06-04T11:11:16.757Z] [INFO] Tests run: 2, Failures: 0, Errors: 0, Skipped: 0, Time elapsed: 38.044 s - in org.apache.maven.surefire.its.jiras.Surefire943ReportContentIT
[2019-06-04T11:11:16.757Z] [INFO] Running org.apache.maven.surefire.its.jiras.Surefire946KillMainProcessInReusableForkIT
[2019-06-04T11:11:44.853Z] [INFO] Tests run: 3, Failures: 0, Errors: 0, Skipped: 0, Time elapsed: 28.615 s - in org.apache.maven.surefire.its.jiras.Surefire946KillMainProcessInReusableForkIT
[2019-06-04T11:11:44.853Z] [INFO] Running org.apache.maven.surefire.its.jiras.Surefire972BizarreNoClassDefIT
[2019-06-04T11:11:55.273Z] [INFO] Tests run: 1, Failures: 0, Errors: 0, Skipped: 0, Time elapsed: 12.961 s - in org.apache.maven.surefire.its.jiras.Surefire972BizarreNoClassDefIT
[2019-06-04T11:11:55.273Z] [INFO] Running org.apache.maven.surefire.its.jiras.Surefire975DefaultVMEncodingIT
[2019-06-04T11:12:04.544Z] [INFO] Tests run: 1, Failures: 0, Errors: 0, Skipped: 0, Time elapsed: 8.947 s - in org.apache.maven.surefire.its.jiras.Surefire975DefaultVMEncodingIT
[2019-06-04T11:12:04.544Z] [INFO] Running org.apache.maven.surefire.its.jiras.Surefire979WrongClassLoaderIT
[2019-06-04T11:12:11.490Z] [INFO] Tests run: 1, Failures: 0, Errors: 0, Skipped: 0, Time elapsed: 8.038 s - in org.apache.maven.surefire.its.jiras.Surefire979WrongClassLoaderIT
[2019-06-04T11:12:11.490Z] [INFO] Running org.apache.maven.surefire.its.jiras.Surefire985ParameterizedRunnerAndCategoriesIT
[2019-06-04T11:12:18.747Z] [INFO] Tests run: 1, Failures: 0, Errors: 0, Skipped: 0, Time elapsed: 6.448 s - in org.apache.maven.surefire.its.jiras.Surefire985ParameterizedRunnerAndCategoriesIT
[2019-06-04T11:12:18.747Z] [INFO] Running org.apache.maven.surefire.its.jiras.Surefire995CategoryInheritanceIT
[2019-06-04T11:12:58.382Z] [INFO] Tests run: 5, Failures: 0, Errors: 0, Skipped: 0, Time elapsed: 34.38 s - in org.apache.maven.surefire.its.jiras.Surefire995CategoryInheritanceIT
[2019-06-04T11:12:58.383Z] [INFO]
[2019-06-04T11:12:58.383Z] [INFO] Results:
[2019-06-04T11:12:58.383Z] [INFO]
[2019-06-04T11:12:58.383Z] [ERROR] Failures:
[2019-06-04T11:12:58.383Z] [ERROR] JUnitPlatformEnginesIT.platform:111
[2019-06-04T11:12:58.383Z] Expected: <[\[DEBUG\] test\(compact\) classpath: test-classes classes junit-jupiter-engine-5\.4\.0-SNAPSHOT\.jar apiguardian-api-1\.0\.0\.jar junit-platform-engine-1\.4\.0-SNAPSHOT\.jar junit-platform-commons-1\.4\.0-SNAPSHOT\.jar opentest4j-1\.1\.1\.jar junit-jupiter-api-5\.4\.0-SNAPSHOT\.jar]>
[2019-06-04T11:12:58.383Z] but: was <[[DEBUG] test(compact) classpath: test-classes classes junit-jupiter-engine-5.4.0-SNAPSHOT.jar apiguardian-api-1.0.0.jar junit-platform-engine-1.4.0-SNAPSHOT.jar opentest4j-1.1.1.jar junit-platform-commons-1.4.0-SNAPSHOT.jar junit-jupiter-api-5.4.0-SNAPSHOT.jar]>
[2019-06-04T11:12:58.383Z] [INFO]
[2019-06-04T11:12:58.383Z] [ERROR] Tests run: 788, Failures: 1, Errors: 0, Skipped: 150
[2019-06-04T11:12:58.383Z] [INFO]
[2019-06-04T11:12:58.383Z] [INFO]
[2019-06-04T11:12:58.383Z] [INFO] --- maven-checkstyle-plugin:3.0.0:check (checkstyle-check) @ surefire-its ---
[2019-06-04T11:12:58.383Z] [INFO]
[2019-06-04T11:12:58.383Z] [INFO] --- maven-failsafe-plugin:3.0.0-M3:verify (default) @ surefire-its ---
[2019-06-04T11:12:58.383Z] [INFO] Failsafe report directory: C:\Users\jenkins\AppData\Local\Temp\2\jenkins-maven-box-maven-surefire-deployment-6\surefire-its\target\failsafe-reports
[2019-06-04T11:12:58.383Z] [INFO] ------------------------------------------------------------------------
[2019-06-04T11:12:58.383Z] [INFO] Reactor Summary for Apache Maven Surefire 3.0.0-M4-SNAPSHOT:
[2019-06-04T11:12:58.383Z] [INFO]
[2019-06-04T11:12:58.383Z] [INFO] Apache Maven Surefire .............................. SUCCESS [ 53.441 s]
[2019-06-04T11:12:58.383Z] [INFO] SureFire Logger API ................................ SUCCESS [ 11.044 s]
[2019-06-04T11:12:58.383Z] [INFO] SureFire API ....................................... SUCCESS [ 20.206 s]
[2019-06-04T11:12:58.383Z] [INFO] SureFire Booter .................................... SUCCESS [ 21.460 s]
[2019-06-04T11:12:58.383Z] [INFO] Maven Surefire Test-Grouping Support ............... SUCCESS [ 12.934 s]
[2019-06-04T11:12:58.383Z] [INFO] SureFire Providers ................................. SUCCESS [ 2.059 s]
[2019-06-04T11:12:58.383Z] [INFO] Shared JUnit3 Provider Code ........................ SUCCESS [ 7.146 s]
[2019-06-04T11:12:58.383Z] [INFO] Shared Java 5 Provider Base ........................ SUCCESS [ 8.862 s]
[2019-06-04T11:12:58.383Z] [INFO] Shared JUnit4 Provider Code ........................ SUCCESS [ 8.735 s]
[2019-06-04T11:12:58.383Z] [INFO] Shared JUnit48 Provider Code ....................... SUCCESS [ 10.323 s]
[2019-06-04T11:12:58.383Z] [INFO] SureFire JUnit Runner .............................. SUCCESS [ 8.331 s]
[2019-06-04T11:12:58.383Z] [INFO] SureFire JUnit4 Runner ............................. SUCCESS [ 17.081 s]
[2019-06-04T11:12:58.383Z] [INFO] Maven Surefire Common .............................. SUCCESS [ 39.723 s]
[2019-06-04T11:12:58.383Z] [INFO] SureFire JUnitCore Runner .......................... SUCCESS [02:25 min]
[2019-06-04T11:12:58.383Z] [INFO] SureFire JUnit Platform Runner ..................... SUCCESS [ 14.737 s]
[2019-06-04T11:12:58.383Z] [INFO] SureFire TestNG Utils .............................. SUCCESS [ 7.516 s]
[2019-06-04T11:12:58.383Z] [INFO] SureFire TestNG Runner ............................. SUCCESS [ 8.572 s]
[2019-06-04T11:12:58.383Z] [INFO] ShadeFire JUnit3 Provider .......................... SUCCESS [ 4.345 s]
[2019-06-04T11:12:58.383Z] [INFO] Surefire Report Parser ............................. SUCCESS [ 10.551 s]
[2019-06-04T11:12:58.383Z] [INFO] Maven Surefire Plugin .............................. SUCCESS [ 19.487 s]
[2019-06-04T11:12:58.383Z] [INFO] Maven Failsafe Plugin .............................. SUCCESS [02:15 min]
[2019-06-04T11:12:58.383Z] [INFO] Maven Surefire Report Plugin ....................... SUCCESS [ 22.220 s]
[2019-06-04T11:12:58.383Z] [INFO] Maven Surefire Integration Tests ................... FAILURE [ 01:42 h]
[2019-06-04T11:12:58.383Z] [INFO] ------------------------------------------------------------------------
[2019-06-04T11:12:58.383Z] [INFO] BUILD FAILURE
[2019-06-04T11:12:58.383Z] [INFO] ------------------------------------------------------------------------
[2019-06-04T11:12:58.383Z] [INFO] Total time: 01:52 h
[2019-06-04T11:12:58.383Z] [INFO] Finished at: 2019-06-04T04:12:54-07:00
[2019-06-04T11:12:58.383Z] [INFO] ------------------------------------------------------------------------
[2019-06-04T11:12:58.383Z] [ERROR] Failed to execute goal org.apache.maven.plugins:maven-failsafe-plugin:3.0.0-M3:verify (default) on project surefire-its: There are test failures.
[2019-06-04T11:12:58.383Z] [ERROR]
[2019-06-04T11:12:58.383Z] [ERROR] Please refer to C:\Users\jenkins\AppData\Local\Temp\2\jenkins-maven-box-maven-surefire-deployment-6\surefire-its\target\failsafe-reports for the individual test results.
[2019-06-04T11:12:58.383Z] [ERROR] Please refer to dump files (if any exist) [date].dump, [date]-jvmRun[N].dump and [date].dumpstream.
[2019-06-04T11:12:58.383Z] [ERROR] -> [Help 1]
[2019-06-04T11:12:58.383Z] org.apache.maven.lifecycle.LifecycleExecutionException: Failed to execute goal org.apache.maven.plugins:maven-failsafe-plugin:3.0.0-M3:verify (default) on project surefire-its: There are test failures.
[2019-06-04T11:12:58.383Z]
[2019-06-04T11:12:58.383Z] Please refer to C:\Users\jenkins\AppData\Local\Temp\2\jenkins-maven-box-maven-surefire-deployment-6\surefire-its\target\failsafe-reports for the individual test results.
[2019-06-04T11:12:58.383Z] Please refer to dump files (if any exist) [date].dump, [date]-jvmRun[N].dump and [date].dumpstream.
[2019-06-04T11:12:58.383Z] at org.apache.maven.lifecycle.internal.MojoExecutor.execute (MojoExecutor.java:215)
[2019-06-04T11:12:58.383Z] at org.apache.maven.lifecycle.internal.MojoExecutor.execute (MojoExecutor.java:156)
[2019-06-04T11:12:58.383Z] at org.apache.maven.lifecycle.internal.MojoExecutor.execute (MojoExecutor.java:148)
[2019-06-04T11:12:58.383Z] at org.apache.maven.lifecycle.internal.LifecycleModuleBuilder.buildProject (LifecycleModuleBuilder.java:117)
[2019-06-04T11:12:58.383Z] at org.apache.maven.lifecycle.internal.LifecycleModuleBuilder.buildProject (LifecycleModuleBuilder.java:81)
[2019-06-04T11:12:58.383Z] at org.apache.maven.lifecycle.internal.builder.singlethreaded.SingleThreadedBuilder.build (SingleThreadedBuilder.java:56)
[2019-06-04T11:12:58.383Z] at org.apache.maven.lifecycle.internal.LifecycleStarter.execute (LifecycleStarter.java:128)
[2019-06-04T11:12:58.383Z] at org.apache.maven.DefaultMaven.doExecute (DefaultMaven.java:305)
[2019-06-04T11:12:58.383Z] at org.apache.maven.DefaultMaven.doExecute (DefaultMaven.java:192)
[2019-06-04T11:12:58.383Z] at org.apache.maven.DefaultMaven.execute (DefaultMaven.java:105)
[2019-06-04T11:12:58.383Z] at org.apache.maven.cli.MavenCli.execute (MavenCli.java:956)
[2019-06-04T11:12:58.383Z] at org.apache.maven.cli.MavenCli.doMain (MavenCli.java:288)
[2019-06-04T11:12:58.383Z] at org.apache.maven.cli.MavenCli.main (MavenCli.java:192)
[2019-06-04T11:12:58.383Z] at sun.reflect.NativeMethodAccessorImpl.invoke0 (Native Method)
[2019-06-04T11:12:58.383Z] at sun.reflect.NativeMethodAccessorImpl.invoke (NativeMethodAccessorImpl.java:62)
[2019-06-04T11:12:58.383Z] at sun.reflect.DelegatingMethodAccessorImpl.invoke (DelegatingMethodAccessorImpl.java:43)
[2019-06-04T11:12:58.383Z] at java.lang.reflect.Method.invoke (Method.java:498)
[2019-06-04T11:12:58.383Z] at org.codehaus.plexus.classworlds.launcher.Launcher.launchEnhanced (Launcher.java:289)
[2019-06-04T11:12:58.383Z] at org.codehaus.plexus.classworlds.launcher.Launcher.launch (Launcher.java:229)
[2019-06-04T11:12:58.383Z] at org.codehaus.plexus.classworlds.launcher.Launcher.mainWithExitCode (Launcher.java:415)
[2019-06-04T11:12:58.383Z] at org.codehaus.plexus.classworlds.launcher.Launcher.main (Launcher.java:356)
[2019-06-04T11:12:58.383Z] Caused by: org.apache.maven.plugin.MojoFailureException: There are test failures.
[2019-06-04T11:12:58.383Z]
[2019-06-04T11:12:58.383Z] Please refer to C:\Users\jenkins\AppData\Local\Temp\2\jenkins-maven-box-maven-surefire-deployment-6\surefire-its\target\failsafe-reports for the individual test results.
[2019-06-04T11:12:58.383Z] Please refer to dump files (if any exist) [date].dump, [date]-jvmRun[N].dump and [date].dumpstream.
[2019-06-04T11:12:58.383Z] at org.apache.maven.plugin.surefire.SurefireHelper.throwException (SurefireHelper.java:271)
[2019-06-04T11:12:58.383Z] at org.apache.maven.plugin.surefire.SurefireHelper.reportExecution (SurefireHelper.java:159)
[2019-06-04T11:12:58.384Z] at org.apache.maven.plugin.failsafe.VerifyMojo.execute (VerifyMojo.java:192)
[2019-06-04T11:12:58.384Z] at org.apache.maven.plugin.DefaultBuildPluginManager.executeMojo (DefaultBuildPluginManager.java:137)
[2019-06-04T11:12:58.384Z] at org.apache.maven.lifecycle.internal.MojoExecutor.execute (MojoExecutor.java:210)
[2019-06-04T11:12:58.384Z] at org.apache.maven.lifecycle.internal.MojoExecutor.execute (MojoExecutor.java:156)
[2019-06-04T11:12:58.384Z] at org.apache.maven.lifecycle.internal.MojoExecutor.execute (MojoExecutor.java:148)
[2019-06-04T11:12:58.384Z] at org.apache.maven.lifecycle.internal.LifecycleModuleBuilder.buildProject (LifecycleModuleBuilder.java:117)
[2019-06-04T11:12:58.384Z] at org.apache.maven.lifecycle.internal.LifecycleModuleBuilder.buildProject (LifecycleModuleBuilder.java:81)
[2019-06-04T11:12:58.384Z] at org.apache.maven.lifecycle.internal.builder.singlethreaded.SingleThreadedBuilder.build (SingleThreadedBuilder.java:56)
[2019-06-04T11:12:58.384Z] at org.apache.maven.lifecycle.internal.LifecycleStarter.execute (LifecycleStarter.java:128)
[2019-06-04T11:12:58.384Z] at org.apache.maven.DefaultMaven.doExecute (DefaultMaven.java:305)
[2019-06-04T11:12:58.384Z] at org.apache.maven.DefaultMaven.doExecute (DefaultMaven.java:192)
[2019-06-04T11:12:58.384Z] at org.apache.maven.DefaultMaven.execute (DefaultMaven.java:105)
[2019-06-04T11:12:58.384Z] at org.apache.maven.cli.MavenCli.execute (MavenCli.java:956)
[2019-06-04T11:12:58.384Z] at org.apache.maven.cli.MavenCli.doMain (MavenCli.java:288)
[2019-06-04T11:12:58.384Z] at org.apache.maven.cli.MavenCli.main (MavenCli.java:192)
[2019-06-04T11:12:58.384Z] at sun.reflect.NativeMethodAccessorImpl.invoke0 (Native Method)
[2019-06-04T11:12:58.384Z] at sun.reflect.NativeMethodAccessorImpl.invoke (NativeMethodAccessorImpl.java:62)
[2019-06-04T11:12:58.384Z] at sun.reflect.DelegatingMethodAccessorImpl.invoke (DelegatingMethodAccessorImpl.java:43)
[2019-06-04T11:12:58.384Z] at java.lang.reflect.Method.invoke (Method.java:498)
[2019-06-04T11:12:58.384Z] at org.codehaus.plexus.classworlds.launcher.Launcher.launchEnhanced (Launcher.java:289)
[2019-06-04T11:12:58.384Z] at org.codehaus.plexus.classworlds.launcher.Launcher.launch (Launcher.java:229)
[2019-06-04T11:12:58.384Z] at org.codehaus.plexus.classworlds.launcher.Launcher.mainWithExitCode (Launcher.java:415)
[2019-06-04T11:12:58.384Z] at org.codehaus.plexus.classworlds.launcher.Launcher.main (Launcher.java:356)
[2019-06-04T11:12:58.384Z] [ERROR]
[2019-06-04T11:12:58.384Z] [ERROR] Re-run Maven using the -X switch to enable full debug logging.
[2019-06-04T11:12:58.384Z] [ERROR]
[2019-06-04T11:12:58.384Z] [ERROR] For more information about the errors and possible solutions, please read the following articles:
[2019-06-04T11:12:58.384Z] [ERROR] [Help 1] http://cwiki.apache.org/confluence/display/MAVEN/MojoFailureException
[2019-06-04T11:12:58.384Z] [ERROR]
[2019-06-04T11:12:58.384Z] [ERROR] After correcting the problems, you can resume the build with the command
[2019-06-04T11:12:58.384Z] [ERROR] mvn <goals> -rf :surefire-its
[Pipeline] }
[Pipeline] // withEnv
[Pipeline] }
[Pipeline] // stage
[Pipeline] fileExists
[Pipeline] zip
[2019-06-04T11:12:58.664Z] Writing zip file of C:\Users\jenkins\AppData\Local\Temp\2\jenkins-maven-box-maven-surefire-deployment-6\maven-failsafe-plugin\target\it to C:\Users\jenkins\AppData\Local\Temp\2\jenkins-maven-box-maven-surefire-deployment-6\maven-failsafe-plugin--windows-jdk8-maven3.6.x.zip
[2019-06-04T11:12:58.800Z] Zipped 78 entries.
[2019-06-04T11:12:58.800Z] Archiving C:\Users\jenkins\AppData\Local\Temp\2\jenkins-maven-box-maven-surefire-deployment-6\maven-failsafe-plugin--windows-jdk8-maven3.6.x.zip
[2019-06-04T11:12:58.801Z] [Fast Archiver] No prior successful build to compare, so performing full copy of artifacts
[Pipeline] fileExists
[Pipeline] zip
[2019-06-04T11:12:58.981Z] Writing zip file of C:\Users\jenkins\AppData\Local\Temp\2\jenkins-maven-box-maven-surefire-deployment-6\surefire-its\target to C:\Users\jenkins\AppData\Local\Temp\2\jenkins-maven-box-maven-surefire-deployment-6\surefire-its--windows-jdk8-maven3.6.x.zip
[2019-06-04T11:13:13.679Z] Zipped 15951 entries.
[2019-06-04T11:13:13.679Z] Archiving C:\Users\jenkins\AppData\Local\Temp\2\jenkins-maven-box-maven-surefire-deployment-6\surefire-its--windows-jdk8-maven3.6.x.zip
[2019-06-04T11:13:13.680Z] [Fast Archiver] No prior successful build to compare, so performing full copy of artifacts
[Pipeline] archiveArtifacts
[2019-06-04T11:13:15.317Z] Archiving artifacts
[2019-06-04T11:13:15.360Z] [Fast Archiver] No prior successful build to compare, so performing full copy of artifacts
[Pipeline] cleanWs
[2019-06-04T11:13:16.929Z] [WS-CLEANUP] Deleting project workspace...
[2019-06-04T11:13:16.929Z] [WS-CLEANUP] Deferred wipeout is used...
[2019-06-04T11:13:17.063Z] [WS-CLEANUP] done
[Pipeline] }
[Pipeline] // ws
[Pipeline] }
[Pipeline] // timestamps
[Pipeline] }
[Pipeline] // node
[Pipeline] }
[Pipeline] // parallel
[Pipeline] echo
Build result: FAILURE
[Pipeline] jiraIssueSelector
[Pipeline] jiraComment
[Pipeline] emailext
Build failed in Jenkins: Maven TLP » maven-surefire » deployment #5
Posted by Apache Jenkins Server <je...@builds.apache.org>.
See https://builds.apache.org/job/maven-box/job/maven-surefire/job/deployment/5/
No changes.
1 tests failed.
FAILED: org.apache.maven.surefire.its.JUnitPlatformEnginesIT.platform[1.4.0-SNAPSHOT]
Error Message:
Expected: <[\[DEBUG\] test\(compact\) classpath: test-classes classes junit-jupiter-engine-5\.4\.0-SNAPSHOT\.jar apiguardian-api-1\.0\.0\.jar junit-platform-engine-1\.4\.0-SNAPSHOT\.jar junit-platform-commons-1\.4\.0-SNAPSHOT\.jar opentest4j-1\.1\.1\.jar junit-jupiter-api-5\.4\.0-SNAPSHOT\.jar]>
but: was <[[DEBUG] test(compact) classpath: test-classes classes junit-jupiter-engine-5.4.0-SNAPSHOT.jar apiguardian-api-1.0.0.jar junit-platform-engine-1.4.0-SNAPSHOT.jar opentest4j-1.1.1.jar junit-platform-commons-1.4.0-SNAPSHOT.jar junit-jupiter-api-5.4.0-SNAPSHOT.jar]>
Stack Trace:
java.lang.AssertionError:
Expected: <[\[DEBUG\] test\(compact\) classpath: test-classes classes junit-jupiter-engine-5\.4\.0-SNAPSHOT\.jar apiguardian-api-1\.0\.0\.jar junit-platform-engine-1\.4\.0-SNAPSHOT\.jar junit-platform-commons-1\.4\.0-SNAPSHOT\.jar opentest4j-1\.1\.1\.jar junit-jupiter-api-5\.4\.0-SNAPSHOT\.jar]>
but: was <[[DEBUG] test(compact) classpath: test-classes classes junit-jupiter-engine-5.4.0-SNAPSHOT.jar apiguardian-api-1.0.0.jar junit-platform-engine-1.4.0-SNAPSHOT.jar opentest4j-1.1.1.jar junit-platform-commons-1.4.0-SNAPSHOT.jar junit-jupiter-api-5.4.0-SNAPSHOT.jar]>
at org.apache.maven.surefire.its.JUnitPlatformEnginesIT.platform(JUnitPlatformEnginesIT.java:111)
Build log:
[...truncated 47117 lines...]
[2019-04-15T09:44:13.245Z] [INFO] Running org.apache.maven.surefire.its.jiras.Surefire408ManualProviderSelectionIT
[2019-04-15T09:44:26.066Z] [INFO] Tests run: 1, Failures: 0, Errors: 0, Skipped: 0, Time elapsed: 13.234 s - in org.apache.maven.surefire.its.jiras.Surefire408ManualProviderSelectionIT
[2019-04-15T09:44:26.066Z] [INFO] Running org.apache.maven.surefire.its.jiras.Surefire42NotExtendingTestCaseIT
[2019-04-15T09:44:38.875Z] [INFO] Tests run: 1, Failures: 0, Errors: 0, Skipped: 0, Time elapsed: 11.791 s - in org.apache.maven.surefire.its.jiras.Surefire42NotExtendingTestCaseIT
[2019-04-15T09:44:38.875Z] [INFO] Running org.apache.maven.surefire.its.jiras.Surefire44InnerClassTestIT
[2019-04-15T09:44:49.490Z] [INFO] Tests run: 1, Failures: 0, Errors: 0, Skipped: 0, Time elapsed: 12.675 s - in org.apache.maven.surefire.its.jiras.Surefire44InnerClassTestIT
[2019-04-15T09:44:49.490Z] [INFO] Running org.apache.maven.surefire.its.jiras.Surefire500PuzzlingErrorIT
[2019-04-15T09:45:02.370Z] [INFO] Tests run: 1, Failures: 0, Errors: 0, Skipped: 0, Time elapsed: 12.532 s - in org.apache.maven.surefire.its.jiras.Surefire500PuzzlingErrorIT
[2019-04-15T09:45:02.370Z] [INFO] Running org.apache.maven.surefire.its.jiras.Surefire510TestClassPathForkModesIT
[2019-04-15T09:45:29.756Z] [INFO] Tests run: 2, Failures: 0, Errors: 0, Skipped: 0, Time elapsed: 26.247 s - in org.apache.maven.surefire.its.jiras.Surefire510TestClassPathForkModesIT
[2019-04-15T09:45:29.756Z] [INFO] Running org.apache.maven.surefire.its.jiras.Surefire569RunTestFromDependencyJarsIT
[2019-04-15T09:45:40.304Z] [INFO] Tests run: 1, Failures: 0, Errors: 0, Skipped: 0, Time elapsed: 11.446 s - in org.apache.maven.surefire.its.jiras.Surefire569RunTestFromDependencyJarsIT
[2019-04-15T09:45:40.304Z] [INFO] Running org.apache.maven.surefire.its.jiras.Surefire570MultipleReportDirectoriesIT
[2019-04-15T09:46:49.353Z] [INFO] Tests run: 2, Failures: 0, Errors: 0, Skipped: 0, Time elapsed: 66.48 s - in org.apache.maven.surefire.its.jiras.Surefire570MultipleReportDirectoriesIT
[2019-04-15T09:46:49.353Z] [INFO] Running org.apache.maven.surefire.its.jiras.Surefire613TestCountInParallelIT
[2019-04-15T09:47:00.092Z] [INFO] Tests run: 1, Failures: 0, Errors: 0, Skipped: 0, Time elapsed: 13.911 s - in org.apache.maven.surefire.its.jiras.Surefire613TestCountInParallelIT
[2019-04-15T09:47:00.092Z] [INFO] Running org.apache.maven.surefire.its.jiras.Surefire621TestCountingJunit3InParallelIT
[2019-04-15T09:48:08.910Z] [INFO] Tests run: 5, Failures: 0, Errors: 0, Skipped: 0, Time elapsed: 67.771 s - in org.apache.maven.surefire.its.jiras.Surefire621TestCountingJunit3InParallelIT
[2019-04-15T09:48:08.910Z] [INFO] Running org.apache.maven.surefire.its.jiras.Surefire628ConsoleOutputBeforeAndAfterClassIT
[2019-04-15T09:48:24.620Z] [INFO] Tests run: 1, Failures: 0, Errors: 0, Skipped: 0, Time elapsed: 14.098 s - in org.apache.maven.surefire.its.jiras.Surefire628ConsoleOutputBeforeAndAfterClassIT
[2019-04-15T09:48:24.620Z] [INFO] Running org.apache.maven.surefire.its.jiras.Surefire634UnsettableSystemPropertiesWarningIT
[2019-04-15T09:48:35.287Z] [INFO] Tests run: 1, Failures: 0, Errors: 0, Skipped: 0, Time elapsed: 12.038 s - in org.apache.maven.surefire.its.jiras.Surefire634UnsettableSystemPropertiesWarningIT
[2019-04-15T09:48:35.287Z] [INFO] Running org.apache.maven.surefire.its.jiras.Surefire649EmptyStringSystemPropertiesIT
[2019-04-15T09:48:58.089Z] [INFO] Tests run: 2, Failures: 0, Errors: 0, Skipped: 0, Time elapsed: 21.122 s - in org.apache.maven.surefire.its.jiras.Surefire649EmptyStringSystemPropertiesIT
[2019-04-15T09:48:58.089Z] [INFO] Running org.apache.maven.surefire.its.jiras.Surefire673MockitoIT
[2019-04-15T09:49:13.711Z] [INFO] Tests run: 1, Failures: 0, Errors: 0, Skipped: 0, Time elapsed: 16.129 s - in org.apache.maven.surefire.its.jiras.Surefire673MockitoIT
[2019-04-15T09:49:13.711Z] [INFO] Running org.apache.maven.surefire.its.jiras.Surefire674BuildFailingWhenErrorsIT
[2019-04-15T09:49:24.388Z] [INFO] Tests run: 1, Failures: 0, Errors: 0, Skipped: 0, Time elapsed: 13.051 s - in org.apache.maven.surefire.its.jiras.Surefire674BuildFailingWhenErrorsIT
[2019-04-15T09:49:24.388Z] [INFO] Running org.apache.maven.surefire.its.jiras.Surefire674BuildFailingWhenFailsafeErrorsIT
[2019-04-15T09:49:43.184Z] [INFO] Tests run: 1, Failures: 0, Errors: 0, Skipped: 0, Time elapsed: 18.586 s - in org.apache.maven.surefire.its.jiras.Surefire674BuildFailingWhenFailsafeErrorsIT
[2019-04-15T09:49:43.184Z] [INFO] Running org.apache.maven.surefire.its.jiras.Surefire685CommaSeparatedIncludesIT
[2019-04-15T09:49:56.011Z] [INFO] Tests run: 1, Failures: 0, Errors: 0, Skipped: 0, Time elapsed: 11.848 s - in org.apache.maven.surefire.its.jiras.Surefire685CommaSeparatedIncludesIT
[2019-04-15T09:49:56.011Z] [INFO] Running org.apache.maven.surefire.its.jiras.Surefire697NiceSummaryIT
[2019-04-15T09:50:08.903Z] [INFO] Tests run: 1, Failures: 0, Errors: 0, Skipped: 0, Time elapsed: 13.002 s - in org.apache.maven.surefire.its.jiras.Surefire697NiceSummaryIT
[2019-04-15T09:50:08.903Z] [INFO] Running org.apache.maven.surefire.its.jiras.Surefire705ParallelForkTimeoutIT
[2019-04-15T09:50:24.520Z] [INFO] Tests run: 1, Failures: 0, Errors: 0, Skipped: 0, Time elapsed: 15.178 s - in org.apache.maven.surefire.its.jiras.Surefire705ParallelForkTimeoutIT
[2019-04-15T09:50:24.520Z] [INFO] Running org.apache.maven.surefire.its.jiras.Surefire733AllOverrridesCapturedIT
[2019-04-15T09:50:37.347Z] [INFO] Tests run: 1, Failures: 0, Errors: 0, Skipped: 0, Time elapsed: 12.732 s - in org.apache.maven.surefire.its.jiras.Surefire733AllOverrridesCapturedIT
[2019-04-15T09:50:37.347Z] [INFO] Running org.apache.maven.surefire.its.jiras.Surefire735ForkFailWithRedirectConsoleOutputIT
[2019-04-15T09:51:00.401Z] [INFO] Tests run: 2, Failures: 0, Errors: 0, Skipped: 0, Time elapsed: 23.825 s - in org.apache.maven.surefire.its.jiras.Surefire735ForkFailWithRedirectConsoleOutputIT
[2019-04-15T09:51:00.401Z] [INFO] Running org.apache.maven.surefire.its.jiras.Surefire740TruncatedCommaIT
[2019-04-15T09:51:11.703Z] [INFO] Tests run: 1, Failures: 0, Errors: 0, Skipped: 0, Time elapsed: 11.809 s - in org.apache.maven.surefire.its.jiras.Surefire740TruncatedCommaIT
[2019-04-15T09:51:11.703Z] [INFO] Running org.apache.maven.surefire.its.jiras.Surefire747MethodParallelWithSuiteCountIT
[2019-04-15T09:51:51.377Z] [INFO] Tests run: 2, Failures: 0, Errors: 0, Skipped: 0, Time elapsed: 35.397 s - in org.apache.maven.surefire.its.jiras.Surefire747MethodParallelWithSuiteCountIT
[2019-04-15T09:51:51.377Z] [INFO] Running org.apache.maven.surefire.its.jiras.Surefire772BothReportsIT
[2019-04-15T09:52:14.144Z] [INFO] Tests run: 3, Failures: 0, Errors: 0, Skipped: 0, Time elapsed: 25.321 s - in org.apache.maven.surefire.its.jiras.Surefire772BothReportsIT
[2019-04-15T09:52:14.144Z] [INFO] Running org.apache.maven.surefire.its.jiras.Surefire772NoFailsafeReportsIT
[2019-04-15T09:52:54.076Z] [INFO] Tests run: 4, Failures: 0, Errors: 0, Skipped: 0, Time elapsed: 35.306 s - in org.apache.maven.surefire.its.jiras.Surefire772NoFailsafeReportsIT
[2019-04-15T09:52:54.076Z] [INFO] Running org.apache.maven.surefire.its.jiras.Surefire772NoSurefireReportsIT
[2019-04-15T09:53:27.029Z] [INFO] Tests run: 4, Failures: 0, Errors: 0, Skipped: 0, Time elapsed: 36.976 s - in org.apache.maven.surefire.its.jiras.Surefire772NoSurefireReportsIT
[2019-04-15T09:53:27.029Z] [INFO] Running org.apache.maven.surefire.its.jiras.Surefire772SpecifiedReportsIT
[2019-04-15T09:53:49.578Z] [INFO] Tests run: 3, Failures: 0, Errors: 0, Skipped: 0, Time elapsed: 23.219 s - in org.apache.maven.surefire.its.jiras.Surefire772SpecifiedReportsIT
[2019-04-15T09:53:49.578Z] [INFO] Running org.apache.maven.surefire.its.jiras.Surefire801ForkModeNoneClassLoaderIT
[2019-04-15T09:53:58.371Z] [INFO] Tests run: 1, Failures: 0, Errors: 0, Skipped: 0, Time elapsed: 9.528 s - in org.apache.maven.surefire.its.jiras.Surefire801ForkModeNoneClassLoaderIT
[2019-04-15T09:53:58.371Z] [INFO] Running org.apache.maven.surefire.its.jiras.Surefire803MultiFailsafeExecsIT
[2019-04-15T09:54:46.203Z] [INFO] Tests run: 2, Failures: 0, Errors: 0, Skipped: 0, Time elapsed: 41.943 s - in org.apache.maven.surefire.its.jiras.Surefire803MultiFailsafeExecsIT
[2019-04-15T09:54:46.203Z] [INFO] Running org.apache.maven.surefire.its.jiras.Surefire806SpecifiedTestControlsIT
[2019-04-15T09:54:52.027Z] [WARNING] Tests run: 3, Failures: 0, Errors: 0, Skipped: 2, Time elapsed: 12.075 s - in org.apache.maven.surefire.its.jiras.Surefire806SpecifiedTestControlsIT
[2019-04-15T09:54:52.027Z] [INFO] Running org.apache.maven.surefire.its.jiras.Surefire809GroupExpressionsIT
[2019-04-15T09:56:14.595Z] [INFO] Tests run: 6, Failures: 0, Errors: 0, Skipped: 0, Time elapsed: 72.568 s - in org.apache.maven.surefire.its.jiras.Surefire809GroupExpressionsIT
[2019-04-15T09:56:14.595Z] [INFO] Running org.apache.maven.surefire.its.jiras.Surefire812Log4JClassLoaderIT
[2019-04-15T09:56:19.152Z] [INFO] Tests run: 1, Failures: 0, Errors: 0, Skipped: 0, Time elapsed: 15.231 s - in org.apache.maven.surefire.its.jiras.Surefire812Log4JClassLoaderIT
[2019-04-15T09:56:19.152Z] [INFO] Running org.apache.maven.surefire.its.jiras.Surefire817SystemExitIT
[2019-04-15T09:56:31.874Z] [INFO] Tests run: 1, Failures: 0, Errors: 0, Skipped: 0, Time elapsed: 12.125 s - in org.apache.maven.surefire.its.jiras.Surefire817SystemExitIT
[2019-04-15T09:56:31.874Z] [INFO] Running org.apache.maven.surefire.its.jiras.Surefire818NpeIgnoresTestsIT
[2019-04-15T09:56:47.346Z] [INFO] Tests run: 1, Failures: 0, Errors: 0, Skipped: 0, Time elapsed: 14.319 s - in org.apache.maven.surefire.its.jiras.Surefire818NpeIgnoresTestsIT
[2019-04-15T09:56:47.346Z] [INFO] Running org.apache.maven.surefire.its.jiras.Surefire828EmptyGroupExprIT
[2019-04-15T09:57:44.585Z] [INFO] Tests run: 4, Failures: 0, Errors: 0, Skipped: 0, Time elapsed: 50.147 s - in org.apache.maven.surefire.its.jiras.Surefire828EmptyGroupExprIT
[2019-04-15T09:57:44.585Z] [INFO] Running org.apache.maven.surefire.its.jiras.Surefire832ProviderSelectionIT
[2019-04-15T09:57:48.714Z] [INFO] Tests run: 1, Failures: 0, Errors: 0, Skipped: 0, Time elapsed: 12.142 s - in org.apache.maven.surefire.its.jiras.Surefire832ProviderSelectionIT
[2019-04-15T09:57:48.714Z] [INFO] Running org.apache.maven.surefire.its.jiras.Surefire839TestWithoutCategoriesIT
[2019-04-15T09:58:17.252Z] [INFO] Tests run: 2, Failures: 0, Errors: 0, Skipped: 0, Time elapsed: 25.785 s - in org.apache.maven.surefire.its.jiras.Surefire839TestWithoutCategoriesIT
[2019-04-15T09:58:17.252Z] [INFO] Running org.apache.maven.surefire.its.jiras.Surefire847AdditionalFailureIT
[2019-04-15T09:58:30.437Z] [INFO] Tests run: 1, Failures: 0, Errors: 0, Skipped: 0, Time elapsed: 15.964 s - in org.apache.maven.surefire.its.jiras.Surefire847AdditionalFailureIT
[2019-04-15T09:58:30.437Z] [INFO] Running org.apache.maven.surefire.its.jiras.Surefire855AllowFailsafeUseArtifactFileIT
[2019-04-15T10:01:08.297Z] [INFO] Tests run: 4, Failures: 0, Errors: 0, Skipped: 0, Time elapsed: 147.929 s - in org.apache.maven.surefire.its.jiras.Surefire855AllowFailsafeUseArtifactFileIT
[2019-04-15T10:01:08.297Z] [INFO] Running org.apache.maven.surefire.its.jiras.Surefire901MIssingResultfileWhenNoTestsIT
[2019-04-15T10:01:08.297Z] [INFO] Tests run: 1, Failures: 0, Errors: 0, Skipped: 0, Time elapsed: 10.656 s - in org.apache.maven.surefire.its.jiras.Surefire901MIssingResultfileWhenNoTestsIT
[2019-04-15T10:01:08.297Z] [INFO] Running org.apache.maven.surefire.its.jiras.Surefire907PerThreadWithoutThreadCountIT
[2019-04-15T10:01:18.847Z] [INFO] Tests run: 1, Failures: 0, Errors: 0, Skipped: 0, Time elapsed: 9.885 s - in org.apache.maven.surefire.its.jiras.Surefire907PerThreadWithoutThreadCountIT
[2019-04-15T10:01:18.847Z] [INFO] Running org.apache.maven.surefire.its.jiras.Surefire920TestFailureIgnoreWithTimeoutIT
[2019-04-15T10:01:46.299Z] [INFO] Tests run: 2, Failures: 0, Errors: 0, Skipped: 0, Time elapsed: 26.949 s - in org.apache.maven.surefire.its.jiras.Surefire920TestFailureIgnoreWithTimeoutIT
[2019-04-15T10:01:46.299Z] [INFO] Running org.apache.maven.surefire.its.jiras.Surefire926FailureWith2ProvidersIT
[2019-04-15T10:02:05.046Z] [INFO] Tests run: 1, Failures: 0, Errors: 0, Skipped: 0, Time elapsed: 17.594 s - in org.apache.maven.surefire.its.jiras.Surefire926FailureWith2ProvidersIT
[2019-04-15T10:02:05.046Z] [INFO] Running org.apache.maven.surefire.its.jiras.Surefire930TestNgSuiteXmlIT
[2019-04-15T10:02:20.572Z] [INFO] Tests run: 1, Failures: 0, Errors: 0, Skipped: 0, Time elapsed: 15.48 s - in org.apache.maven.surefire.its.jiras.Surefire930TestNgSuiteXmlIT
[2019-04-15T10:02:20.572Z] [INFO] Running org.apache.maven.surefire.its.jiras.Surefire943ReportContentIT
[2019-04-15T10:03:08.395Z] [INFO] Tests run: 2, Failures: 0, Errors: 0, Skipped: 0, Time elapsed: 50.065 s - in org.apache.maven.surefire.its.jiras.Surefire943ReportContentIT
[2019-04-15T10:03:08.395Z] [INFO] Running org.apache.maven.surefire.its.jiras.Surefire946KillMainProcessInReusableForkIT
[2019-04-15T10:03:48.261Z] [INFO] Tests run: 3, Failures: 0, Errors: 0, Skipped: 0, Time elapsed: 35.534 s - in org.apache.maven.surefire.its.jiras.Surefire946KillMainProcessInReusableForkIT
[2019-04-15T10:03:48.261Z] [INFO] Running org.apache.maven.surefire.its.jiras.Surefire972BizarreNoClassDefIT
[2019-04-15T10:04:03.976Z] [INFO] Tests run: 1, Failures: 0, Errors: 0, Skipped: 0, Time elapsed: 18.459 s - in org.apache.maven.surefire.its.jiras.Surefire972BizarreNoClassDefIT
[2019-04-15T10:04:03.976Z] [INFO] Running org.apache.maven.surefire.its.jiras.Surefire975DefaultVMEncodingIT
[2019-04-15T10:04:17.046Z] [INFO] Tests run: 1, Failures: 0, Errors: 0, Skipped: 0, Time elapsed: 14.435 s - in org.apache.maven.surefire.its.jiras.Surefire975DefaultVMEncodingIT
[2019-04-15T10:04:17.046Z] [INFO] Running org.apache.maven.surefire.its.jiras.Surefire979WrongClassLoaderIT
[2019-04-15T10:04:32.959Z] [INFO] Tests run: 1, Failures: 0, Errors: 0, Skipped: 0, Time elapsed: 14.122 s - in org.apache.maven.surefire.its.jiras.Surefire979WrongClassLoaderIT
[2019-04-15T10:04:32.959Z] [INFO] Running org.apache.maven.surefire.its.jiras.Surefire985ParameterizedRunnerAndCategoriesIT
[2019-04-15T10:04:43.744Z] [INFO] Tests run: 1, Failures: 0, Errors: 0, Skipped: 0, Time elapsed: 12.535 s - in org.apache.maven.surefire.its.jiras.Surefire985ParameterizedRunnerAndCategoriesIT
[2019-04-15T10:04:43.744Z] [INFO] Running org.apache.maven.surefire.its.jiras.Surefire995CategoryInheritanceIT
[2019-04-15T10:05:52.580Z] [INFO] Tests run: 5, Failures: 0, Errors: 0, Skipped: 0, Time elapsed: 57.84 s - in org.apache.maven.surefire.its.jiras.Surefire995CategoryInheritanceIT
[2019-04-15T10:05:52.580Z] [INFO]
[2019-04-15T10:05:52.580Z] [INFO] Results:
[2019-04-15T10:05:52.580Z] [INFO]
[2019-04-15T10:05:52.580Z] [ERROR] Failures:
[2019-04-15T10:05:52.580Z] [ERROR] JUnitPlatformEnginesIT.platform:111
[2019-04-15T10:05:52.580Z] Expected: <[\[DEBUG\] test\(compact\) classpath: test-classes classes junit-jupiter-engine-5\.4\.0-SNAPSHOT\.jar apiguardian-api-1\.0\.0\.jar junit-platform-engine-1\.4\.0-SNAPSHOT\.jar junit-platform-commons-1\.4\.0-SNAPSHOT\.jar opentest4j-1\.1\.1\.jar junit-jupiter-api-5\.4\.0-SNAPSHOT\.jar]>
[2019-04-15T10:05:52.580Z] but: was <[[DEBUG] test(compact) classpath: test-classes classes junit-jupiter-engine-5.4.0-SNAPSHOT.jar apiguardian-api-1.0.0.jar junit-platform-engine-1.4.0-SNAPSHOT.jar opentest4j-1.1.1.jar junit-platform-commons-1.4.0-SNAPSHOT.jar junit-jupiter-api-5.4.0-SNAPSHOT.jar]>
[2019-04-15T10:05:52.580Z] [INFO]
[2019-04-15T10:05:52.580Z] [ERROR] Tests run: 788, Failures: 1, Errors: 0, Skipped: 150
[2019-04-15T10:05:52.580Z] [INFO]
[2019-04-15T10:05:52.580Z] [INFO]
[2019-04-15T10:05:52.580Z] [INFO] --- maven-checkstyle-plugin:3.0.0:check (checkstyle-check) @ surefire-its ---
[2019-04-15T10:05:52.580Z] [INFO]
[2019-04-15T10:05:52.580Z] [INFO] --- maven-failsafe-plugin:3.0.0-M3:verify (default) @ surefire-its ---
[2019-04-15T10:05:52.580Z] [INFO] Failsafe report directory: C:\Users\jenkins\AppData\Local\Temp\2\jenkins-maven-box-maven-surefire-deployment-5@2\surefire-its\target\failsafe-reports
[2019-04-15T10:05:52.580Z] [INFO] ------------------------------------------------------------------------
[2019-04-15T10:05:52.580Z] [INFO] Reactor Summary for Apache Maven Surefire 3.0.0-M4-SNAPSHOT:
[2019-04-15T10:05:52.580Z] [INFO]
[2019-04-15T10:05:52.580Z] [INFO] Apache Maven Surefire .............................. SUCCESS [ 35.811 s]
[2019-04-15T10:05:52.580Z] [INFO] SureFire Logger API ................................ SUCCESS [ 9.165 s]
[2019-04-15T10:05:52.580Z] [INFO] SureFire API ....................................... SUCCESS [ 22.262 s]
[2019-04-15T10:05:52.580Z] [INFO] SureFire Booter .................................... SUCCESS [ 24.589 s]
[2019-04-15T10:05:52.580Z] [INFO] Maven Surefire Test-Grouping Support ............... SUCCESS [ 14.167 s]
[2019-04-15T10:05:52.580Z] [INFO] SureFire Providers ................................. SUCCESS [ 2.270 s]
[2019-04-15T10:05:52.580Z] [INFO] Shared JUnit3 Provider Code ........................ SUCCESS [ 9.453 s]
[2019-04-15T10:05:52.580Z] [INFO] Shared Java 5 Provider Base ........................ SUCCESS [ 11.583 s]
[2019-04-15T10:05:52.580Z] [INFO] Shared JUnit4 Provider Code ........................ SUCCESS [ 10.956 s]
[2019-04-15T10:05:52.580Z] [INFO] Shared JUnit48 Provider Code ....................... SUCCESS [ 11.841 s]
[2019-04-15T10:05:52.580Z] [INFO] SureFire JUnit Runner .............................. SUCCESS [ 10.693 s]
[2019-04-15T10:05:52.580Z] [INFO] SureFire JUnit4 Runner ............................. SUCCESS [ 10.158 s]
[2019-04-15T10:05:52.580Z] [INFO] Maven Surefire Common .............................. SUCCESS [ 50.635 s]
[2019-04-15T10:05:52.580Z] [INFO] SureFire JUnitCore Runner .......................... SUCCESS [02:26 min]
[2019-04-15T10:05:52.580Z] [INFO] SureFire JUnit Platform Runner ..................... SUCCESS [ 21.157 s]
[2019-04-15T10:05:52.580Z] [INFO] SureFire TestNG Utils .............................. SUCCESS [ 10.686 s]
[2019-04-15T10:05:52.580Z] [INFO] SureFire TestNG Runner ............................. SUCCESS [ 11.224 s]
[2019-04-15T10:05:52.580Z] [INFO] ShadeFire JUnit3 Provider .......................... SUCCESS [ 3.106 s]
[2019-04-15T10:05:52.580Z] [INFO] Surefire Report Parser ............................. SUCCESS [ 14.679 s]
[2019-04-15T10:05:52.580Z] [INFO] Maven Surefire Plugin .............................. SUCCESS [ 24.380 s]
[2019-04-15T10:05:52.580Z] [INFO] Maven Failsafe Plugin .............................. SUCCESS [02:30 min]
[2019-04-15T10:05:52.580Z] [INFO] Maven Surefire Report Plugin ....................... SUCCESS [ 32.571 s]
[2019-04-15T10:05:52.580Z] [INFO] Maven Surefire Integration Tests ................... FAILURE [ 02:34 h]
[2019-04-15T10:05:52.580Z] [INFO] ------------------------------------------------------------------------
[2019-04-15T10:05:52.580Z] [INFO] BUILD FAILURE
[2019-04-15T10:05:52.580Z] [INFO] ------------------------------------------------------------------------
[2019-04-15T10:05:52.580Z] [INFO] Total time: 02:44 h
[2019-04-15T10:05:52.580Z] [INFO] Finished at: 2019-04-15T10:05:43Z
[2019-04-15T10:05:52.580Z] [INFO] ------------------------------------------------------------------------
[2019-04-15T10:05:52.580Z] [ERROR] Failed to execute goal org.apache.maven.plugins:maven-failsafe-plugin:3.0.0-M3:verify (default) on project surefire-its: There are test failures.
[2019-04-15T10:05:52.580Z] [ERROR]
[2019-04-15T10:05:52.580Z] [ERROR] Please refer to C:\Users\jenkins\AppData\Local\Temp\2\jenkins-maven-box-maven-surefire-deployment-5@2\surefire-its\target\failsafe-reports for the individual test results.
[2019-04-15T10:05:52.580Z] [ERROR] Please refer to dump files (if any exist) [date].dump, [date]-jvmRun[N].dump and [date].dumpstream.
[2019-04-15T10:05:52.580Z] [ERROR] -> [Help 1]
[2019-04-15T10:05:52.580Z] org.apache.maven.lifecycle.LifecycleExecutionException: Failed to execute goal org.apache.maven.plugins:maven-failsafe-plugin:3.0.0-M3:verify (default) on project surefire-its: There are test failures.
[2019-04-15T10:05:52.580Z]
[2019-04-15T10:05:52.580Z] Please refer to C:\Users\jenkins\AppData\Local\Temp\2\jenkins-maven-box-maven-surefire-deployment-5@2\surefire-its\target\failsafe-reports for the individual test results.
[2019-04-15T10:05:52.580Z] Please refer to dump files (if any exist) [date].dump, [date]-jvmRun[N].dump and [date].dumpstream.
[2019-04-15T10:05:52.580Z] at org.apache.maven.lifecycle.internal.MojoExecutor.execute (MojoExecutor.java:215)
[2019-04-15T10:05:52.580Z] at org.apache.maven.lifecycle.internal.MojoExecutor.execute (MojoExecutor.java:156)
[2019-04-15T10:05:52.580Z] at org.apache.maven.lifecycle.internal.MojoExecutor.execute (MojoExecutor.java:148)
[2019-04-15T10:05:52.581Z] at org.apache.maven.lifecycle.internal.LifecycleModuleBuilder.buildProject (LifecycleModuleBuilder.java:117)
[2019-04-15T10:05:52.581Z] at org.apache.maven.lifecycle.internal.LifecycleModuleBuilder.buildProject (LifecycleModuleBuilder.java:81)
[2019-04-15T10:05:52.581Z] at org.apache.maven.lifecycle.internal.builder.singlethreaded.SingleThreadedBuilder.build (SingleThreadedBuilder.java:56)
[2019-04-15T10:05:52.581Z] at org.apache.maven.lifecycle.internal.LifecycleStarter.execute (LifecycleStarter.java:128)
[2019-04-15T10:05:52.581Z] at org.apache.maven.DefaultMaven.doExecute (DefaultMaven.java:305)
[2019-04-15T10:05:52.581Z] at org.apache.maven.DefaultMaven.doExecute (DefaultMaven.java:192)
[2019-04-15T10:05:52.581Z] at org.apache.maven.DefaultMaven.execute (DefaultMaven.java:105)
[2019-04-15T10:05:52.581Z] at org.apache.maven.cli.MavenCli.execute (MavenCli.java:956)
[2019-04-15T10:05:52.581Z] at org.apache.maven.cli.MavenCli.doMain (MavenCli.java:288)
[2019-04-15T10:05:52.581Z] at org.apache.maven.cli.MavenCli.main (MavenCli.java:192)
[2019-04-15T10:05:52.581Z] at sun.reflect.NativeMethodAccessorImpl.invoke0 (Native Method)
[2019-04-15T10:05:52.581Z] at sun.reflect.NativeMethodAccessorImpl.invoke (NativeMethodAccessorImpl.java:62)
[2019-04-15T10:05:52.581Z] at sun.reflect.DelegatingMethodAccessorImpl.invoke (DelegatingMethodAccessorImpl.java:43)
[2019-04-15T10:05:52.581Z] at java.lang.reflect.Method.invoke (Method.java:498)
[2019-04-15T10:05:52.581Z] at org.codehaus.plexus.classworlds.launcher.Launcher.launchEnhanced (Launcher.java:289)
[2019-04-15T10:05:52.581Z] at org.codehaus.plexus.classworlds.launcher.Launcher.launch (Launcher.java:229)
[2019-04-15T10:05:52.581Z] at org.codehaus.plexus.classworlds.launcher.Launcher.mainWithExitCode (Launcher.java:415)
[2019-04-15T10:05:52.581Z] at org.codehaus.plexus.classworlds.launcher.Launcher.main (Launcher.java:356)
[2019-04-15T10:05:52.581Z] Caused by: org.apache.maven.plugin.MojoFailureException: There are test failures.
[2019-04-15T10:05:52.581Z]
[2019-04-15T10:05:52.581Z] Please refer to C:\Users\jenkins\AppData\Local\Temp\2\jenkins-maven-box-maven-surefire-deployment-5@2\surefire-its\target\failsafe-reports for the individual test results.
[2019-04-15T10:05:52.581Z] Please refer to dump files (if any exist) [date].dump, [date]-jvmRun[N].dump and [date].dumpstream.
[2019-04-15T10:05:52.581Z] at org.apache.maven.plugin.surefire.SurefireHelper.throwException (SurefireHelper.java:271)
[2019-04-15T10:05:52.581Z] at org.apache.maven.plugin.surefire.SurefireHelper.reportExecution (SurefireHelper.java:159)
[2019-04-15T10:05:52.581Z] at org.apache.maven.plugin.failsafe.VerifyMojo.execute (VerifyMojo.java:192)
[2019-04-15T10:05:52.581Z] at org.apache.maven.plugin.DefaultBuildPluginManager.executeMojo (DefaultBuildPluginManager.java:137)
[2019-04-15T10:05:52.581Z] at org.apache.maven.lifecycle.internal.MojoExecutor.execute (MojoExecutor.java:210)
[2019-04-15T10:05:52.581Z] at org.apache.maven.lifecycle.internal.MojoExecutor.execute (MojoExecutor.java:156)
[2019-04-15T10:05:52.581Z] at org.apache.maven.lifecycle.internal.MojoExecutor.execute (MojoExecutor.java:148)
[2019-04-15T10:05:52.581Z] at org.apache.maven.lifecycle.internal.LifecycleModuleBuilder.buildProject (LifecycleModuleBuilder.java:117)
[2019-04-15T10:05:52.581Z] at org.apache.maven.lifecycle.internal.LifecycleModuleBuilder.buildProject (LifecycleModuleBuilder.java:81)
[2019-04-15T10:05:52.581Z] at org.apache.maven.lifecycle.internal.builder.singlethreaded.SingleThreadedBuilder.build (SingleThreadedBuilder.java:56)
[2019-04-15T10:05:52.581Z] at org.apache.maven.lifecycle.internal.LifecycleStarter.execute (LifecycleStarter.java:128)
[2019-04-15T10:05:52.581Z] at org.apache.maven.DefaultMaven.doExecute (DefaultMaven.java:305)
[2019-04-15T10:05:52.581Z] at org.apache.maven.DefaultMaven.doExecute (DefaultMaven.java:192)
[2019-04-15T10:05:52.581Z] at org.apache.maven.DefaultMaven.execute (DefaultMaven.java:105)
[2019-04-15T10:05:52.581Z] at org.apache.maven.cli.MavenCli.execute (MavenCli.java:956)
[2019-04-15T10:05:52.581Z] at org.apache.maven.cli.MavenCli.doMain (MavenCli.java:288)
[2019-04-15T10:05:52.581Z] at org.apache.maven.cli.MavenCli.main (MavenCli.java:192)
[2019-04-15T10:05:52.581Z] at sun.reflect.NativeMethodAccessorImpl.invoke0 (Native Method)
[2019-04-15T10:05:52.581Z] at sun.reflect.NativeMethodAccessorImpl.invoke (NativeMethodAccessorImpl.java:62)
[2019-04-15T10:05:52.581Z] at sun.reflect.DelegatingMethodAccessorImpl.invoke (DelegatingMethodAccessorImpl.java:43)
[2019-04-15T10:05:52.581Z] at java.lang.reflect.Method.invoke (Method.java:498)
[2019-04-15T10:05:52.581Z] at org.codehaus.plexus.classworlds.launcher.Launcher.launchEnhanced (Launcher.java:289)
[2019-04-15T10:05:52.581Z] at org.codehaus.plexus.classworlds.launcher.Launcher.launch (Launcher.java:229)
[2019-04-15T10:05:52.581Z] at org.codehaus.plexus.classworlds.launcher.Launcher.mainWithExitCode (Launcher.java:415)
[2019-04-15T10:05:52.581Z] at org.codehaus.plexus.classworlds.launcher.Launcher.main (Launcher.java:356)
[2019-04-15T10:05:52.581Z] [ERROR]
[2019-04-15T10:05:52.581Z] [ERROR] Re-run Maven using the -X switch to enable full debug logging.
[2019-04-15T10:05:52.581Z] [ERROR]
[2019-04-15T10:05:52.581Z] [ERROR] For more information about the errors and possible solutions, please read the following articles:
[2019-04-15T10:05:52.581Z] [ERROR] [Help 1] http://cwiki.apache.org/confluence/display/MAVEN/MojoFailureException
[2019-04-15T10:05:52.581Z] [ERROR]
[2019-04-15T10:05:52.581Z] [ERROR] After correcting the problems, you can resume the build with the command
[2019-04-15T10:05:52.581Z] [ERROR] mvn <goals> -rf :surefire-its
[Pipeline] }
[Pipeline] // withEnv
[Pipeline] }
[Pipeline] // stage
[Pipeline] fileExists
[Pipeline] zip
[2019-04-15T10:05:52.783Z] Writing zip file of C:\Users\jenkins\AppData\Local\Temp\2\jenkins-maven-box-maven-surefire-deployment-5@2\maven-failsafe-plugin\target\it to C:\Users\jenkins\AppData\Local\Temp\2\jenkins-maven-box-maven-surefire-deployment-5@2\maven-failsafe-plugin--windows-jdk8-maven3.6.x.zip
[2019-04-15T10:05:52.901Z] Zipped 78 entries.
[2019-04-15T10:05:52.901Z] Archiving C:\Users\jenkins\AppData\Local\Temp\2\jenkins-maven-box-maven-surefire-deployment-5@2\maven-failsafe-plugin--windows-jdk8-maven3.6.x.zip
[2019-04-15T10:05:52.901Z] [Fast Archiver] No prior successful build to compare, so performing full copy of artifacts
[Pipeline] fileExists
[Pipeline] zip
[2019-04-15T10:05:53.013Z] Writing zip file of C:\Users\jenkins\AppData\Local\Temp\2\jenkins-maven-box-maven-surefire-deployment-5@2\surefire-its\target to C:\Users\jenkins\AppData\Local\Temp\2\jenkins-maven-box-maven-surefire-deployment-5@2\surefire-its--windows-jdk8-maven3.6.x.zip
[2019-04-15T10:06:13.651Z] Zipped 15947 entries.
[2019-04-15T10:06:13.651Z] Archiving C:\Users\jenkins\AppData\Local\Temp\2\jenkins-maven-box-maven-surefire-deployment-5@2\surefire-its--windows-jdk8-maven3.6.x.zip
[2019-04-15T10:06:13.652Z] [Fast Archiver] No prior successful build to compare, so performing full copy of artifacts
[Pipeline] archiveArtifacts
[2019-04-15T10:06:16.230Z] Archiving artifacts
[2019-04-15T10:06:16.281Z] [Fast Archiver] No prior successful build to compare, so performing full copy of artifacts
[Pipeline] cleanWs
[2019-04-15T10:06:18.934Z] [WS-CLEANUP] Deleting project workspace...
[2019-04-15T10:06:18.934Z] [WS-CLEANUP] Deferred wipeout is used...
[2019-04-15T10:06:19.153Z] [WS-CLEANUP] done
[Pipeline] }
[Pipeline] // ws
[Pipeline] }
[Pipeline] // timestamps
[Pipeline] }
[Pipeline] // node
[Pipeline] }
[Pipeline] // parallel
[Pipeline] echo
Build result: FAILURE
[Pipeline] jiraIssueSelector
[Pipeline] emailext
Build failed in Jenkins: Maven TLP » maven-surefire » deployment #4
Posted by Apache Jenkins Server <je...@builds.apache.org>.
See https://builds.apache.org/job/maven-box/job/maven-surefire/job/deployment/4/
Changes:
* [INFRA-18014] Provide GPG on Jenkins Windows nodes
* Switch back to Windows label
* Change workspace path for Windows
* Shorten wsDir
* Fix groovy script
* rewrite groovy statement
* Keep original stageId
* Reduce stageDir
* More shortening of path
* maven-invoker keeps lock on jar (under investigation), so can't fully
1 tests failed.
FAILED: org.apache.maven.surefire.its.JUnitPlatformEnginesIT.platform[1.4.0-SNAPSHOT]
Error Message:
Expected: <[\[DEBUG\] test\(compact\) classpath: test-classes classes junit-jupiter-engine-5\.4\.0-SNAPSHOT\.jar apiguardian-api-1\.0\.0\.jar junit-platform-engine-1\.4\.0-SNAPSHOT\.jar junit-platform-commons-1\.4\.0-SNAPSHOT\.jar opentest4j-1\.1\.1\.jar junit-jupiter-api-5\.4\.0-SNAPSHOT\.jar]>
but: was <[[DEBUG] test(compact) classpath: test-classes classes junit-jupiter-engine-5.4.0-SNAPSHOT.jar apiguardian-api-1.0.0.jar junit-platform-engine-1.4.0-SNAPSHOT.jar opentest4j-1.1.1.jar junit-platform-commons-1.4.0-SNAPSHOT.jar junit-jupiter-api-5.4.0-SNAPSHOT.jar]>
Stack Trace:
java.lang.AssertionError:
Expected: <[\[DEBUG\] test\(compact\) classpath: test-classes classes junit-jupiter-engine-5\.4\.0-SNAPSHOT\.jar apiguardian-api-1\.0\.0\.jar junit-platform-engine-1\.4\.0-SNAPSHOT\.jar junit-platform-commons-1\.4\.0-SNAPSHOT\.jar opentest4j-1\.1\.1\.jar junit-jupiter-api-5\.4\.0-SNAPSHOT\.jar]>
but: was <[[DEBUG] test(compact) classpath: test-classes classes junit-jupiter-engine-5.4.0-SNAPSHOT.jar apiguardian-api-1.0.0.jar junit-platform-engine-1.4.0-SNAPSHOT.jar opentest4j-1.1.1.jar junit-platform-commons-1.4.0-SNAPSHOT.jar junit-jupiter-api-5.4.0-SNAPSHOT.jar]>
at org.apache.maven.surefire.its.JUnitPlatformEnginesIT.platform(JUnitPlatformEnginesIT.java:111)
Build log:
[...truncated 43537 lines...]
[Pipeline] // node
[Pipeline] }
[2019-04-10T15:26:57.823Z] [INFO] Tests run: 1, Failures: 0, Errors: 0, Skipped: 0, Time elapsed: 33.357 s - in org.apache.maven.surefire.its.jiras.Surefire1098BalancedRunOrderIT
[2019-04-10T15:26:57.823Z] [INFO] Running org.apache.maven.surefire.its.jiras.Surefire1122ParallelAndFlakyTestsIT
[2019-04-10T15:27:05.122Z] [INFO] Tests run: 3, Failures: 0, Errors: 0, Skipped: 0, Time elapsed: 26.191 s - in org.apache.maven.surefire.its.jiras.Surefire1122ParallelAndFlakyTestsIT
[2019-04-10T15:27:05.122Z] [INFO] Running org.apache.maven.surefire.its.jiras.Surefire1135ImproveIgnoreMessageForTestNGIT
[2019-04-10T15:27:28.186Z] [INFO] Tests run: 2, Failures: 0, Errors: 0, Skipped: 0, Time elapsed: 21.574 s - in org.apache.maven.surefire.its.jiras.Surefire1135ImproveIgnoreMessageForTestNGIT
[2019-04-10T15:27:28.186Z] [INFO] Running org.apache.maven.surefire.its.jiras.Surefire1136CwdPropagationInForkedModeIT
[2019-04-10T15:27:35.149Z] [INFO] Tests run: 1, Failures: 0, Errors: 0, Skipped: 0, Time elapsed: 9.162 s - in org.apache.maven.surefire.its.jiras.Surefire1136CwdPropagationInForkedModeIT
[2019-04-10T15:27:35.150Z] [INFO] Running org.apache.maven.surefire.its.jiras.Surefire1144XmlRunTimeIT
[2019-04-10T15:27:55.528Z] [INFO] Tests run: 1, Failures: 0, Errors: 0, Skipped: 0, Time elapsed: 9.357 s - in org.apache.maven.surefire.its.jiras.Surefire1144XmlRunTimeIT
[2019-04-10T15:27:55.528Z] [INFO] Running org.apache.maven.surefire.its.jiras.Surefire1152RerunFailingTestsInSuiteIT
[2019-04-10T15:28:04.636Z] [INFO] Tests run: 2, Failures: 0, Errors: 0, Skipped: 0, Time elapsed: 19.413 s - in org.apache.maven.surefire.its.jiras.Surefire1152RerunFailingTestsInSuiteIT
[2019-04-10T15:28:04.636Z] [INFO] Running org.apache.maven.surefire.its.jiras.Surefire1153IncludesAndSpecifiedTestIT
[2019-04-10T15:28:20.123Z] [INFO] Tests run: 2, Failures: 0, Errors: 0, Skipped: 0, Time elapsed: 14.767 s - in org.apache.maven.surefire.its.jiras.Surefire1153IncludesAndSpecifiedTestIT
[2019-04-10T15:28:20.123Z] [INFO] Running org.apache.maven.surefire.its.jiras.Surefire1158RemoveInfoLinesIT
[2019-04-10T15:29:23.499Z] [INFO] Tests run: 6, Failures: 0, Errors: 0, Skipped: 0, Time elapsed: 57.666 s - in org.apache.maven.surefire.its.jiras.Surefire1158RemoveInfoLinesIT
[2019-04-10T15:29:23.499Z] [INFO] Running org.apache.maven.surefire.its.jiras.Surefire1177TestngParallelSuitesIT
[2019-04-10T15:29:54.736Z] [INFO] Tests run: 2, Failures: 0, Errors: 0, Skipped: 0, Time elapsed: 22.075 s - in org.apache.maven.surefire.its.jiras.Surefire1177TestngParallelSuitesIT
[2019-04-10T15:29:54.736Z] [INFO] Running org.apache.maven.surefire.its.jiras.Surefire1179IT
[2019-04-10T15:29:54.736Z] [INFO] Tests run: 1, Failures: 0, Errors: 0, Skipped: 0, Time elapsed: 12.611 s - in org.apache.maven.surefire.its.jiras.Surefire1179IT
[2019-04-10T15:29:54.736Z] [INFO] Running org.apache.maven.surefire.its.jiras.Surefire1185DoNotSpawnTestsIT
[2019-04-10T15:29:58.377Z] [INFO] Tests run: 1, Failures: 0, Errors: 0, Skipped: 0, Time elapsed: 7.1 s - in org.apache.maven.surefire.its.jiras.Surefire1185DoNotSpawnTestsIT
[2019-04-10T15:29:58.377Z] [INFO] Running org.apache.maven.surefire.its.jiras.Surefire1202RerunAndSkipIT
[2019-04-10T15:31:00.258Z] [INFO] Tests run: 2, Failures: 0, Errors: 0, Skipped: 0, Time elapsed: 44.927 s - in org.apache.maven.surefire.its.jiras.Surefire1202RerunAndSkipIT
[2019-04-10T15:31:00.258Z] [INFO] Running org.apache.maven.surefire.its.jiras.Surefire1209RerunAndForkCountIT
[2019-04-10T15:31:59.164Z] [INFO] Tests run: 4, Failures: 0, Errors: 0, Skipped: 0, Time elapsed: 70.935 s - in org.apache.maven.surefire.its.jiras.Surefire1209RerunAndForkCountIT
[2019-04-10T15:31:59.164Z] [INFO] Running org.apache.maven.surefire.its.jiras.Surefire1211JUnitTestNgIT
[2019-04-10T15:32:15.553Z] [INFO] Tests run: 2, Failures: 0, Errors: 0, Skipped: 0, Time elapsed: 21.678 s - in org.apache.maven.surefire.its.jiras.Surefire1211JUnitTestNgIT
[2019-04-10T15:32:15.553Z] [INFO] Running org.apache.maven.surefire.its.jiras.Surefire1264IT
[2019-04-10T15:32:56.894Z] [INFO] Tests run: 2, Failures: 0, Errors: 0, Skipped: 0, Time elapsed: 21.709 s - in org.apache.maven.surefire.its.jiras.Surefire1264IT
[2019-04-10T15:32:56.894Z] [INFO] Running org.apache.maven.surefire.its.jiras.Surefire1265Java9IT
[2019-04-10T15:32:56.894Z] [WARNING] Tests run: 1, Failures: 0, Errors: 0, Skipped: 1, Time elapsed: 0 s - in org.apache.maven.surefire.its.jiras.Surefire1265Java9IT
[2019-04-10T15:32:56.894Z] [INFO] Running org.apache.maven.surefire.its.jiras.Surefire1278GroupNameEndingIT
[2019-04-10T15:32:56.894Z] [INFO] Tests run: 1, Failures: 0, Errors: 0, Skipped: 0, Time elapsed: 9.529 s - in org.apache.maven.surefire.its.jiras.Surefire1278GroupNameEndingIT
[2019-04-10T15:32:56.894Z] [INFO] Running org.apache.maven.surefire.its.jiras.Surefire1295AttributeJvmCrashesToTestsIT
[2019-04-10T15:32:56.894Z] [WARNING] Tests run: 9, Failures: 0, Errors: 0, Skipped: 9, Time elapsed: 0.001 s - in org.apache.maven.surefire.its.jiras.Surefire1295AttributeJvmCrashesToTestsIT
[2019-04-10T15:32:56.894Z] [INFO] Running org.apache.maven.surefire.its.jiras.Surefire1364SystemPropertiesIT
[2019-04-10T15:34:33.634Z] [INFO] Tests run: 10, Failures: 0, Errors: 0, Skipped: 0, Time elapsed: 97.977 s - in org.apache.maven.surefire.its.jiras.Surefire1364SystemPropertiesIT
[2019-04-10T15:34:33.634Z] [INFO] Running org.apache.maven.surefire.its.jiras.Surefire1367AssumptionLogsIT
[2019-04-10T15:35:00.184Z] [INFO] Tests run: 4, Failures: 0, Errors: 0, Skipped: 0, Time elapsed: 35.052 s - in org.apache.maven.surefire.its.jiras.Surefire1367AssumptionLogsIT
[2019-04-10T15:35:00.184Z] [INFO] Running org.apache.maven.surefire.its.jiras.Surefire1383ScanSessionDependenciesIT
[2019-04-10T15:35:19.305Z] [INFO] Tests run: 1, Failures: 0, Errors: 0, Skipped: 0, Time elapsed: 16.587 s - in org.apache.maven.surefire.its.jiras.Surefire1383ScanSessionDependenciesIT
[2019-04-10T15:35:19.305Z] [INFO] Running org.apache.maven.surefire.its.jiras.Surefire1396CustomProviderClassPathIT
[2019-04-10T15:36:09.007Z] [INFO] Tests run: 1, Failures: 0, Errors: 0, Skipped: 0, Time elapsed: 20.927 s - in org.apache.maven.surefire.its.jiras.Surefire1396CustomProviderClassPathIT
[2019-04-10T15:36:09.007Z] [INFO] Running org.apache.maven.surefire.its.jiras.Surefire141PluggableProvidersIT
[2019-04-10T15:36:24.595Z] [INFO] Tests run: 4, Failures: 0, Errors: 0, Skipped: 0, Time elapsed: 45.672 s - in org.apache.maven.surefire.its.jiras.Surefire141PluggableProvidersIT
[2019-04-10T15:36:24.595Z] [INFO] Running org.apache.maven.surefire.its.jiras.Surefire146ForkPerTestNoSetupIT
[2019-04-10T15:36:33.152Z] [INFO] Tests run: 1, Failures: 0, Errors: 0, Skipped: 0, Time elapsed: 9.395 s - in org.apache.maven.surefire.its.jiras.Surefire146ForkPerTestNoSetupIT
[2019-04-10T15:36:33.152Z] [INFO] Running org.apache.maven.surefire.its.jiras.Surefire1490ReportTitleDescriptionIT
[2019-04-10T15:37:21.280Z] [INFO] Tests run: 2, Failures: 0, Errors: 0, Skipped: 0, Time elapsed: 47.673 s - in org.apache.maven.surefire.its.jiras.Surefire1490ReportTitleDescriptionIT
[2019-04-10T15:37:21.280Z] [INFO] Running org.apache.maven.surefire.its.jiras.Surefire1534ReuseForksFalseWithJavaModuleIT
[2019-04-10T15:37:21.280Z] [WARNING] Tests run: 3, Failures: 0, Errors: 0, Skipped: 3, Time elapsed: 0.001 s - in org.apache.maven.surefire.its.jiras.Surefire1534ReuseForksFalseWithJavaModuleIT
[2019-04-10T15:37:21.280Z] [INFO] Running org.apache.maven.surefire.its.jiras.Surefire1535TestNGParallelSuitesIT
[2019-04-10T15:38:09.401Z] [INFO] Tests run: 4, Failures: 0, Errors: 0, Skipped: 0, Time elapsed: 44.585 s - in org.apache.maven.surefire.its.jiras.Surefire1535TestNGParallelSuitesIT
[2019-04-10T15:38:09.401Z] [INFO] Running org.apache.maven.surefire.its.jiras.Surefire162CharsetProviderIT
[2019-04-10T15:38:16.531Z] [INFO] Tests run: 1, Failures: 0, Errors: 0, Skipped: 0, Time elapsed: 10.217 s - in org.apache.maven.surefire.its.jiras.Surefire162CharsetProviderIT
[2019-04-10T15:38:16.531Z] [INFO] Running org.apache.maven.surefire.its.jiras.Surefire224WellFormedXmlFailuresIT
[2019-04-10T15:38:25.241Z] [INFO] Tests run: 1, Failures: 0, Errors: 0, Skipped: 0, Time elapsed: 8.904 s - in org.apache.maven.surefire.its.jiras.Surefire224WellFormedXmlFailuresIT
[2019-04-10T15:38:25.241Z] [INFO] Running org.apache.maven.surefire.its.jiras.Surefire257NotRerunningTestsIT
[2019-04-10T15:38:57.068Z] [INFO] Tests run: 1, Failures: 0, Errors: 0, Skipped: 0, Time elapsed: 13.116 s - in org.apache.maven.surefire.its.jiras.Surefire257NotRerunningTestsIT
[2019-04-10T15:38:57.068Z] [INFO] Running org.apache.maven.surefire.its.jiras.Surefire260TestWithIdenticalNamesIT
[2019-04-10T15:38:57.068Z] [WARNING] Tests run: 1, Failures: 0, Errors: 0, Skipped: 1, Time elapsed: 0 s - in org.apache.maven.surefire.its.jiras.Surefire260TestWithIdenticalNamesIT
[2019-04-10T15:38:57.068Z] [INFO] Running org.apache.maven.surefire.its.jiras.Surefire34SecurityManagerIT
[2019-04-10T15:38:57.460Z] [INFO] Tests run: 2, Failures: 0, Errors: 0, Skipped: 0, Time elapsed: 17.751 s - in org.apache.maven.surefire.its.jiras.Surefire34SecurityManagerIT
[2019-04-10T15:38:57.460Z] [INFO] Running org.apache.maven.surefire.its.jiras.Surefire376TestNgAfterSuiteFailureIT
[2019-04-10T15:39:04.932Z] [INFO] Tests run: 1, Failures: 0, Errors: 0, Skipped: 0, Time elapsed: 9.409 s - in org.apache.maven.surefire.its.jiras.Surefire376TestNgAfterSuiteFailureIT
[2019-04-10T15:39:04.932Z] [INFO] Running org.apache.maven.surefire.its.jiras.Surefire377TestNgAndJUnitTogetherIT
[2019-04-10T15:39:23.901Z] [INFO] Tests run: 2, Failures: 0, Errors: 0, Skipped: 0, Time elapsed: 17.921 s - in org.apache.maven.surefire.its.jiras.Surefire377TestNgAndJUnitTogetherIT
[2019-04-10T15:39:23.901Z] [INFO] Running org.apache.maven.surefire.its.jiras.Surefire408ManualProviderSelectionIT
[2019-04-10T15:39:32.481Z] [INFO] Tests run: 1, Failures: 0, Errors: 0, Skipped: 0, Time elapsed: 9.838 s - in org.apache.maven.surefire.its.jiras.Surefire408ManualProviderSelectionIT
[2019-04-10T15:39:32.481Z] [INFO] Running org.apache.maven.surefire.its.jiras.Surefire42NotExtendingTestCaseIT
[2019-04-10T15:39:54.428Z] [INFO] Tests run: 1, Failures: 0, Errors: 0, Skipped: 0, Time elapsed: 9.255 s - in org.apache.maven.surefire.its.jiras.Surefire42NotExtendingTestCaseIT
[2019-04-10T15:39:54.428Z] [INFO] Running org.apache.maven.surefire.its.jiras.Surefire44InnerClassTestIT
[2019-04-10T15:39:54.428Z] [INFO] Tests run: 1, Failures: 0, Errors: 0, Skipped: 0, Time elapsed: 8.305 s - in org.apache.maven.surefire.its.jiras.Surefire44InnerClassTestIT
[2019-04-10T15:39:54.428Z] [INFO] Running org.apache.maven.surefire.its.jiras.Surefire500PuzzlingErrorIT
[2019-04-10T15:39:59.397Z] [INFO] Tests run: 1, Failures: 0, Errors: 0, Skipped: 0, Time elapsed: 9.255 s - in org.apache.maven.surefire.its.jiras.Surefire500PuzzlingErrorIT
[2019-04-10T15:39:59.397Z] [INFO] Running org.apache.maven.surefire.its.jiras.Surefire510TestClassPathForkModesIT
[2019-04-10T15:40:18.676Z] [INFO] Tests run: 2, Failures: 0, Errors: 0, Skipped: 0, Time elapsed: 16.969 s - in org.apache.maven.surefire.its.jiras.Surefire510TestClassPathForkModesIT
[2019-04-10T15:40:18.676Z] [INFO] Running org.apache.maven.surefire.its.jiras.Surefire569RunTestFromDependencyJarsIT
[2019-04-10T15:40:25.699Z] [INFO] Tests run: 1, Failures: 0, Errors: 0, Skipped: 0, Time elapsed: 9.238 s - in org.apache.maven.surefire.its.jiras.Surefire569RunTestFromDependencyJarsIT
[2019-04-10T15:40:25.699Z] [INFO] Running org.apache.maven.surefire.its.jiras.Surefire570MultipleReportDirectoriesIT
[2019-04-10T15:41:15.546Z] [INFO] Tests run: 2, Failures: 0, Errors: 0, Skipped: 0, Time elapsed: 47.71 s - in org.apache.maven.surefire.its.jiras.Surefire570MultipleReportDirectoriesIT
[2019-04-10T15:41:15.546Z] [INFO] Running org.apache.maven.surefire.its.jiras.Surefire613TestCountInParallelIT
[2019-04-10T15:41:22.653Z] [INFO] Tests run: 1, Failures: 0, Errors: 0, Skipped: 0, Time elapsed: 9.264 s - in org.apache.maven.surefire.its.jiras.Surefire613TestCountInParallelIT
[2019-04-10T15:41:22.653Z] [INFO] Running org.apache.maven.surefire.its.jiras.Surefire621TestCountingJunit3InParallelIT
[2019-04-10T15:42:18.057Z] [INFO] Tests run: 5, Failures: 0, Errors: 0, Skipped: 0, Time elapsed: 52.515 s - in org.apache.maven.surefire.its.jiras.Surefire621TestCountingJunit3InParallelIT
[2019-04-10T15:42:18.057Z] [INFO] Running org.apache.maven.surefire.its.jiras.Surefire628ConsoleOutputBeforeAndAfterClassIT
[2019-04-10T15:42:25.091Z] [INFO] Tests run: 1, Failures: 0, Errors: 0, Skipped: 0, Time elapsed: 8.83 s - in org.apache.maven.surefire.its.jiras.Surefire628ConsoleOutputBeforeAndAfterClassIT
[2019-04-10T15:42:25.091Z] [INFO] Running org.apache.maven.surefire.its.jiras.Surefire634UnsettableSystemPropertiesWarningIT
[2019-04-10T15:42:33.673Z] [INFO] Tests run: 1, Failures: 0, Errors: 0, Skipped: 0, Time elapsed: 9.739 s - in org.apache.maven.surefire.its.jiras.Surefire634UnsettableSystemPropertiesWarningIT
[2019-04-10T15:42:33.673Z] [INFO] Running org.apache.maven.surefire.its.jiras.Surefire649EmptyStringSystemPropertiesIT
[2019-04-10T15:43:03.283Z] [INFO] Tests run: 2, Failures: 0, Errors: 0, Skipped: 0, Time elapsed: 14.545 s - in org.apache.maven.surefire.its.jiras.Surefire649EmptyStringSystemPropertiesIT
[2019-04-10T15:43:03.283Z] [INFO] Running org.apache.maven.surefire.its.jiras.Surefire673MockitoIT
[2019-04-10T15:43:03.616Z] [INFO] Tests run: 1, Failures: 0, Errors: 0, Skipped: 0, Time elapsed: 12.061 s - in org.apache.maven.surefire.its.jiras.Surefire673MockitoIT
[2019-04-10T15:43:03.616Z] [INFO] Running org.apache.maven.surefire.its.jiras.Surefire674BuildFailingWhenErrorsIT
[2019-04-10T15:43:09.277Z] [INFO] Tests run: 1, Failures: 0, Errors: 0, Skipped: 0, Time elapsed: 9.009 s - in org.apache.maven.surefire.its.jiras.Surefire674BuildFailingWhenErrorsIT
[2019-04-10T15:43:09.277Z] [INFO] Running org.apache.maven.surefire.its.jiras.Surefire674BuildFailingWhenFailsafeErrorsIT
[2019-04-10T15:43:25.071Z] [INFO] Tests run: 1, Failures: 0, Errors: 0, Skipped: 0, Time elapsed: 14.228 s - in org.apache.maven.surefire.its.jiras.Surefire674BuildFailingWhenFailsafeErrorsIT
[2019-04-10T15:43:25.071Z] [INFO] Running org.apache.maven.surefire.its.jiras.Surefire685CommaSeparatedIncludesIT
[2019-04-10T15:43:33.638Z] [INFO] Tests run: 1, Failures: 0, Errors: 0, Skipped: 0, Time elapsed: 8.796 s - in org.apache.maven.surefire.its.jiras.Surefire685CommaSeparatedIncludesIT
[2019-04-10T15:43:33.638Z] [INFO] Running org.apache.maven.surefire.its.jiras.Surefire697NiceSummaryIT
[2019-04-10T15:43:54.620Z] [INFO] Tests run: 1, Failures: 0, Errors: 0, Skipped: 0, Time elapsed: 10.135 s - in org.apache.maven.surefire.its.jiras.Surefire697NiceSummaryIT
[2019-04-10T15:43:54.620Z] [INFO] Running org.apache.maven.surefire.its.jiras.Surefire705ParallelForkTimeoutIT
[2019-04-10T15:43:54.620Z] [INFO] Tests run: 1, Failures: 0, Errors: 0, Skipped: 0, Time elapsed: 11.157 s - in org.apache.maven.surefire.its.jiras.Surefire705ParallelForkTimeoutIT
[2019-04-10T15:43:54.620Z] [INFO] Running org.apache.maven.surefire.its.jiras.Surefire733AllOverrridesCapturedIT
[2019-04-10T15:44:03.308Z] [INFO] Tests run: 1, Failures: 0, Errors: 0, Skipped: 0, Time elapsed: 8.243 s - in org.apache.maven.surefire.its.jiras.Surefire733AllOverrridesCapturedIT
[2019-04-10T15:44:03.308Z] [INFO] Running org.apache.maven.surefire.its.jiras.Surefire735ForkFailWithRedirectConsoleOutputIT
[2019-04-10T15:44:18.839Z] [INFO] Tests run: 2, Failures: 0, Errors: 0, Skipped: 0, Time elapsed: 15.084 s - in org.apache.maven.surefire.its.jiras.Surefire735ForkFailWithRedirectConsoleOutputIT
[2019-04-10T15:44:18.839Z] [INFO] Running org.apache.maven.surefire.its.jiras.Surefire740TruncatedCommaIT
[2019-04-10T15:44:25.984Z] [INFO] Tests run: 1, Failures: 0, Errors: 0, Skipped: 0, Time elapsed: 7.983 s - in org.apache.maven.surefire.its.jiras.Surefire740TruncatedCommaIT
[2019-04-10T15:44:25.984Z] [INFO] Running org.apache.maven.surefire.its.jiras.Surefire747MethodParallelWithSuiteCountIT
[2019-04-10T15:44:58.065Z] [INFO] Tests run: 2, Failures: 0, Errors: 0, Skipped: 0, Time elapsed: 29.421 s - in org.apache.maven.surefire.its.jiras.Surefire747MethodParallelWithSuiteCountIT
[2019-04-10T15:44:58.065Z] [INFO] Running org.apache.maven.surefire.its.jiras.Surefire772BothReportsIT
[2019-04-10T15:45:13.840Z] [INFO] Tests run: 3, Failures: 0, Errors: 0, Skipped: 0, Time elapsed: 17.598 s - in org.apache.maven.surefire.its.jiras.Surefire772BothReportsIT
[2019-04-10T15:45:13.840Z] [INFO] Running org.apache.maven.surefire.its.jiras.Surefire772NoFailsafeReportsIT
[2019-04-10T15:45:36.491Z] [INFO] Tests run: 4, Failures: 0, Errors: 0, Skipped: 0, Time elapsed: 24.088 s - in org.apache.maven.surefire.its.jiras.Surefire772NoFailsafeReportsIT
[2019-04-10T15:45:36.491Z] [INFO] Running org.apache.maven.surefire.its.jiras.Surefire772NoSurefireReportsIT
[2019-04-10T15:46:02.024Z] [INFO] Tests run: 4, Failures: 0, Errors: 0, Skipped: 0, Time elapsed: 24.39 s - in org.apache.maven.surefire.its.jiras.Surefire772NoSurefireReportsIT
[2019-04-10T15:46:02.024Z] [INFO] Running org.apache.maven.surefire.its.jiras.Surefire772SpecifiedReportsIT
[2019-04-10T15:46:20.415Z] [INFO] Tests run: 3, Failures: 0, Errors: 0, Skipped: 0, Time elapsed: 17.74 s - in org.apache.maven.surefire.its.jiras.Surefire772SpecifiedReportsIT
[2019-04-10T15:46:20.415Z] [INFO] Running org.apache.maven.surefire.its.jiras.Surefire801ForkModeNoneClassLoaderIT
[2019-04-10T15:46:26.107Z] [INFO] Tests run: 1, Failures: 0, Errors: 0, Skipped: 0, Time elapsed: 7.205 s - in org.apache.maven.surefire.its.jiras.Surefire801ForkModeNoneClassLoaderIT
[2019-04-10T15:46:26.107Z] [INFO] Running org.apache.maven.surefire.its.jiras.Surefire803MultiFailsafeExecsIT
[2019-04-10T15:47:04.306Z] [INFO] Tests run: 2, Failures: 0, Errors: 0, Skipped: 0, Time elapsed: 35.394 s - in org.apache.maven.surefire.its.jiras.Surefire803MultiFailsafeExecsIT
[2019-04-10T15:47:04.306Z] [INFO] Running org.apache.maven.surefire.its.jiras.Surefire806SpecifiedTestControlsIT
[2019-04-10T15:47:09.958Z] [WARNING] Tests run: 3, Failures: 0, Errors: 0, Skipped: 2, Time elapsed: 8.756 s - in org.apache.maven.surefire.its.jiras.Surefire806SpecifiedTestControlsIT
[2019-04-10T15:47:09.958Z] [INFO] Running org.apache.maven.surefire.its.jiras.Surefire809GroupExpressionsIT
[2019-04-10T15:48:05.064Z] [INFO] Tests run: 6, Failures: 0, Errors: 0, Skipped: 0, Time elapsed: 54.802 s - in org.apache.maven.surefire.its.jiras.Surefire809GroupExpressionsIT
[2019-04-10T15:48:05.064Z] [INFO] Running org.apache.maven.surefire.its.jiras.Surefire812Log4JClassLoaderIT
[2019-04-10T15:48:15.585Z] [INFO] Tests run: 1, Failures: 0, Errors: 0, Skipped: 0, Time elapsed: 10.712 s - in org.apache.maven.surefire.its.jiras.Surefire812Log4JClassLoaderIT
[2019-04-10T15:48:15.585Z] [INFO] Running org.apache.maven.surefire.its.jiras.Surefire817SystemExitIT
[2019-04-10T15:48:24.234Z] [INFO] Tests run: 1, Failures: 0, Errors: 0, Skipped: 0, Time elapsed: 8.835 s - in org.apache.maven.surefire.its.jiras.Surefire817SystemExitIT
[2019-04-10T15:48:24.234Z] [INFO] Running org.apache.maven.surefire.its.jiras.Surefire818NpeIgnoresTestsIT
[2019-04-10T15:48:37.052Z] [INFO] Tests run: 1, Failures: 0, Errors: 0, Skipped: 0, Time elapsed: 10.693 s - in org.apache.maven.surefire.its.jiras.Surefire818NpeIgnoresTestsIT
[2019-04-10T15:48:37.052Z] [INFO] Running org.apache.maven.surefire.its.jiras.Surefire828EmptyGroupExprIT
[2019-04-10T15:49:16.436Z] [INFO] Tests run: 4, Failures: 0, Errors: 0, Skipped: 0, Time elapsed: 38.16 s - in org.apache.maven.surefire.its.jiras.Surefire828EmptyGroupExprIT
[2019-04-10T15:49:16.436Z] [INFO] Running org.apache.maven.surefire.its.jiras.Surefire832ProviderSelectionIT
[2019-04-10T15:49:23.515Z] [INFO] Tests run: 1, Failures: 0, Errors: 0, Skipped: 0, Time elapsed: 9.555 s - in org.apache.maven.surefire.its.jiras.Surefire832ProviderSelectionIT
[2019-04-10T15:49:23.515Z] [INFO] Running org.apache.maven.surefire.its.jiras.Surefire839TestWithoutCategoriesIT
[2019-04-10T15:50:07.939Z] [INFO] Tests run: 2, Failures: 0, Errors: 0, Skipped: 0, Time elapsed: 19.795 s - in org.apache.maven.surefire.its.jiras.Surefire839TestWithoutCategoriesIT
[2019-04-10T15:50:07.939Z] [INFO] Running org.apache.maven.surefire.its.jiras.Surefire847AdditionalFailureIT
[2019-04-10T15:50:07.939Z] [INFO] Tests run: 1, Failures: 0, Errors: 0, Skipped: 0, Time elapsed: 10.6 s - in org.apache.maven.surefire.its.jiras.Surefire847AdditionalFailureIT
[2019-04-10T15:50:07.939Z] [INFO] Running org.apache.maven.surefire.its.jiras.Surefire855AllowFailsafeUseArtifactFileIT
[2019-04-10T15:51:22.666Z] [INFO] Tests run: 4, Failures: 0, Errors: 0, Skipped: 0, Time elapsed: 82.105 s - in org.apache.maven.surefire.its.jiras.Surefire855AllowFailsafeUseArtifactFileIT
[2019-04-10T15:51:22.666Z] [INFO] Running org.apache.maven.surefire.its.jiras.Surefire901MIssingResultfileWhenNoTestsIT
[2019-04-10T15:51:22.666Z] [INFO] Tests run: 1, Failures: 0, Errors: 0, Skipped: 0, Time elapsed: 7.302 s - in org.apache.maven.surefire.its.jiras.Surefire901MIssingResultfileWhenNoTestsIT
[2019-04-10T15:51:22.666Z] [INFO] Running org.apache.maven.surefire.its.jiras.Surefire907PerThreadWithoutThreadCountIT
[2019-04-10T15:51:29.905Z] [INFO] Tests run: 1, Failures: 0, Errors: 0, Skipped: 0, Time elapsed: 6.765 s - in org.apache.maven.surefire.its.jiras.Surefire907PerThreadWithoutThreadCountIT
[2019-04-10T15:51:29.905Z] [INFO] Running org.apache.maven.surefire.its.jiras.Surefire920TestFailureIgnoreWithTimeoutIT
[2019-04-10T15:51:58.444Z] [INFO] Tests run: 2, Failures: 0, Errors: 0, Skipped: 0, Time elapsed: 19.515 s - in org.apache.maven.surefire.its.jiras.Surefire920TestFailureIgnoreWithTimeoutIT
[2019-04-10T15:51:58.444Z] [INFO] Running org.apache.maven.surefire.its.jiras.Surefire926FailureWith2ProvidersIT
[2019-04-10T15:52:05.901Z] [INFO] Tests run: 1, Failures: 0, Errors: 0, Skipped: 0, Time elapsed: 15.902 s - in org.apache.maven.surefire.its.jiras.Surefire926FailureWith2ProvidersIT
[2019-04-10T15:52:05.901Z] [INFO] Running org.apache.maven.surefire.its.jiras.Surefire930TestNgSuiteXmlIT
[2019-04-10T15:52:19.174Z] [INFO] Tests run: 1, Failures: 0, Errors: 0, Skipped: 0, Time elapsed: 12.215 s - in org.apache.maven.surefire.its.jiras.Surefire930TestNgSuiteXmlIT
[2019-04-10T15:52:19.174Z] [INFO] Running org.apache.maven.surefire.its.jiras.Surefire943ReportContentIT
[2019-04-10T15:52:56.821Z] [INFO] Tests run: 2, Failures: 0, Errors: 0, Skipped: 0, Time elapsed: 38.359 s - in org.apache.maven.surefire.its.jiras.Surefire943ReportContentIT
[2019-04-10T15:52:56.821Z] [INFO] Running org.apache.maven.surefire.its.jiras.Surefire946KillMainProcessInReusableForkIT
[2019-04-10T15:53:26.783Z] [INFO] Tests run: 3, Failures: 0, Errors: 0, Skipped: 0, Time elapsed: 29.88 s - in org.apache.maven.surefire.its.jiras.Surefire946KillMainProcessInReusableForkIT
[2019-04-10T15:53:26.783Z] [INFO] Running org.apache.maven.surefire.its.jiras.Surefire972BizarreNoClassDefIT
[2019-04-10T15:54:02.692Z] [INFO] Tests run: 1, Failures: 0, Errors: 0, Skipped: 0, Time elapsed: 14.327 s - in org.apache.maven.surefire.its.jiras.Surefire972BizarreNoClassDefIT
[2019-04-10T15:54:02.692Z] [INFO] Running org.apache.maven.surefire.its.jiras.Surefire975DefaultVMEncodingIT
[2019-04-10T15:54:02.692Z] [INFO] Tests run: 1, Failures: 0, Errors: 0, Skipped: 0, Time elapsed: 9.967 s - in org.apache.maven.surefire.its.jiras.Surefire975DefaultVMEncodingIT
[2019-04-10T15:54:02.692Z] [INFO] Running org.apache.maven.surefire.its.jiras.Surefire979WrongClassLoaderIT
[2019-04-10T15:54:02.692Z] [INFO] Tests run: 1, Failures: 0, Errors: 0, Skipped: 0, Time elapsed: 8.645 s - in org.apache.maven.surefire.its.jiras.Surefire979WrongClassLoaderIT
[2019-04-10T15:54:02.692Z] [INFO] Running org.apache.maven.surefire.its.jiras.Surefire985ParameterizedRunnerAndCategoriesIT
[2019-04-10T15:54:06.920Z] [INFO] Tests run: 1, Failures: 0, Errors: 0, Skipped: 0, Time elapsed: 8.011 s - in org.apache.maven.surefire.its.jiras.Surefire985ParameterizedRunnerAndCategoriesIT
[2019-04-10T15:54:06.920Z] [INFO] Running org.apache.maven.surefire.its.jiras.Surefire995CategoryInheritanceIT
[2019-04-10T15:54:54.346Z] [INFO] Tests run: 5, Failures: 0, Errors: 0, Skipped: 0, Time elapsed: 37.084 s - in org.apache.maven.surefire.its.jiras.Surefire995CategoryInheritanceIT
[2019-04-10T15:54:54.346Z] [INFO]
[2019-04-10T15:54:54.346Z] [INFO] Results:
[2019-04-10T15:54:54.346Z] [INFO]
[2019-04-10T15:54:54.346Z] [WARNING] Tests run: 788, Failures: 0, Errors: 0, Skipped: 169
[2019-04-10T15:54:54.346Z] [INFO]
[2019-04-10T15:54:54.346Z] [INFO]
[2019-04-10T15:54:54.346Z] [INFO] --- maven-checkstyle-plugin:3.0.0:check (checkstyle-check) @ surefire-its ---
[2019-04-10T15:54:54.346Z] [INFO]
[2019-04-10T15:54:54.346Z] [INFO] --- maven-failsafe-plugin:3.0.0-M3:verify (default) @ surefire-its ---
[2019-04-10T15:54:54.346Z] [INFO] Failsafe report directory: C:\Users\jenkins\AppData\Local\Temp\2\jenkins-maven-box-maven-surefire-deployment-4\surefire-its\target\failsafe-reports
[2019-04-10T15:54:54.346Z] [INFO]
[2019-04-10T15:54:54.346Z] [INFO] --- maven-install-plugin:2.5.2:install (default-install) @ surefire-its ---
[2019-04-10T15:54:54.346Z] [INFO] Skipping artifact installation
[2019-04-10T15:54:54.346Z] [INFO] ------------------------------------------------------------------------
[2019-04-10T15:54:54.346Z] [INFO] Reactor Summary for Apache Maven Surefire 3.0.0-M4-SNAPSHOT:
[2019-04-10T15:54:54.346Z] [INFO]
[2019-04-10T15:54:54.346Z] [INFO] Apache Maven Surefire .............................. SUCCESS [01:23 min]
[2019-04-10T15:54:54.346Z] [INFO] SureFire Logger API ................................ SUCCESS [ 16.076 s]
[2019-04-10T15:54:54.346Z] [INFO] SureFire API ....................................... SUCCESS [ 24.934 s]
[2019-04-10T15:54:54.346Z] [INFO] SureFire Booter .................................... SUCCESS [ 25.997 s]
[2019-04-10T15:54:54.346Z] [INFO] Maven Surefire Test-Grouping Support ............... SUCCESS [ 16.094 s]
[2019-04-10T15:54:54.346Z] [INFO] SureFire Providers ................................. SUCCESS [ 1.811 s]
[2019-04-10T15:54:54.346Z] [INFO] Shared JUnit3 Provider Code ........................ SUCCESS [ 7.579 s]
[2019-04-10T15:54:54.346Z] [INFO] Shared Java 5 Provider Base ........................ SUCCESS [ 9.933 s]
[2019-04-10T15:54:54.346Z] [INFO] Shared JUnit4 Provider Code ........................ SUCCESS [ 9.738 s]
[2019-04-10T15:54:54.346Z] [INFO] Shared JUnit48 Provider Code ....................... SUCCESS [ 10.604 s]
[2019-04-10T15:54:54.346Z] [INFO] SureFire JUnit Runner .............................. SUCCESS [ 8.544 s]
[2019-04-10T15:54:54.346Z] [INFO] SureFire JUnit4 Runner ............................. SUCCESS [ 9.287 s]
[2019-04-10T15:54:54.346Z] [INFO] Maven Surefire Common .............................. SUCCESS [ 51.466 s]
[2019-04-10T15:54:54.346Z] [INFO] SureFire JUnitCore Runner .......................... SUCCESS [02:32 min]
[2019-04-10T15:54:54.346Z] [INFO] SureFire JUnit Platform Runner ..................... SUCCESS [ 19.545 s]
[2019-04-10T15:54:54.346Z] [INFO] SureFire TestNG Utils .............................. SUCCESS [ 8.613 s]
[2019-04-10T15:54:54.346Z] [INFO] SureFire TestNG Runner ............................. SUCCESS [ 9.643 s]
[2019-04-10T15:54:54.346Z] [INFO] ShadeFire JUnit3 Provider .......................... SUCCESS [ 5.338 s]
[2019-04-10T15:54:54.346Z] [INFO] Surefire Report Parser ............................. SUCCESS [ 12.334 s]
[2019-04-10T15:54:54.346Z] [INFO] Maven Surefire Plugin .............................. SUCCESS [ 24.634 s]
[2019-04-10T15:54:54.346Z] [INFO] Maven Failsafe Plugin .............................. SUCCESS [02:33 min]
[2019-04-10T15:54:54.346Z] [INFO] Maven Surefire Report Plugin ....................... SUCCESS [ 29.617 s]
[2019-04-10T15:54:54.346Z] [INFO] Maven Surefire Integration Tests ................... SUCCESS [ 01:46 h]
[2019-04-10T15:54:54.346Z] [INFO] ------------------------------------------------------------------------
[2019-04-10T15:54:54.346Z] [INFO] BUILD SUCCESS
[2019-04-10T15:54:54.346Z] [INFO] ------------------------------------------------------------------------
[2019-04-10T15:54:54.346Z] [INFO] Total time: 01:58 h
[2019-04-10T15:54:54.346Z] [INFO] Finished at: 2019-04-10T08:54:45-07:00
[2019-04-10T15:54:54.346Z] [INFO] ------------------------------------------------------------------------
[Pipeline] }
[Pipeline] // withEnv
[Pipeline] }
[Pipeline] // stage
[Pipeline] fileExists
[Pipeline] zip
[2019-04-10T15:54:57.109Z] Writing zip file of C:\Users\jenkins\AppData\Local\Temp\2\jenkins-maven-box-maven-surefire-deployment-4\maven-failsafe-plugin\target\it to C:\Users\jenkins\AppData\Local\Temp\2\jenkins-maven-box-maven-surefire-deployment-4\maven-failsafe-plugin--windows-jdk7-maven3.6.x.zip
[2019-04-10T15:54:57.272Z] Zipped 78 entries.
[2019-04-10T15:54:57.272Z] Archiving C:\Users\jenkins\AppData\Local\Temp\2\jenkins-maven-box-maven-surefire-deployment-4\maven-failsafe-plugin--windows-jdk7-maven3.6.x.zip
[2019-04-10T15:54:57.272Z] [Fast Archiver] No prior successful build to compare, so performing full copy of artifacts
[Pipeline] fileExists
[Pipeline] zip
[2019-04-10T15:54:57.408Z] Writing zip file of C:\Users\jenkins\AppData\Local\Temp\2\jenkins-maven-box-maven-surefire-deployment-4\surefire-its\target to C:\Users\jenkins\AppData\Local\Temp\2\jenkins-maven-box-maven-surefire-deployment-4\surefire-its--windows-jdk7-maven3.6.x.zip
[2019-04-10T15:55:15.247Z] Zipped 15823 entries.
[2019-04-10T15:55:15.247Z] Archiving C:\Users\jenkins\AppData\Local\Temp\2\jenkins-maven-box-maven-surefire-deployment-4\surefire-its--windows-jdk7-maven3.6.x.zip
[2019-04-10T15:55:15.247Z] [Fast Archiver] No prior successful build to compare, so performing full copy of artifacts
[Pipeline] archiveArtifacts
[2019-04-10T15:55:17.105Z] Archiving artifacts
[2019-04-10T15:55:17.173Z] [Fast Archiver] No prior successful build to compare, so performing full copy of artifacts
[Pipeline] cleanWs
[2019-04-10T15:55:19.634Z] [WS-CLEANUP] Deleting project workspace...
[2019-04-10T15:55:19.634Z] [WS-CLEANUP] Deferred wipeout is used...
[2019-04-10T15:55:19.765Z] [WS-CLEANUP] done
[Pipeline] }
[Pipeline] // ws
[Pipeline] }
[Pipeline] // timestamps
[Pipeline] }
[Pipeline] // node
[Pipeline] }
[Pipeline] // parallel
[Pipeline] echo
Build result: FAILURE
[Pipeline] jiraIssueSelector
[Pipeline] emailext